<svg width="9" height="14" viewBox="0 0 9 14" fill="none" xmlns="http://www.w3.org/2000/svg">
<path d="M8.70581 7.72678C9.09806 7.33333 9.09806 6.6776 8.70581 6.24044L2.77845 0.295082C2.34261 -0.0983607 1.68886 -0.0983607 1.29661 0.295082L0.294189 1.30055C-0.098063 1.7377 -0.098063 2.39344 0.294189 2.78689L4.52179 7.02732L0.294189 11.224C-0.098063 11.6175 -0.098063 12.2732 0.294189 12.7104L1.29661 13.6721C1.68886 14.1093 2.34261 14.1093 2.77845 13.6721L8.70581 7.72678Z" fill="currentColor"/>
</svg>
