<svg viewBox="0 0 512 512" xmlns="http://www.w3.org/2000/svg">
    <path d="m256 0c-141.164062 0-256 114.835938-256 256s114.835938 256 256 256 256-114.835938 256-256-114.835938-256-256-256zm0 0" fill="transparent"/>
    <path d="m256 512c-141.164062 0-256-114.835938-256-256s114.835938-256 256-256 256 114.835938 256 256-114.835938 256-256 256zm0-480c-123.519531 0-224 100.480469-224 224s100.480469 224 224 224 224-100.480469 224-224-100.480469-224-224-224zm0 0" fill="currentColor"/>
    <path d="m176.8125 351.210938c-4.097656 0-8.195312-1.558594-11.308594-4.695313-6.25-6.25-6.25-16.382813 0-22.632813l158.398438-158.398437c6.253906-6.253906 16.386718-6.253906 22.636718 0 6.25 6.25 6.25 16.382813 0 22.632813l-158.402343 158.398437c-3.15625 3.136719-7.25 4.695313-11.324219 4.695313zm0 0" fill="currentColor"/>
    <path d="m335.1875 351.210938c-4.09375 0-8.191406-1.558594-11.304688-4.695313l-158.398437-158.398437c-6.253906-6.25-6.253906-16.382813 0-22.632813 6.25-6.253906 16.382813-6.253906 22.632813 0l158.398437 158.398437c6.253906 6.25 6.253906 16.382813 0 22.632813-3.132813 3.136719-7.230469 4.695313-11.328125 4.695313zm0 0" fill="currentColor"/>
</svg>
