<svg width="21" height="21" viewBox="0 0 21 21" fill="none" xmlns="http://www.w3.org/2000/svg">
<path d="M8.47917 13.1593H0.65332V8.73075H8.47917V0.844238H12.9078V8.73075H20.7336V13.1593H12.9078V20.9447H8.47917V13.1593Z" fill="currentColor"/>
</svg>
