<svg width="22" height="21" viewBox="0 0 22 21" fill="none" xmlns="http://www.w3.org/2000/svg">
<path d="M9.21826 3.9375L9.87451 2.625L11.187 1.96875L9.87451 1.3125L9.21826 0L8.56201 1.3125L7.24951 1.96875L8.56201 2.625L9.21826 3.9375ZM3.31201 6.5625L4.37842 4.38867L6.59326 3.28125L4.37842 2.21484L3.31201 0L2.20459 2.21484L0.0307617 3.28125L2.20459 4.38867L3.31201 6.5625ZM17.7495 11.8125L16.6421 14.0273L14.4683 15.0938L16.6421 16.2012L17.7495 18.375L18.8159 16.2012L21.0308 15.0938L18.8159 14.0273L17.7495 11.8125ZM20.6206 3.89648L17.1343 0.410156C16.8882 0.164062 16.5601 0 16.2319 0C15.8628 0 15.5347 0.164062 15.2886 0.410156L0.399902 15.2988C-0.133301 15.832 -0.133301 16.6523 0.399902 17.1445L3.88623 20.6309C4.13232 20.877 4.46045 21 4.78857 21C5.15771 21 5.48584 20.877 5.73193 20.6309L20.6206 5.74219C21.1538 5.20898 21.1538 4.38867 20.6206 3.89648ZM14.7554 8.36719L12.6636 6.27539L16.2319 2.70703L18.3237 4.79883L14.7554 8.36719Z" fill="currentColor"/>
</svg>
