<svg width="14" height="7" viewBox="0 0 14 7" fill="none" xmlns="http://www.w3.org/2000/svg">
<path d="M1.08177 0C0.294268 0 -0.0994816 0.902344 0.469268 1.43555L6.06927 6.68555C6.41927 7.01367 6.98802 7.01367 7.33802 6.68555L12.938 1.43555C13.5068 0.902344 13.113 0 12.3255 0H1.08177Z" fill="black"/>
</svg>
