<svg width="21" height="21" viewBox="0 0 21 21" fill="none" xmlns="http://www.w3.org/2000/svg">
<path d="M10.5 0C4.6996 0 0 4.6996 0 10.5C0 16.3004 4.6996 21 10.5 21C16.3004 21 21 16.3004 21 10.5C21 4.6996 16.3004 0 10.5 0ZM5.58871 12.3629C5.29234 12.3629 5.08065 12.1512 5.08065 11.8548V9.14516C5.08065 8.89113 5.29234 8.6371 5.58871 8.6371H10.5V5.67339C10.5 5.20766 11.0081 4.95363 11.3468 5.29234L16.1734 10.1613C16.3851 10.373 16.3851 10.6694 16.1734 10.881L11.3468 15.75C11.0504 16.0464 10.5 15.8347 10.5 15.369V12.3629H5.58871Z" fill="currentColor"/>
</svg>
