{
    "name": "TMUtilsEcs",
    "rootNamespace": "TMUtilsEcs",
    "references": [
        "Unity.Entities",
        "Unity.Collections",
        "Unity.Mathematics",
        "Unity.Entities.Hybrid",
        "Unity.Transforms",
        "Unity.Transforms.Hybrid",
        "Unity.TextMeshPro",
        "UnityEditor.TestRunner",
        "TMUtils"
    ],
    "includePlatforms": [],
    "excludePlatforms": [],
    "allowUnsafeCode": true,
    "overrideReferences": true,
    "precompiledReferences": [
        "Microsoft.VisualBasic.dll",
        "System.Runtime.CompilerServices.Unsafe.dll",
        "Newtonsoft.Json.dll"
    ],
    "autoReferenced": false,
    "defineConstraints": [],
    "versionDefines": [],
    "noEngineReferences": false
}