{ "compressionlevel":0,
 "editorsettings":
    {
     "export":
        {
         "format":"json",
         "target":"battle_draft.json"
        }
    },
 "height":7,
 "hexsidelength":0,
 "infinite":false,
 "layers":[
        {
         "data":[1, 1, 1, 3, 1, 1, 1, 1, 1, 0, 1, 1, 1, 1, 0, 0, 1, 1, 1, 1, 1, 1, 0, 1, 1, 1, 1, 1, 1, 1, 1, 1, 1, 1, 1, 1, 1, 1, 1, 2, 1, 1],
         "height":7,
         "id":1,
         "name":"Tile Layer 1",
         "opacity":1,
         "type":"tilelayer",
         "visible":true,
         "width":6,
         "x":0,
         "y":0
        }],
 "nextlayerid":2,
 "nextobjectid":1,
 "orientation":"hexagonal",
 "renderorder":"right-up",
 "staggeraxis":"x",
 "staggerindex":"odd",
 "tiledversion":"1.4.1",
 "tileheight":54,
 "tilesets":[
        {
         "firstgid":1,
         "source":"..\/..\/Content\/Data\/Map\/hex_map.tsx"
        }],
 "tilewidth":81,
 "type":"map",
 "version":1.4,
 "width":6
}