{
  "definitions": {},
  "$schema": "http://json-schema.org/draft-07/schema#",
  "$id": "https://example.com/object1610739816.json",
  "title": "Root",
  "type": "object",
  "required": [
    "id",
    "workflow_id",
    "list_id",
    "email_address",
    "_links"
  ],
  "properties": {
    "id": {
      "$id": "#root/id",
      "title": "Id",
      "type": "string",
      "default": "",
      "examples": [
        "string"
      ],
      "pattern": "^.*$"
    },
    "workflow_id": {
      "$id": "#root/workflow_id",
      "title": "Workflow_id",
      "type": "string",
      "default": "",
      "examples": [
        "string"
      ],
      "pattern": "^.*$"
    },
    "list_id": {
      "$id": "#root/list_id",
      "title": "List_id",
      "type": "string",
      "default": "",
      "examples": [
        "string"
      ],
      "pattern": "^.*$"
    },
    "email_address": {
      "$id": "#root/email_address",
      "title": "Email_address",
      "type": "string",
      "default": "",
      "examples": [
        "string"
      ],
      "pattern": "^.*$"
    },
    "_links": {
      "$id": "#root/_links",
      "title": "_links",
      "type": "array",
      "default": [],
      "items":{
        "$id": "#root/_links/items",
        "title": "Items",
        "type": "object",
        "required": [
          "rel",
          "href",
          "method",
          "targetSchema",
          "schema"
        ],
        "properties": {
          "rel": {
            "$id": "#root/_links/items/rel",
            "title": "Rel",
            "type": "string",
            "default": "",
            "examples": [
              "string"
            ],
            "pattern": "^.*$"
          },
          "href": {
            "$id": "#root/_links/items/href",
            "title": "Href",
            "type": "string",
            "default": "",
            "examples": [
              "string"
            ],
            "pattern": "^.*$"
          },
          "method": {
            "$id": "#root/_links/items/method",
            "title": "Method",
            "type": "string",
            "default": "",
            "examples": [
              "GET"
            ],
            "pattern": "^.*$"
          },
          "targetSchema": {
            "$id": "#root/_links/items/targetSchema",
            "title": "Targetschema",
            "type": "string",
            "default": "",
            "examples": [
              "string"
            ],
            "pattern": "^.*$"
          },
          "schema": {
            "$id": "#root/_links/items/schema",
            "title": "Schema",
            "type": "string",
            "default": "",
            "examples": [
              "string"
            ],
            "pattern": "^.*$"
          }
        }
      }

    }
  }
}
