{
  "definitions": {},
  "$schema": "http://json-schema.org/draft-07/schema#",
  "$id": "https://example.com/object1610722244.json",
  "title": "Root",
  "type": "object",
  "required": [
    "destination_addresses",
    "origin_addresses",
    "rows",
    "status"
  ],
  "properties": {
    "destination_addresses": {
      "$id": "#root/destination_addresses",
      "title": "Destination_addresses",
      "type": "array",
      "default": [],
      "items":{
        "$id": "#root/destination_addresses/items",
        "title": "Items",
        "type": "string",
        "default": "",
        "examples": [
          "San Francisco, Californie, États-Unis"
        ],
        "pattern": "^.*$"
      }
    },
    "origin_addresses": {
      "$id": "#root/origin_addresses",
      "title": "Origin_addresses",
      "type": "array",
      "default": [],
      "items":{
        "$id": "#root/origin_addresses/items",
        "title": "Items",
        "type": "string",
        "default": "",
        "examples": [
          "Vancouver, BC, Canada"
        ],
        "pattern": "^.*$"
      }
    },
    "rows": {
      "$id": "#root/rows",
      "title": "Rows",
      "type": "array",
      "default": [],
      "items":{
        "$id": "#root/rows/items",
        "title": "Items",
        "type": "object",
        "required": [
          "elements"
        ],
        "properties": {
          "elements": {
            "$id": "#root/rows/items/elements",
            "title": "Elements",
            "type": "array",
            "default": [],
            "items":{
              "$id": "#root/rows/items/elements/items",
              "title": "Items",
              "type": "object",
              "required": [
                "distance",
                "duration",
                "status"
              ],
              "properties": {
                "distance": {
                  "$id": "#root/rows/items/elements/items/distance",
                  "title": "Distance",
                  "type": "object",
                  "required": [
                    "text",
                    "value"
                  ],
                  "properties": {
                    "text": {
                      "$id": "#root/rows/items/elements/items/distance/text",
                      "title": "Text",
                      "type": "string",
                      "default": "",
                      "examples": [
                        "1 725 km"
                      ],
                      "pattern": "^.*$"
                    },
                    "value": {
                      "$id": "#root/rows/items/elements/items/distance/value",
                      "title": "Value",
                      "type": "integer",
                      "examples": [
                        1725390
                      ],
                      "default": 0
                    }
                  }
                }
              ,
                "duration": {
                  "$id": "#root/rows/items/elements/items/duration",
                  "title": "Duration",
                  "type": "object",
                  "required": [
                    "text",
                    "value"
                  ],
                  "properties": {
                    "text": {
                      "$id": "#root/rows/items/elements/items/duration/text",
                      "title": "Text",
                      "type": "string",
                      "default": "",
                      "examples": [
                        "3 jours 21 heures"
                      ],
                      "pattern": "^.*$"
                    },
                    "value": {
                      "$id": "#root/rows/items/elements/items/duration/value",
                      "title": "Value",
                      "type": "integer",
                      "examples": [
                        335812
                      ],
                      "default": 0
                    }
                  }
                }
              ,
                "status": {
                  "$id": "#root/rows/items/elements/items/status",
                  "title": "Status",
                  "type": "string",
                  "default": "",
                  "examples": [
                    "OK"
                  ],
                  "pattern": "^.*$"
                }
              }
            }

          }
        }
      }

    },
    "status": {
      "$id": "#root/status",
      "title": "Status",
      "type": "string",
      "default": "",
      "examples": [
        "OK"
      ],
      "pattern": "^.*$"
    }
  }
}
