/home/rodrigo/eclipse-workspace/article/src/main/java/com/ksquaregroup/project/Item.java
/home/rodrigo/eclipse-workspace/article/src/main/java/com/ksquaregroup/project/MyBenchmark.java
/home/rodrigo/eclipse-workspace/article/src/main/java/com/ksquaregroup/project/ProcessUtils.java
