^D:\DEV\C++\HELLO-CPP\TUTORIALSPOINT\BASIC1\BASIC1\DEBUG\HELLO.OBJ
/OUT:"D:\DEV\C++\HELLO-CPP\TUTORIALSPOINT\BASIC1\DEBUG\BASIC1.EXE" /INCREMENTAL /NOLOGO KERNEL32.LIB USER32.LIB GDI32.LIB WINSPOOL.LIB COMDLG32.LIB ADVAPI32.LIB SHELL32.LIB OLE32.LIB OLEAUT32.LIB UUID.LIB ODBC32.LIB ODBCCP32.LIB /MANIFEST /MANIFESTUAC:"level='asInvoker' uiAccess='false'" /manifest:embed /DEBUG:FASTLINK /PDB:"D:\DEV\C++\HELLO-CPP\TUTORIALSPOINT\BASIC1\DEBUG\BASIC1.PDB" /TLBID:1 /DYNAMICBASE /NXCOMPAT /IMPLIB:"D:\DEV\C++\HELLO-CPP\TUTORIALSPOINT\BASIC1\DEBUG\BASIC1.LIB" /MACHINE:X86 DEBUG\HELLO.OBJ
^D:\DEV\C++\HELLO-CPP\TUTORIALSPOINT\BASIC1\BASIC1\DEBUG\HELLO.OBJ|D:\DEV\C++\HELLO-CPP\TUTORIALSPOINT\BASIC1\BASIC1\DEBUG\SECOND.OBJ
/OUT:"D:\DEV\C++\HELLO-CPP\TUTORIALSPOINT\BASIC1\DEBUG\BASIC1.EXE" /INCREMENTAL /NOLOGO KERNEL32.LIB USER32.LIB GDI32.LIB WINSPOOL.LIB COMDLG32.LIB ADVAPI32.LIB SHELL32.LIB OLE32.LIB OLEAUT32.LIB UUID.LIB ODBC32.LIB ODBCCP32.LIB /MANIFEST /MANIFESTUAC:"level='asInvoker' uiAccess='false'" /manifest:embed /DEBUG:FASTLINK /PDB:"D:\DEV\C++\HELLO-CPP\TUTORIALSPOINT\BASIC1\DEBUG\BASIC1.PDB" /TLBID:1 /DYNAMICBASE /NXCOMPAT /IMPLIB:"D:\DEV\C++\HELLO-CPP\TUTORIALSPOINT\BASIC1\DEBUG\BASIC1.LIB" /MACHINE:X86 DEBUG\HELLO.OBJDEBUG\SECOND.OBJ
