^D:\DEV\C++\HELLO-CPP\TUTORIALSPOINT\BASIC1\BASIC1\DEBUG\HELLO.OBJ|D:\DEV\C++\HELLO-CPP\TUTORIALSPOINT\BASIC1\BASIC1\DEBUG\SECOND.OBJ
D:\DEV\C++\HELLO-CPP\TUTORIALSPOINT\BASIC1\DEBUG\BASIC1.EXE
D:\DEV\C++\HELLO-CPP\TUTORIALSPOINT\BASIC1\DEBUG\BASIC1.ILK
D:\DEV\C++\HELLO-CPP\TUTORIALSPOINT\BASIC1\DEBUG\BASIC1.PDB
