digraph G {
    graph [margin = 0, pad = 0]
    rankdir = RL
    style = invis

    subgraph cluster_0 {
    node [style = filled, color = lightblue]; d
    node [color = turquoise]; c
    node [color = lightgreen]; b
    node [color = lightpink]; a
    node [color = brown, style = solid, shape = rectangle]; "branch\n'main'"

    edge [color = lightblue]; d -> c
    edge [color = turquoise]; c -> b
    edge [color = lightgreen]; b -> a
    edge [color = brown]; "branch\n'main'" -> d
    }

}
