digraph G {
    graph [margin = 0, pad = 0]
    rankdir = RL
    style = invis

    subgraph cluster_0 {
    node [style = filled, color = lightpink]; g f e
    node [color = lightgreen]; d
    node [color = lightgreen]; c
    node [color = "lightgreen:lightpink"]; b
    node [color = "lightgreen:lightpink"]; a

    edge [color = lightgreen]
    d -> c
    c -> b

    edge [color = "lightgreen;0.5:lightpink"]
    b -> a

    edge [color = lightpink]
    g -> f -> e -> b

    edge [color = lightgrey]
    node [color = lightgrey]
    "e'" -> d

    node [color = lightgreen, style = solid, shape = rectangle]; "branch\n'main'"
    node [color = lightpink, style = solid, shape = rectangle]; "branch\n'new-feature'"
    edge [color = lightgreen]; "branch\n'main'" -> d
    edge [color = lightpink]; "branch\n'new-feature'" -> g


    }

}
