digraph G {
    graph [margin = 0, pad = 0]
    rankdir = RL
    style = invis

    subgraph cluster_0 {
    node [style = filled]
    node [color = maroon1]; g
    node [color = olivedrab2]; f
    node [color = coral]; e

    node [color = lightblue]; d
    node [color = turquoise]; c
    node [color = lightgreen]; b
    node [color = lightpink]; a

    edge [color = maroon1]; g -> f
    edge [color = olivedrab2]; f -> e
    edge [color = coral]; e -> b

    edge [color = lightblue]; d -> c
    edge [color = turquoise]; c -> b
    edge [color = lightgreen]; b -> a

    }

}
