digraph G {
    graph [margin = 0, pad = 0]
    rankdir = RL
    style = invis

    subgraph cluster_0 {
    node [style = filled, color = lightpink]; g f e
    node [color = lightgreen]; d
    node [color = lightgreen]; c
    node [color = "lightgreen:lightpink"]; b
    node [color = "lightgreen:lightpink"]; a

    edge [color = lightgreen]
    d -> c
    c -> b

    edge [color = "lightgreen;0.5:lightpink"]
    b -> a

    edge [color = lightpink]
    g -> f -> e -> b

    node [color = lightgreen, style = solid, shape = rectangle]; "branch\n'main'"
    node [color = lightpink, style = solid, shape = rectangle]; "branch\n'new-feature'"
    edge [color = lightpink]; "branch\n'new-feature'" -> g

    edge [color = lightgreen]
    node [color = lightgreen, style = filled shape = ""]
    h -> d
    h -> g
    "branch\n'main'" -> h
    edge [color = "lightgreen;0.5:lightpink"]

    { rank = same d; f }

    }

}
