[
  {
    "course_id": "34001010",
    "head": "laborum nulla",
    "content": "eiusmod exercitation dolor irure aliqua",
    "thumbnail": "eiusmod exercitation dolor irure aliqua",
    "user_id": "1953175",
    "timestamp": {
      "$numberLong": "1652190479000"
    },
    "reply_stamp": {
      "$numberLong": "1652190493000"
    },
    "reply_cnt": 2,
    "liked": [
      "1953176"
    ],
    "sticked": false,
    "image_list": []
  },
  {
    "course_id": "34001010",
    "head": "nulla",
    "content": "reprehenderit pariatur sunt",
    "thumbnail": "reprehenderit pariatur sunt",
    "user_id": "1953175",
    "timestamp": {
      "$numberLong": "1652190488000"
    },
    "reply_stamp": {
      "$numberLong": "1652190488000"
    },
    "reply_cnt": 1,
    "liked": [],
    "sticked": false
  },
  {
    "course_id": "34001010",
    "head": "veniam est reprehenderit",
    "content": "consequat",
    "thumbnail": "consequat",
    "user_id": "1953175",
    "timestamp": {
      "$numberLong": "1652190493000"
    },
    "reply_stamp": {
      "$numberLong": "1652190479000"
    },
    "reply_cnt": 1,
    "liked": [],
    "sticked": false,
    "image_list": []
  },
  {
    "course_id": "34001011",
    "head": "in ea id voluptate",
    "content": "mollit enim sunt dolor",
    "thumbnail": "mollit enim sunt dolor",
    "user_id": "1953175",
    "timestamp": {
      "$numberLong": "1652190500000"
    },
    "reply_stamp": {
      "$numberLong": "1652190500000"
    },
    "reply_cnt": 1,
    "liked": [],
    "sticked": false,
    "image_list": []
  },
  {
    "course_id": "34001011",
    "head": "ad",
    "content": "ex nisi amet",
    "thumbnail": "ex nisi amet",
    "user_id": "1953175",
    "timestamp": {
      "$numberLong": "1652190519000"
    },
    "reply_stamp": {
      "$numberLong": "1652190519000"
    },
    "reply_cnt": 1,
    "liked": [],
    "sticked": false,
    "image_list": []
  },
  {
    "course_id": "34001012",
    "head": "tempor ipsum amet",
    "content": "voluptate laboris ex Duis",
    "thumbnail": "voluptate laboris ex Duis",
    "user_id": "1953175",
    "timestamp": {
      "$numberLong": "1652190526000"
    },
    "reply_stamp": {
      "$numberLong": "1652190526000"
    },
    "reply_cnt": 1,
    "liked": [],
    "sticked": false,
    "image_list": []
  },
  {
    "course_id": "34001012",
    "head": "ex do veniam eiusmod",
    "content": "esse et dolor",
    "thumbnail": "esse et dolor",
    "user_id": "1953175",
    "timestamp": {
      "$numberLong": "1652190533000"
    },
    "reply_stamp": {
      "$numberLong": "1652190533000"
    },
    "reply_cnt": 1,
    "liked": [],
    "sticked": false,
    "image_list": []
  }
]