{"_id": "13011901", "name": "中级听和说(1)", "day":"1","period":"3","length":"2","teacher": "刘根洪", "tid": "98056", "place": "四平路校区", "type": "专业基础课", "language": "中文", "department": "国际文化交流学院"}
{"_id": "13013501", "name": "高级汉语(1)", "day":"1","period":"5","length":"2","teacher": "娄晓凯", "tid": "11118", "place": "四平路校区", "type": "专业基础课", "language": "中文", "department": "国际文化交流学院"}
{"_id": "13014401", "name": "汉字概述", "day":"2","period":"3","length":"2","teacher": "李萍", "tid": "02005", "place": "四平路校区", "type": "专业必修课", "language": "中文", "department": "国际文化交流学院"}
{"_id": "13014501", "name": "教育心理学概论", "day":"2","period":"10","length":"2","teacher": "", "tid": "", "place": "四平路校区", "type": "专业选修课", "language": "中文", "department": "国际文化交流学院"}
{"_id": "13014801", "name": "《中国古代文学》", "day":"3","period":"1","length":"2","teacher": "", "tid": "", "place": "四平路校区", "type": "专业选修课", "language": "中文", "department": "国际文化交流学院"}
{"_id": "13015001", "name": "当代话题", "day":"3","period":"5","length":"2","teacher": "叶澜", "tid": "07173", "place": "四平路校区", "type": "专业选修课", "language": "中文", "department": "国际文化交流学院"}
{"_id": "13015501", "name": "中国概况（汉语言）", "day":"3","period":"10","length":"3","teacher": "张占山,宗骞", "tid": "06101,16152", "place": "四平路校区", "type": "通识必修课", "language": "中文", "department": "国际文化交流学院"}
{"_id": "13016801", "name": "经贸口语(1)", "day":"4","period":"5","length":"2","teacher": "刘根洪", "tid": "98056", "place": "四平路校区", "type": "专业必修课", "language": "中文", "department": "国际文化交流学院"}
{"_id": "13016901", "name": "HSK应试辅导", "day":"4","period":"7","length":"2","teacher": "张占山", "tid": "06101", "place": "四平路校区", "type": "实践环节", "language": "中文", "department": "国际文化交流学院"}
{"_id": "13017501", "name": "视听说强化训练(2)", "day":"5","period":"3","length":"2","teacher": "刘运同", "tid": "00063", "place": "四平路校区", "type": "实践环节", "language": "中文", "department": "国际文化交流学院"}