[
  {
    "course_id": "34001010",
    "msg": "laborum nulla",
    "courseTitle": "C语言程序设计",
    "courseTime": "1-17周；周三5-6",
    "credit": "3",
    "teacher": "朱宏明",
    "assessment": "考试",
    "labels": [
    { "text": 123 },
    { "text": 456 }
    ],
    "teacher_message": "面向软件工程专业的C语言程序设计课程，课程主要介绍C语言基本数据类型，运算符，控制语句，数组，指针，结构体，公用体，文件等，并从计算机组成、编译原理等角度对程序设计语言进行深入分析。通过本课程的学习，可以掌握程序设计的基本思想，了解程序员的思维方式，同时培养对程序设计的热情。",
    "course_intro": "近年来，针对国内相关课程中很多都是以讲述语言语法为主，语言设计和面向过程程序设计技术实现底层机制的内容涉及较少的情况，本课程采用了语言和底层机制并重的原则，一方面通过讲解语言特性，为底层实现机制做铺垫，另一方面又通过底层实现来巩固和加深对语言设计的理解，两者相辅相成。这对于培养学生的创新能力也有较大的作用。借助在线课程和自建的在线评测和博弈系统来调动学生的学习积极性。通过平时课程和在线练习细致地解析教学内容，把抽象、枯燥的语言特定和演化转变为形象生动的练习；通过在线博弈平台鼓励学生拓展自己的知识面，促进学习积极性和主动性。这样的平台组合不仅使本课程抽象、难懂的教学内容变得有趣和可理解，而且大大提高了教学效率和教学效果。",
    "outline": [
      {
        "title": "基本数据类型",
        "content": "理解基本数据类型的概念，了解数据长度和编码及解码。"
      }, 
      {
        "title": "基本运算符",
        "content": "理解基本运算符及其使用注意点"
      }, 
      {
        "title": "基本控制语句",
        "content": "理解基本控制语句及其适用场景"
      }, 
      {
        "title": "IDE和代码调试",
        "content": "理解IDE的概念及相关文件，了解如何进行代码调试"
      }, 
      {
        "title": "数组",
        "content": "了解数组基本概念及其使用注意点"
      }, 
      {
        "title": "函数和算法",
        "content": "理解函数的基本概念，理解函数调用的过程，理解递归"
      }, 
      {
        "title": "指针和动态内存管理",
        "content": "理解指针及其使用注意点，理解动态内存分配"
      }, 
      {
        "title": "结构体及其应用",
        "content": "理解结构体的基本概念及其内存分配"
      }, 
      {
        "title": "文件处理",
        "content": "理解文件及其应用"
      }
    ]
  },
  {
    "course_id": "34001011",
    "msg": "lvdfvsdvs",
    "courseTitle": "呼吸病学",
    "courseTime": "1-12周；周一3-4",
    "credit": "2",
    "teacher": "徐金富",
    "assessment": "考试",
    "labels": [
      { "text": 123 },
      { "text": 456 }
      ],
    "teacher_message": "老师的话",
    "course_intro": "本课程授课对象为临床医学专业第三学年的医学生。本课程主要内容为内科学中的呼吸系统疾病，通过理论和实践课程的学习来提高对呼吸系统各种疾病的认识和掌握，旨在培养全面的临床医学人才。本课程的目的在于使学生了解呼吸系统的解剖生理特点；掌握呼吸系统常见病的病理解剖学；掌握呼吸系统疾病的诊断和治疗方法；了解呼吸系统疾病防治进展和发展趋势。通过该课程的学习，使学生对呼吸系统疾病理解更为透彻，掌握的更为牢固，并且能更迅捷地应用到实际工作中去。通过本课程应使学生具有医学人文精神，学会交叉学科之间知识的融会贯通，课程内容相互融合与渗透。",
    "outline": [
      {
        "title": "总论",
        "content": "总论"
      },
      {
        "title": "慢性阻塞性肺病",
        "content": "慢性阻塞性肺病 1234"
      },
      {
        "title": "支气管哮喘",
        "content": "支气管哮喘 上下"
      },
      {
        "title": "支气管扩张症",
        "content": "支气管扩张症 上下"
      },
      {
        "title": "肺炎",
        "content": "肺炎 上中下"
      },
      {
        "title": "肺癌",
        "content": "肺癌 上下"
      },
      {
        "title": "肺结核",
        "content": "肺结核 上下"
      },
      {
        "title": "间质性肺疾病",
        "content": "弥漫性间质性肺疾病，特发性肺纤维化"
      },
      {
        "title": "肺血栓栓塞症",
        "content": "肺血栓栓塞症 上下"
      },
      {
        "title": "慢性咳嗽",
        "content": "常见原因与诊断思路"
      },
      {
        "title": "急性呼吸窘迫综合征和呼吸衰竭",
        "content": "急性呼吸窘迫综合征，呼吸衰竭"
      }
    ]
  },
  {
    "course_id": "34001012",
    "msg": "lvdfvsdvs",
    "courseTitle": "铺面工程",
    "courseTime": "1-19周；周二3-4，周四7-8",
    "credit": "4",
    "teacher": "孙立军，刘黎萍，严宇",
    "assessment": "考试",
    "labels": [
      { "text": 123 },
      { "text": 456 }
      ],
    "teacher_message": "《铺面工程》是道路工程专业的一门主干专业必修课，包括铺面的荷载作用分析、环境影响分析、铺面材料特性及测试方法、铺面受力分析与结构设计、铺面使用性能、施工、养护和管理等多方面内容，是一门理论和实践结合较强的课程。该课程是上海市精品课程，由孙立军教授主讲，并配有优秀的教学团队，教学和科研经验积累深厚。",
    "course_intro": "铺面工程在道路、机场、港口等基础设施建设中具有重要的地位。如何进行铺面结构的设计、建造、评价和管养，需要通过系统的学习和训练。本门课程以道路路面为重点，兼顾机场和港口铺面，对铺面的定义、交通荷载分析、环境温度与湿度状况及预估、铺面材料的工程性能、铺面结构的力学模型及性能、铺面的使用性能、铺面结构厚度设计方法、铺面使用状况评价和养护维修设计等内容进行讲解。课程采用线上视频、讨论、作业和考试等方式进行组织和学习，以确保教学质量。通过本课程的学习，将帮助同学掌握铺面工程的主要知识点，能进行基本的铺面结构设计，并了解铺面性能的评价和养护维修设计流程。",
    "outline": [
      {
        "title": "引论",
        "content": "本章重点讲述铺面结构、铺面工程的定义、铺面的类型、结构组成、性能要求和复杂性，鼓励课后对铺面历史和前沿的文献阅读。要求同学掌握铺面的定义、组成和主要技术特点。"
      },
      {
        "title": "车辆荷载",
        "content": "掌握车辆荷载的分类方法、静力模式和动态响应，学会分析不同轴-轮构型对路面结构的综合影响，并面向铺面设计和评价，掌握交通分析方法。"
      },
      {
        "title": "路面温度场与湿度场",
        "content": "了解土基和路面结构在外界环境作用下的温度和湿度场，掌握路面结构温度变化规律和预测方法，以及引起路基湿度变化的影响因素等。"
      },
      {
        "title": "路基的本构关系",
        "content": "通过学习，掌握土的应力-应变关系，重复荷载作用下路基的变形累积特征，理解路基的荷载-弯沉关系，并了解不同路基模量的各类测定方法。"
      },
      {
        "title": "路面材料的工程性能",
        "content": "掌握各类路面材料的组成特点、强度来源、工程性质及其同路面结构设计相关的两方面力学性质，即变形性能（包括应力-应变关系和变形积累）和强度性能（包括抗剪强度、抗拉强度、抗弯强度和疲劳强度），以及表征这些性能的指标和测定方法。"
      },
      {
        "title": "沥青铺面结构的力学性能",
        "content": "理解弹性多层结构轴对称模型及其理论解，包括两层、三层路面结构以及多层结构的换算方法，掌握路面结构内的应力状况及对其产生重要影响的主要因素。"
      },
      {
        "title": "沥青路面的使用性能",
        "content": "熟悉沥青路面常见病害的产生机理、评价及治理方法，掌握路面损坏状态的表征方法、衰减规律以及主要影响因素，了解路面的使用功能，包括行驶质量和表面性能。"
      },
      {
        "title": "沥青路面设计方法",
        "content": "熟悉基于经验、力学分析的沥青路面结构设计方法，包括其设计指标、设计流程和力学模式，掌握我国公路沥青路面厚度计算方法，以及路面结构的防水/排水设计方法，了解长寿面路面结构的概念和设计原理。"
      },
      {
        "title": "水泥路面的力学性能和使用性能",
        "content": "掌握水泥混凝土路面的主要力学分析模型和求解方法、弹性地基板温度应力分析方法，熟悉水泥混凝土路面使用性能，包括损坏特性和损坏状况的衰变规律。"
      },
      {
        "title": "水泥路面结构设计方法",
        "content": "掌握水泥路面结构设计指标、设计流程和力学模式，熟悉水泥混凝土横向接缝和纵缝的设计方法，掌握普通水泥混凝土路面厚度设计的原理和方法。"
      },
      {
        "title": "路面评价与养护维修设计",
        "content": "熟悉路面使用性能的评价指标和方法，以及各项养护技术以及加铺层设计方法，了解常见的路面养护维修技术。"
      }
    ]
  }
]