[
  {
    "course_id": "34001010",
    "score": 5,
    "user_id": "1953176",
    "content": "还可以",
    "time": "1626832597790",
    "liked": [
      "1953175",
      "1953178"
    ],
    "like_count": 2,
    "pic": "~@/../assets/images/niming.png"
  },
  {
    "course_id": "34001010",
    "score": 2,
    "user_id": "1953175",
    "content": "不太行",
    "time": "1626832597790",
    "liked": [
      "1953175"
    ],
    "like_count": 1,
    "pic": "~@/../assets/images/feifei.png"
  },
  {
    "course_id": "34001011",
    "score": 4,
    "user_id": "1952120",
    "content": "为了贝奇，选一门医学院的课",
    "time": "1626832597790",
    "liked": [
      "1953194"
    ],
    "like_count": 1,
    "pic": "~@/../assets/images/feifei.png"
  },
  {
    "course_id": "34001012",
    "score": 5,
    "user_id": "1952428",
    "content": "土木人，土木魂，土木都是人上人！！",
    "time": "1626832597790",
    "liked": [
      "1953194",
      "1952120"
    ],
    "like_count": 2,
    "pic": "~@/../assets/images/feifei.png"
  }
]