[
  {
    "question_id": "62975a2d330153120a63fbfe",
    "reply_content": "eiusmod exercitation dolor irure aliqua",
    "user_id": "1953175",
    "reply_stamp": {
      "$numberLong": "1652190479000"
    },
    "liked": [
      "1953176"
    ],
    "image_list": []
  },
  {
    "question_id": "62975a2d330153120a63fbfe",
    "reply_content": "afdsffasdfsadfsdafsdafasdfsdafa",
    "user_id": "1953175",
    "reply_stamp": {
      "$numberLong": "1652190479000"
    },
    "liked": [
      "1953175"
    ],
    "image_list": []
  },
  {
    "question_id": "62975a2d330153120a63fbff",
    "reply_content": "eiusmod exercitation dolor irure aliqua",
    "user_id": "1953175",
    "reply_stamp": {
      "$numberLong": "1652190479000"
    },
    "liked": [
      "1953176"
    ],
    "image_list": []
  },
  {
    "question_id": "62975a2d330153120a63fc00",
    "reply_content": "afdsffasdfsadfsdafsdafasdfsdafa",
    "user_id": "1953175",
    "reply_stamp": {
      "$numberLong": "1652190479000"
    },
    "liked": [
      "1953175"
    ],
    "image_list": []
  }
  ,
  {
    "question_id": "62975a2d330153120a63fc01",
    "reply_content": "eiusmod exercitation dolor irure aliqua",
    "user_id": "1953175",
    "reply_stamp": {
      "$numberLong": "1652190479000"
    },
    "liked": [
      "1953176"
    ],
    "image_list": []
  },
  {
    "question_id": "62975a2d330153120a63fc02",
    "reply_content": "afdsffasdfsadfsdafsdafasdfsdafa",
    "user_id": "1953175",
    "reply_stamp": {
      "$numberLong": "1652190479000"
    },
    "liked": [
      "1953175"
    ],
    "image_list": []
  },
  {
    "question_id": "62975a2d330153120a63fc03",
    "reply_content": "eiusmod exercitation dolor irure aliqua",
    "user_id": "1953175",
    "reply_stamp": {
      "$numberLong": "1652190479000"
    },
    "liked": [
      "1953176"
    ],
    "image_list": []
  },
  {
    "question_id": "62975a2d330153120a63fc04",
    "reply_content": "afdsffasdfsadfsdafsdafasdfsdafa",
    "user_id": "1953175",
    "reply_stamp": {
      "$numberLong": "1652190479000"
    },
    "liked": [
      "1953175"
    ],
    "image_list": []
  },
  {
    "question_id": "62975a2d330153120a63fc05",
    "reply_content": "eiusmod exercitation dolor irure aliqua",
    "user_id": "1953175",
    "reply_stamp": {
      "$numberLong": "1652190479000"
    },
    "liked": [
      "1953176"
    ],
    "image_list": []
  }
]