{
  "project_info": {
    "project_number": "991652042316",
    "project_id": "appgenero-f0f89",
    "storage_bucket": "appgenero-f0f89.appspot.com"
  },
  "client": [
    {
      "client_info": {
        "mobilesdk_app_id": "1:991652042316:android:b5daa280c50283c11306e9",
        "android_client_info": {
          "package_name": "com.example.app_genero"
        }
      },
      "oauth_client": [
        {
          "client_id": "991652042316-8i6q7r2vvietvepgecibuhkft66q2t9r.apps.googleusercontent.com",
          "client_type": 3
        }
      ],
      "api_key": [
        {
          "current_key": "AIzaSyABWvkpYbFDiUb8RE4Cpll9GlfdY9A4G1o"
        }
      ],
      "services": {
        "appinvite_service": {
          "other_platform_oauth_client": [
            {
              "client_id": "991652042316-8i6q7r2vvietvepgecibuhkft66q2t9r.apps.googleusercontent.com",
              "client_type": 3
            }
          ]
        }
      }
    }
  ],
  "configuration_version": "1"
}