\relax 
\@writefile{toc}{\contentsline {section}{\tocsection {}{1}{Intro and Prereq{}s}}{1}\protected@file@percent }
\@writefile{toc}{\contentsline {subsection}{\tocsubsection {}{1.1}{Hom Functors}}{1}\protected@file@percent }
\@writefile{toc}{\contentsline {subsection}{\tocsubsection {}{1.2}{Elements of a category}}{1}\protected@file@percent }
\@writefile{toc}{\contentsline {subsection}{\tocsubsection {}{1.3}{Thoughts about Natural Transformations}}{1}\protected@file@percent }
\@writefile{toc}{\contentsline {section}{\tocsection {}{2}{Statement of the Yoneda Lemma}}{2}\protected@file@percent }
\@writefile{toc}{\contentsline {section}{\tocsection {}{3}{Conclusion}}{2}\protected@file@percent }
\newlabel{tocindent-1}{0pt}
\newlabel{tocindent0}{0pt}
\newlabel{tocindent1}{17.77782pt}
\newlabel{tocindent2}{29.38873pt}
\newlabel{tocindent3}{0pt}
