\relax 
\providecommand\hyper@newdestlabel[2]{}
\@ifundefined{amsrefs@bibcite}{}{\let\bibcite\amsrefs@bibcite}
\bibstyle{amsrn}
\providecommand\HyperFirstAtBeginDocument{\AtBeginDocument}
\HyperFirstAtBeginDocument{\ifx\hyper@anchor\@undefined
\global\let\oldcontentsline\contentsline
\gdef\contentsline#1#2#3#4{\oldcontentsline{#1}{#2}{#3}}
\global\let\oldnewlabel\newlabel
\gdef\newlabel#1#2{\newlabelxx{#1}#2}
\gdef\newlabelxx#1#2#3#4#5#6{\oldnewlabel{#1}{{#2}{#3}}}
\AtEndDocument{\ifx\hyper@anchor\@undefined
\let\contentsline\oldcontentsline
\let\newlabel\oldnewlabel
\fi}
\fi}
\global\let\hyper@last\relax 
\gdef\HyperFirstAtBeginDocument#1{#1}
\providecommand\HyField@AuxAddToFields[1]{}
\providecommand\HyField@AuxAddToCoFields[2]{}
\@writefile{toc}{\contentsline {section}{\tocsection {}{1}{Introduction}}{1}{section.1}\protected@file@percent }
\@writefile{toc}{\contentsline {section}{\tocsection {}{2}{Tensor Products}}{1}{section.2}\protected@file@percent }
\@writefile{toc}{\contentsline {subsection}{\tocsubsection {}{2.1}{$\mathbb  {Z}/m\mathbb  {Z}\otimes \mathbb  {Z}/n\mathbb  {Z}$ for $m,n$ relatively prime}}{2}{subsection.2.1}\protected@file@percent }
\@writefile{toc}{\contentsline {subsection}{\tocsubsection {}{2.2}{$\mathbb  {Z}/2\mathbb  {Z}\otimes \mathbb  {Z}/2\mathbb  {Z}$}}{2}{subsection.2.2}\protected@file@percent }
\@writefile{toc}{\contentsline {section}{\tocsection {}{3}{Tor Products}}{2}{section.3}\protected@file@percent }
\bibcite{Barr}{{1}{}}
\bibcite{Lang}{{2}{}}
\bibcite{Vick}{{3}{}}
\bibcite{Weibel}{{4}{}}
\newlabel{[bibenv:1]}{8.97235pt}
\newlabel{tocindent-1}{0pt}
\newlabel{tocindent0}{12.7778pt}
\newlabel{tocindent1}{17.77782pt}
\newlabel{tocindent2}{29.38873pt}
\newlabel{tocindent3}{0pt}
\@writefile{toc}{\contentsline {subsection}{\tocsubsection {}{3.1}{$\Tor  (\mathbb  {Z}/2\mathbb  {Z}, \mathbb  {Z}/2\mathbb  {Z})$ (for review)}}{3}{subsection.3.1}\protected@file@percent }
\@writefile{toc}{\contentsline {subsection}{\tocsubsection {}{3.2}{$\Tor  (\mathbb  {Z}, \mathrm  {anything})$ }}{3}{subsection.3.2}\protected@file@percent }
\@writefile{toc}{\contentsline {subsection}{\tocsubsection {}{3.3}{$\Tor  (\mathbb  {Z}/n\mathbb  {Z}, \mathbb  {Z}/m\mathbb  {Z})$}}{3}{subsection.3.3}\protected@file@percent }
\@writefile{toc}{\contentsline {section}{\tocsection {}{}{References}}{3}{section*.1}\protected@file@percent }
\gdef \@abspage@last{3}
