\relax 
\providecommand\hyper@newdestlabel[2]{}
\providecommand\HyperFirstAtBeginDocument{\AtBeginDocument}
\HyperFirstAtBeginDocument{\ifx\hyper@anchor\@undefined
\global\let\oldcontentsline\contentsline
\gdef\contentsline#1#2#3#4{\oldcontentsline{#1}{#2}{#3}}
\global\let\oldnewlabel\newlabel
\gdef\newlabel#1#2{\newlabelxx{#1}#2}
\gdef\newlabelxx#1#2#3#4#5#6{\oldnewlabel{#1}{{#2}{#3}}}
\AtEndDocument{\ifx\hyper@anchor\@undefined
\let\contentsline\oldcontentsline
\let\newlabel\oldnewlabel
\fi}
\fi}
\global\let\hyper@last\relax 
\gdef\HyperFirstAtBeginDocument#1{#1}
\providecommand\HyField@AuxAddToFields[1]{}
\providecommand\HyField@AuxAddToCoFields[2]{}
\@ifundefined{amsrefs@bibcite}{}{\let\bibcite\amsrefs@bibcite}
\bibstyle{amsrn}
\citation{Aluffi}
\citation{AM}
\citation{Lang}
\@writefile{toc}{\contentsline {subsection}{\numberline {0.1}Universal Property of Free Modules}{1}{subsection.0.1}\protected@file@percent }
\bibcite{Aluffi}{{1}{}}
\bibcite{AM}{{2}{}}
\bibcite{Lang}{{3}{}}
\newlabel{[bibenv:1]}{10.49399pt}
\newlabel{tocindent-1}{0pt}
\newlabel{tocindent0}{0pt}
\newlabel{tocindent1}{0pt}
\newlabel{tocindent2}{0pt}
\newlabel{tocindent3}{0pt}
\@writefile{toc}{\contentsline {subsection}{\numberline {0.2}Universal Property of the Direct Sum and Direct Product}{2}{subsection.0.2}\protected@file@percent }
\@writefile{toc}{\contentsline {subsection}{\numberline {0.3}Lang's Definition}{2}{subsection.0.3}\protected@file@percent }
