{
  "iisSettings": {
    "windowsAuthentication": false,
    "anonymousAuthentication": true,
    "iis": {
      "applicationUrl": "http://localhost/moviecruiser",
      "sslPort": 0
    },
    "iisExpress": {
      "applicationUrl": "http://localhost:52467/",
      "sslPort": 0
    }
  },
  "profiles": {
    "IIS Express": {
      "commandName": "IISExpress",
      "environmentVariables": {
        "ASPNETCORE_ENVIRONMENT": "Development"
      }
    },
    "moviecruiser": {
      "commandName": "IIS",
      "workingDirectory": "C:\\Moviecruiser\\moviecruiser",
      "environmentVariables": {
        "ASPNETCORE_ENVIRONMENT": "Development"
      },
      "applicationUrl": "http://localhost:52473/"
    }
  }
}