{
  "files": [
    {
      "name": "boot-wait.sh",
      "url": "https://gitlab.com/tinypill/redpill-ttg/redpill-boot-wait/-/raw/master/src/boot-wait.sh",
      "sha256": "d9d1c5c3ad90e745a79389c7fcaa5a2f61993769e534b82f03f9a112956c6fbc",
      "packed": false
    }
  ],

  "scripts": {
    "on_boot": "boot-wait.sh"
  }
}
