{
  "os": {
    "id": "ds3617xs_64551",
    "pat_url": "https://global.download.synology.com/download/DSM/release/7.2/64551/DSM_DS3617xs_64551.pat",
    "sha256": "17785c8dab0cc2faf4c0ac3d6ddca3c38c782fc57586004182ae09e443410db4"
  },
  "files": {
    "zlinux": {
      "name": "zImage",
      "sha256": "16176d29125ee784ab8bfb1201f0269127ca70464f86022ad96e0023b2c95308"
    },
    "ramdisk": {
      "name": "rd.gz",
      "sha256": "212e03d267917774ebd3fbb710802cda6e2b674541d89df200a09ff5b28af7bb"
    },
    "vmlinux": {
      "sha256": "00a346b5d6ddc446d1cec5e6d7ea0cf6bcb1a045359baffe48ac70d841a3d63a"
    }
  },
  "patches": {
    "_comment": ".bsp patches are applied to FILES using bspatch(1); .patch are applied to DIRECTORIES using patch(1)",
    "zlinux": [
      "zImage-001-3617xs-64551-ramdisk-and-header.bsp"
    ],
    "ramdisk": [
      "@@@COMMON@@@/ramdisk-001-disable-root-pwd.patch",
      "@@@COMMON@@@/v7.2.0/ramdisk-002-init-script.patch",
      "@@@COMMON@@@/v7.2.0/ramdisk-003-post-init-script-noatime.patch",
      "@@@COMMON@@@/v7.2.0/ramdisk-004-network-hosts.patch",
      "@@@COMMON@@@/ramdisk-005-disable-disabled-ports.patch",
      "@@@COMMON@@@/ramdisk-common-etc-rc.patch"
    ]
  },
  "synoinfo": {
    "maxdisks": "15",
    "internalportcfg": "0x78FF",
    "esataportcfg": "0x0",
    "usbportcfg": "0x8700",
    "rss_server": "https://gitlab.com/tinypill/pocopico/redpill-load/-/raw/develop/rss.xml",
    "rss_server_ssl": "https://gitlab.com/tinypill/pocopico/redpill-load/-/raw/develop/rss.xml",
    "rss_server_v2": "https://gitlab.com/tinypill/pocopico/redpill-load/-/raw/develop/rss.json",
    "small_info_path": "https://example.com/null",
    "security_version_server": "https://example.com/smallupdate"
  },
  "grub": {
    "template": "@@@COMMON@@@/grub-template.conf",
    "base_cmdline": {
      "sn": "",
      "vid": "0x46f4",
      "pid": "0x0001",
      "mac1": "",
      "netif_num": 1,
      "syno_hw_version": "DS3617xs",
      "syno_hdd_powerup_seq": 0,
      "HddHotplug": 0,
      "vender_format_version": 2,
      "console": "ttyS0,115200n8",
      "withefi": null,
      "elevator": "elevator",
      "syno_port_thaw": 1,
      "syno_hdd_detect": 0,
      "root": "/dev/md0",
      "earlycon": "uart8250,io,0x3f8,115200n8"
    },
    "menu_entries": {
      "RedPill DS3617xs v7.2.0-64551 (USB, Verbose)": {
        "options": [
          "savedefault",
          "set root=(hd0,msdos1)",
          "echo Loading Linux...",
          "linux /zImage @@@CMDLINE@@@",
          "echo Loading initramfs...",
          "initrd (hd0,msdos3)/initrd-dsm",
          "echo Starting kernel with USB boot"
        ],
        "cmdline": {
          "earlyprintk": null,
          "loglevel": 15,
          "log_buf_len": "32M"
        }
      },
      "RedPill DS3617xs v7.2.0-64551 (SATA, Verbose)": {
        "options": [
          "savedefault",
          "set root=(hd0,msdos1)",
          "echo Loading Linux...",
          "linux /zImage @@@CMDLINE@@@",
          "echo Loading initramfs...",
          "initrd (hd0,msdos3)/initrd-dsm",
          "echo Starting kernel with SATA boot"
        ],
        "cmdline": {
          "earlyprintk": null,
          "loglevel": 15,
          "synoboot_satadom": 1,
          "log_buf_len": "32M"
        }
      }
    }
  },
  "extra": {
    "compress_rd": false,
    "ramdisk_copy": {
      "@@@EXT@@@/rp-lkm/redpill-linux-v4.4.302+.ko": "usr/lib/modules/rp.ko",
      "@@@COMMON@@@/iosched-trampoline.sh": "usr/sbin/modprobe"
    },
    "bootp1_copy": {
      "@@@PAT@@@/GRUB_VER": "GRUB_VER"
    },
    "bootp2_copy": {
      "@@@PAT@@@/GRUB_VER": "GRUB_VER",
      "@@@PAT@@@/grub_cksum.syno": "grub_cksum.syno",
      "@@@PAT@@@/rd.gz": "rd.gz",
      "@@@PAT@@@/zImage": "zImage"
    }
  }
}
