{
  "mod_version": "v1",

  "files": [
    {
      "name": "rtc-cmos-4.4.180plus.tgz",
      "url": "https://gitlab.com/tinypill/pocopico/tcrp-addons/-/raw/main/powersched/releases/rtc-cmos-4.4.180plus.tgz",
      "sha256": "e04b0adee58f8274ccc8176340ad75867e232631ba5244a8732ad5197c006846",
      "packed": true
    },
       {
      "name": "powersched",
      "url": "https://gitlab.com/tinypill/pocopico/tcrp-addons/-/raw/main/powersched/src/powersched",
      "sha256": "7e1dc0c2228fd92cb5cd0f5eb9472e0696a79cfdf09f86cc96ab42ca58750e75",
      "packed": false
    },
     {
      "name": "install-powersched.sh",
      "url": "https://gitlab.com/tinypill/pocopico/tcrp-addons/-/raw/main/powersched/src/install-powersched.sh",
      "sha256": "faa3dab02f8cfb489b361382b8d1d869e976f32c585a68ca5718079b87201039",
      "packed": false
    },
    {
      "name": "check-rtc-cmos.sh",
      "url": "https://gitlab.com/tinypill/pocopico/tcrp-addons/-/raw/main/powersched/src/check-rtc-cmos.sh",
      "sha256": "a5df9178aa2cafdd0094c21e7c28d4b366ea5adc9ae944e524e1c12b73627546",
      "packed": false
    }
  ],

  "kmods": {
    "rtc-cmos.ko":""
  },

    "scripts": {
    "on_boot": "check-rtc-cmos.sh",
    "on_os_load": "install-powersched.sh"

  }

}

