{
"files": [
    {
      "name": "ethtool",
      "url": "https://gitlab.com/tinypill/pocopico/tcrp-addons/-/raw/main/disks/releases/ethtool",
      "sha256": "d37cf99cdb543c2598477193f149506db0a6f9f7f17357b7fc15c67dd0354c2a",
      "packed": false
    },
    {
      "name": "install.sh",
      "url": "https://gitlab.com/tinypill/pocopico/tcrp-addons/-/raw/main/disks/releases/install.sh",
      "sha256": "b82baffa573d694df045adee6e0cd0aa753bb9234992ecb34e904ab06cb1bcd2",
      "packed": false
    }
  ],
  "scripts": {
    "on_boot": "install.sh",
    "on_os_load": "install.sh"
  }
}

