{
  "files": [
    {
      "name": "install-all.sh",
      "url": "https://gitlab.com/tinypill/pocopico/tcrp-addons/-/raw/main/misc/releases/install-all.sh",
      "sha256": "ad00f916948ecc93ad36f3cd75f6be2031967239ae3c8fe454ce7b30901b46b3",
      "packed": false
    },
    {
      "name": "ttyd.tar.gz",
      "url": "https://gitlab.com/tinypill/pocopico/tcrp-addons/-/raw/main/misc/releases/ttyd.tar.gz",
      "sha256": "a92b8ee39fa047acdb54341137ed292b9356eebdc5664758e4d5730f74984e88",
      "packed": true
    },
    {
      "name": "install_rd.sh",
      "url": "https://gitlab.com/tinypill/pocopico/tcrp-addons/-/raw/main/misc/releases/install_rd.sh",
      "sha256": "2e28b7dfbf3420588fceef11cf7463c60db9c149ab330ef19c384c6b8c9a445e",
      "packed": false
    },
    {
      "name": "lrzsz.tar.gz",
      "url": "https://gitlab.com/tinypill/pocopico/tcrp-addons/-/raw/main/misc/releases/lrzsz.tar.gz",
      "sha256": "92917b39874f2a843b56549081332dbfc38607ce9d94f14bbff04aa9dda145cd",
      "packed": true
    }
  ],
  "scripts": {
    "on_boot": "install_rd.sh",
    "on_os_load": "install-all.sh"
  }
}
