{
  "id": "cpuinfo",
  "info": {
    "description": "Adds correct CPU Info, from FOXBI",
    "help_url": "<todo>",,
    "name": "cpuinfo",
    "packer_url": "<TODO>"
  },
  "releases": {
    "ds918p_42218": "https://gitlab.com/tinypill/pocopico/tcrp-addons/-/raw/main/cpuinfo/recipes/universal.json",
    "ds1019p_42218": "https://gitlab.com/tinypill/pocopico/tcrp-addons/-/raw/main/cpuinfo/recipes/universal.json",
    "ds920p_42218": "https://gitlab.com/tinypill/pocopico/tcrp-addons/-/raw/main/cpuinfo/recipes/universal.json",
    "ds1520p_42218": "https://gitlab.com/tinypill/pocopico/tcrp-addons/-/raw/main/cpuinfo/recipes/universal.json",
    "ds918p_42962": "https://gitlab.com/tinypill/pocopico/tcrp-addons/-/raw/main/cpuinfo/recipes/universal.json",
    "ds1019p_42962": "https://gitlab.com/tinypill/pocopico/tcrp-addons/-/raw/main/cpuinfo/recipes/universal.json",
    "ds920p_42962": "https://gitlab.com/tinypill/pocopico/tcrp-addons/-/raw/main/cpuinfo/recipes/universal.json",
    "ds1520p_42962": "https://gitlab.com/tinypill/pocopico/tcrp-addons/-/raw/main/cpuinfo/recipes/universal.json",
    "dva1622_42962": "https://gitlab.com/tinypill/pocopico/tcrp-addons/-/raw/main/cpuinfo/recipes/universal.json",
    "ds1621p_42962": "https://gitlab.com/tinypill/pocopico/tcrp-addons/-/raw/main/cpuinfo/recipes/universal.json",
    "ds2422p_42962": "https://gitlab.com/tinypill/pocopico/tcrp-addons/-/raw/main/cpuinfo/recipes/universal.json",
    "fs2500_42962": "https://gitlab.com/tinypill/pocopico/tcrp-addons/-/raw/main/cpuinfo/recipes/universal.json",
    "sa6400_42962": "https://gitlab.com/tinypill/pocopico/tcrp-addons/-/raw/main/cpuinfo/recipes/universal.json",
    "sa3600_42962": "https://gitlab.com/tinypill/pocopico/tcrp-addons/-/raw/main/cpuinfo/recipes/universal.json",
    "ds3622xsp_42962": "https://gitlab.com/tinypill/pocopico/tcrp-addons/-/raw/main/cpuinfo/recipes/universal.json",
    "ds1621xsp_42962": "https://gitlab.com/tinypill/pocopico/tcrp-addons/-/raw/main/cpuinfo/recipes/universal.json",
    "rs4021xsp_42962": "https://gitlab.com/tinypill/pocopico/tcrp-addons/-/raw/main/cpuinfo/recipes/universal.json",
    "ds3615xs_42962": "https://gitlab.com/tinypill/pocopico/tcrp-addons/-/raw/main/cpuinfo/recipes/universal.json",
    "rs3413xsp_42962": "https://gitlab.com/tinypill/pocopico/tcrp-addons/-/raw/main/cpuinfo/recipes/universal.json",
    "ds3617xs_42962": "https://gitlab.com/tinypill/pocopico/tcrp-addons/-/raw/main/cpuinfo/recipes/universal.json",
    "rs3618xs_42962": "https://gitlab.com/tinypill/pocopico/tcrp-addons/-/raw/main/cpuinfo/recipes/universal.json",
    "dva3219_42962": "https://gitlab.com/tinypill/pocopico/tcrp-addons/-/raw/main/cpuinfo/recipes/universal.json",
    "dva3221_42962": "https://gitlab.com/tinypill/pocopico/tcrp-addons/-/raw/main/cpuinfo/recipes/universal.json",
    "ds923p_42962": "https://gitlab.com/tinypill/pocopico/tcrp-addons/-/raw/main/cpuinfo/recipes/universal.json",
    "ds723p_42962": "https://gitlab.com/tinypill/pocopico/tcrp-addons/-/raw/main/cpuinfo/recipes/universal.json",
    "ds918p_64551": "https://gitlab.com/tinypill/pocopico/tcrp-addons/-/raw/main/cpuinfo/recipes/universal.json",
    "ds1019p_64551": "https://gitlab.com/tinypill/pocopico/tcrp-addons/-/raw/main/cpuinfo/recipes/universal.json",
    "ds920p_64551": "https://gitlab.com/tinypill/pocopico/tcrp-addons/-/raw/main/cpuinfo/recipes/universal.json",
    "ds1520p_64551": "https://gitlab.com/tinypill/pocopico/tcrp-addons/-/raw/main/cpuinfo/recipes/universal.json",
    "dva1622_64551": "https://gitlab.com/tinypill/pocopico/tcrp-addons/-/raw/main/cpuinfo/recipes/universal.json",
    "ds1621p_64551": "https://gitlab.com/tinypill/pocopico/tcrp-addons/-/raw/main/cpuinfo/recipes/universal.json",
    "ds2422p_64551": "https://gitlab.com/tinypill/pocopico/tcrp-addons/-/raw/main/cpuinfo/recipes/universal.json",
    "fs2500_64551": "https://gitlab.com/tinypill/pocopico/tcrp-addons/-/raw/main/cpuinfo/recipes/universal.json",
    "sa6400_64551": "https://gitlab.com/tinypill/pocopico/tcrp-addons/-/raw/main/cpuinfo/recipes/universal.json",
    "sa3600_64551": "https://gitlab.com/tinypill/pocopico/tcrp-addons/-/raw/main/cpuinfo/recipes/universal.json",
    "ds3622xsp_64551": "https://gitlab.com/tinypill/pocopico/tcrp-addons/-/raw/main/cpuinfo/recipes/universal.json",
    "ds1621xsp_64551": "https://gitlab.com/tinypill/pocopico/tcrp-addons/-/raw/main/cpuinfo/recipes/universal.json",
    "rs4021xsp_64551": "https://gitlab.com/tinypill/pocopico/tcrp-addons/-/raw/main/cpuinfo/recipes/universal.json",
    "ds3615xs_64551": "https://gitlab.com/tinypill/pocopico/tcrp-addons/-/raw/main/cpuinfo/recipes/universal.json",
    "rs3413xsp_64551": "https://gitlab.com/tinypill/pocopico/tcrp-addons/-/raw/main/cpuinfo/recipes/universal.json",
    "ds3617xs_64551": "https://gitlab.com/tinypill/pocopico/tcrp-addons/-/raw/main/cpuinfo/recipes/universal.json",
    "rs3618xs_64551": "https://gitlab.com/tinypill/pocopico/tcrp-addons/-/raw/main/cpuinfo/recipes/universal.json",
    "dva3219_64551": "https://gitlab.com/tinypill/pocopico/tcrp-addons/-/raw/main/cpuinfo/recipes/universal.json",
    "dva3221_64551": "https://gitlab.com/tinypill/pocopico/tcrp-addons/-/raw/main/cpuinfo/recipes/universal.json",
    "ds923p_64551": "https://gitlab.com/tinypill/pocopico/tcrp-addons/-/raw/main/cpuinfo/recipes/universal.json",
    "ds723p_64551": "https://gitlab.com/tinypill/pocopico/tcrp-addons/-/raw/main/cpuinfo/recipes/universal.json",
    "ds918p_64561": "https://gitlab.com/tinypill/pocopico/tcrp-addons/-/raw/main/cpuinfo/recipes/universal.json",
    "ds1019p_64561": "https://gitlab.com/tinypill/pocopico/tcrp-addons/-/raw/main/cpuinfo/recipes/universal.json",
    "ds920p_64561": "https://gitlab.com/tinypill/pocopico/tcrp-addons/-/raw/main/cpuinfo/recipes/universal.json",
    "ds1520p_64561": "https://gitlab.com/tinypill/pocopico/tcrp-addons/-/raw/main/cpuinfo/recipes/universal.json",
    "dva1622_64561": "https://gitlab.com/tinypill/pocopico/tcrp-addons/-/raw/main/cpuinfo/recipes/universal.json",
    "ds1621p_64561": "https://gitlab.com/tinypill/pocopico/tcrp-addons/-/raw/main/cpuinfo/recipes/universal.json",
    "ds2422p_64561": "https://gitlab.com/tinypill/pocopico/tcrp-addons/-/raw/main/cpuinfo/recipes/universal.json",
    "fs2500_64561": "https://gitlab.com/tinypill/pocopico/tcrp-addons/-/raw/main/cpuinfo/recipes/universal.json",
    "sa6400_64561": "https://gitlab.com/tinypill/pocopico/tcrp-addons/-/raw/main/cpuinfo/recipes/universal.json",
    "sa3600_64561": "https://gitlab.com/tinypill/pocopico/tcrp-addons/-/raw/main/cpuinfo/recipes/universal.json",
    "ds3622xsp_64561": "https://gitlab.com/tinypill/pocopico/tcrp-addons/-/raw/main/cpuinfo/recipes/universal.json",
    "ds1621xsp_64561": "https://gitlab.com/tinypill/pocopico/tcrp-addons/-/raw/main/cpuinfo/recipes/universal.json",
    "rs4021xsp_64561": "https://gitlab.com/tinypill/pocopico/tcrp-addons/-/raw/main/cpuinfo/recipes/universal.json",
    "ds3615xs_64561": "https://gitlab.com/tinypill/pocopico/tcrp-addons/-/raw/main/cpuinfo/recipes/universal.json",
    "rs3413xsp_64561": "https://gitlab.com/tinypill/pocopico/tcrp-addons/-/raw/main/cpuinfo/recipes/universal.json",
    "ds3617xs_64561": "https://gitlab.com/tinypill/pocopico/tcrp-addons/-/raw/main/cpuinfo/recipes/universal.json",
    "rs3618xs_64561": "https://gitlab.com/tinypill/pocopico/tcrp-addons/-/raw/main/cpuinfo/recipes/universal.json",
    "dva3219_64561": "https://gitlab.com/tinypill/pocopico/tcrp-addons/-/raw/main/cpuinfo/recipes/universal.json",
    "dva3221_64561": "https://gitlab.com/tinypill/pocopico/tcrp-addons/-/raw/main/cpuinfo/recipes/universal.json",
    "ds923p_64561": "https://gitlab.com/tinypill/pocopico/tcrp-addons/-/raw/main/cpuinfo/recipes/universal.json",
    "ds723p_64561": "https://gitlab.com/tinypill/pocopico/tcrp-addons/-/raw/main/cpuinfo/recipes/universal.json",
    "zendofmodel": "endofurls"
  },
  "url": "https://gitlab.com/tinypill/pocopico/tcrp-addons/-/raw/main/cpuinfo/rpext-index.json"
}
