{
  "id": "dtbpatch",
  "info": {
    "author_url": "https://gitlab.com/tinypill/pocopico/tcrp-addons",
    "description": "Create your own device tree binary",
    "help_url": "<todo>",,
    "name": "Device tree binary",
    "packer_url": "https://gitlab.com/jumkey/redpill-load/raw/develop/redpill-dtb"
  },
  "releases": {
    "ds1520p_42218": "https://gitlab.com/tinypill/pocopico/tcrp-addons/-/raw/main/dtbpatch/recipes/universal.json",
    "ds1621p_42218": "https://gitlab.com/tinypill/pocopico/tcrp-addons/-/raw/main/dtbpatch/recipes/universal.json",
    "ds2422p_42218": "https://gitlab.com/tinypill/pocopico/tcrp-addons/-/raw/main/dtbpatch/recipes/universal.json",
    "ds920p_42218": "https://gitlab.com/tinypill/pocopico/tcrp-addons/-/raw/main/dtbpatch/recipes/universal.json",
    "fs2500_42218": "https://gitlab.com/tinypill/pocopico/tcrp-addons/-/raw/main/dtbpatch/recipes/universal.json",
    "ds920p_42962": "https://gitlab.com/tinypill/pocopico/tcrp-addons/-/raw/main/dtbpatch/recipes/universal.json",
    "ds1520p_42962": "https://gitlab.com/tinypill/pocopico/tcrp-addons/-/raw/main/dtbpatch/recipes/universal.json",
    "ds1621p_42962": "https://gitlab.com/tinypill/pocopico/tcrp-addons/-/raw/main/dtbpatch/recipes/universal.json",
    "ds2422p_42962": "https://gitlab.com/tinypill/pocopico/tcrp-addons/-/raw/main/dtbpatch/recipes/universal.json",
    "dva1622_42962": "https://gitlab.com/tinypill/pocopico/tcrp-addons/-/raw/main/dtbpatch/recipes/universal.json",
    "fs2500_42962": "https://gitlab.com/tinypill/pocopico/tcrp-addons/-/raw/main/dtbpatch/recipes/universal.json",
    "sa6400_42962": "https://gitlab.com/tinypill/pocopico/tcrp-addons/-/raw/main/dtbpatch/recipes/universal.json",
    "ds923p_42962": "https://gitlab.com/tinypill/pocopico/tcrp-addons/-/raw/main/dtbpatch/recipes/universal.json",
    "ds723p_42962": "https://gitlab.com/tinypill/pocopico/tcrp-addons/-/raw/main/dtbpatch/recipes/universal.json",
    "ds920p_64551": "https://gitlab.com/tinypill/pocopico/tcrp-addons/-/raw/main/dtbpatch/recipes/universal.json",
    "ds1520p_64551": "https://gitlab.com/tinypill/pocopico/tcrp-addons/-/raw/main/dtbpatch/recipes/universal.json",
    "ds1621p_64551": "https://gitlab.com/tinypill/pocopico/tcrp-addons/-/raw/main/dtbpatch/recipes/universal.json",
    "ds2422p_64551": "https://gitlab.com/tinypill/pocopico/tcrp-addons/-/raw/main/dtbpatch/recipes/universal.json",
    "dva1622_64551": "https://gitlab.com/tinypill/pocopico/tcrp-addons/-/raw/main/dtbpatch/recipes/universal.json",
    "fs2500_64551": "https://gitlab.com/tinypill/pocopico/tcrp-addons/-/raw/main/dtbpatch/recipes/universal.json",
    "sa6400_64551": "https://gitlab.com/tinypill/pocopico/tcrp-addons/-/raw/main/dtbpatch/recipes/universal.json",
    "ds923p_64551": "https://gitlab.com/tinypill/pocopico/tcrp-addons/-/raw/main/dtbpatch/recipes/universal.json",
    "ds723p_64551": "https://gitlab.com/tinypill/pocopico/tcrp-addons/-/raw/main/dtbpatch/recipes/universal.json",
    "ds920p_64561": "https://gitlab.com/tinypill/pocopico/tcrp-addons/-/raw/main/dtbpatch/recipes/universal.json",
    "ds1520p_64561": "https://gitlab.com/tinypill/pocopico/tcrp-addons/-/raw/main/dtbpatch/recipes/universal.json",
    "ds1621p_64561": "https://gitlab.com/tinypill/pocopico/tcrp-addons/-/raw/main/dtbpatch/recipes/universal.json",
    "ds2422p_64561": "https://gitlab.com/tinypill/pocopico/tcrp-addons/-/raw/main/dtbpatch/recipes/universal.json",
    "dva1622_64561": "https://gitlab.com/tinypill/pocopico/tcrp-addons/-/raw/main/dtbpatch/recipes/universal.json",
    "fs2500_64561": "https://gitlab.com/tinypill/pocopico/tcrp-addons/-/raw/main/dtbpatch/recipes/universal.json",
    "sa6400_64561": "https://gitlab.com/tinypill/pocopico/tcrp-addons/-/raw/main/dtbpatch/recipes/universal.json",
    "ds923p_64561": "https://gitlab.com/tinypill/pocopico/tcrp-addons/-/raw/main/dtbpatch/recipes/universal.json",
    "ds723p_64561": "https://gitlab.com/tinypill/pocopico/tcrp-addons/-/raw/main/dtbpatch/recipes/universal.json",
    "zendofmodel": "endofurls"
  },
  "url": "https://gitlab.com/tinypill/pocopico/tcrp-addons/-/raw/main/dtbpatch/rpext-index.json"
}
