{
  "mod_version": "v1",

  "files": [
    {
      "name": "r8168-3.10.108.tgz",
      "url": "https://gitlab.com/tinypill/pocopico/rp-ext/-/raw/main/r8168/releases/r8168-3.10.108.tgz",
      "sha256": "ce323776b4ebb37ba2dceb61448dd2001f51e13408f6eb0e533e71581d58aa8a",
      "packed": true
    },
    {
      "name": "check-r8168.sh",
      "url": "https://gitlab.com/tinypill/pocopico/rp-ext/-/raw/main/r8168/src/check-r8168.sh",
      "sha256": "ce0754e907f4de50a3e1357492d5a3008f5f34a72c53758b5dd4315cd7f2d762",
      "packed": false
    }
  ],

  "kmods": {
    "r8168.ko": ""
  },

    "scripts": {
    "on_boot": "check-r8168.sh"
  }

}
