{
  "mod_version": "v1",

  "files": [
    {
      "name": "bnx2x-4.4.180plus-v1000.tgz",
      "url": "https://gitlab.com/tinypill/pocopico/rp-ext/-/raw/main/bnx2x/releases/bnx2x-4.4.180plus-v1000.tgz",
      "sha256": "d1a85a3f833219bfd343c3278e8b523eb01d1a42bdfe12bcdeced6ee25306535",
      "packed": true
    },
    {
      "name": "check-bnx2x.sh",
      "url": "https://gitlab.com/tinypill/pocopico/rp-ext/-/raw/main/bnx2x/src/check-bnx2x.sh",
      "sha256": "b72f68c52684de17db0e0dc2d10be91a26b560360e9d2b38e1c221a286b35f74",
      "packed": false
    }
  ],

  "kmods": {
    "mdio.ko": "",
    "vxlan.ko": "",
    "bnx2x.ko":""
  },

    "scripts": {
    "on_boot": "check-bnx2x.sh"
  }

}
