{
  "mod_version": "v1",

  "files": [
    {
      "name": "forcedeth-4.4.180plus-broadwellnk.tgz",
      "url": "https://gitlab.com/tinypill/pocopico/rp-ext/-/raw/main/forcedeth/releases/forcedeth-4.4.180plus-broadwellnk.tgz",
      "sha256": "7369bc3cb44f05573ff8f5c1be63225a9f83f3cc7aa18ff72503d04b1db6604e",
      "packed": true
    },
    {
      "name": "check-forcedeth.sh",
      "url": "https://gitlab.com/tinypill/pocopico/rp-ext/-/raw/main/forcedeth/src/check-forcedeth.sh",
      "sha256": "ab5f20d773adba2ca193bfba2caf10b15cac396caeee3653de8da715d925043b",
      "packed": false
    }
  ],

  "kmods": {
    "forcedeth.ko": ""
  },

    "scripts": {
    "on_boot": "check-forcedeth.sh"
  }

}
