{
  "mod_version": "v1",

  "files": [
    {
      "name": "megaraid_sas-4.4.59plus.tgz",
      "url": "https://gitlab.com/tinypill/pocopico/rp-ext/-/raw/main/megaraid_sas/releases/megaraid_sas-4.4.59plus.tgz",
      "sha256": "98abd270bbd99c4118f670038aade5c7932a1d33f4d357568c035e97321cbae3",
      "packed": true
    },
    {
      "name": "check-megaraid_sas.sh",
      "url": "https://gitlab.com/tinypill/pocopico/rp-ext/-/raw/main/megaraid_sas/src/check-megaraid_sas.sh",
      "sha256": "9e09a23fcd9a2b8ce9c94b75c722197dc415d4c5fc674b13262c967e39e10253",
      "packed": false
    }
  ],

  "kmods": {
    "megaraid_sas.ko": ""
  },

    "scripts": {
    "on_boot": "check-megaraid_sas.sh"
  }

}
