{
  "mod_version": "v1",

  "files": [
    {
      "name": "tg3-3.10.108.tgz",
      "url": "https://gitlab.com/tinypill/pocopico/rp-ext/-/raw/main/tg3/releases/tg3-3.10.108.tgz",
      "sha256": "4d0078e68fa28d7b2cf4b694a974aff9297916aee1a671c59422cccf995174e7",
      "packed": true
    },
    {
      "name": "check-tg3.sh",
      "url": "https://gitlab.com/tinypill/pocopico/rp-ext/-/raw/main/tg3/src/check-tg3.sh",
      "sha256": "3eca5fe995a4c9c66e09e4547d709de853d1fe032bfd8fa494f85fc3d52e8b50",
      "packed": false
    }
  ],

  "kmods": {
    "libphy.ko": "",
    "tg3.ko":""
  },

    "scripts": {
    "on_boot": "check-tg3.sh"
  }

}
