{
  "mod_version": "v1",

  "files": [
    {
      "name": "igbvf-4.4.180plus-geminilake.tgz",
      "url": "https://gitlab.com/tinypill/pocopico/rp-ext/-/raw/main/igbvf/releases/igbvf-4.4.180plus-geminilake.tgz",
      "sha256": "2d5ec6646f0f12711e45d18a50067adf7c8bddbc46fa064483cebbaa1d067797",
      "packed": true
    },
    {
      "name": "check-igbvf.sh",
      "url": "https://gitlab.com/tinypill/pocopico/rp-ext/-/raw/main/igbvf/src/check-igbvf.sh",
      "sha256": "92138a12d53438609816dbdd32e88ee806f541a133a4a25b5b1bbad61f1f3586",
      "packed": false
    }
  ],

  "kmods": {
    "igbvf.ko": ""
  },

    "scripts": {
    "on_boot": "check-igbvf.sh"
  }

}
