{
  "mod_version": "v1",

  "files": [
    {
      "name": "mptspi-4.4.180plus-broadwellnk.tgz",
      "url": "https://gitlab.com/tinypill/pocopico/rp-ext/-/raw/main/mptspi/releases/mptspi-4.4.180plus-broadwellnk.tgz",
      "sha256": "fe6a75d8ec6669fdf7818cd6f40c8b4c90cc0ce3edf256957b1bc8934fc40196",
      "packed": true
    },
    {
      "name": "check-mptspi.sh",
      "url": "https://gitlab.com/tinypill/pocopico/rp-ext/-/raw/main/mptspi/src/check-mptspi.sh",
      "sha256": "1777fa35e08a126deca036aea43f414d035fa28e7048d013464c049f231aa7db",
      "packed": false
    }
  ],

  "kmods": {
    "mptbase.ko": "",
    "mptscsih.ko": "",
    "scsi_transport_spi.ko": "",
    "mptspi.ko":""
  },

    "scripts": {
    "on_boot": "check-mptspi.sh"
  }

}
