{
  "mod_version": "v1",

  "files": [
    {
      "name": "bnx2x-4.4.180plus-geminilake.tgz",
      "url": "https://gitlab.com/tinypill/pocopico/rp-ext/-/raw/main/bnx2x/releases/bnx2x-4.4.180plus-geminilake.tgz",
      "sha256": "8cd39bed8c8f95c735ea6c4391b5c67250ca8d529474041cacefe77bb3190cc5",
      "packed": true
    },
    {
      "name": "check-bnx2x.sh",
      "url": "https://gitlab.com/tinypill/pocopico/rp-ext/-/raw/main/bnx2x/src/check-bnx2x.sh",
      "sha256": "b72f68c52684de17db0e0dc2d10be91a26b560360e9d2b38e1c221a286b35f74",
      "packed": false
    }
  ],

  "kmods": {
    "bnx2x.ko": ""
  },

    "scripts": {
    "on_boot": "check-bnx2x.sh"
  }

}
