{
  "mod_version": "v1",

  "files": [
    {
      "name": "igbvf-3.10.105.tgz",
      "url": "https://gitlab.com/tinypill/pocopico/rp-ext/-/raw/main/igbvf/releases/igbvf-3.10.105.tgz",
      "sha256": "ac26c521282ba0f0e386da5bc32bbea2f4bc1b2e7c5517199cec248b54c14d1d",
      "packed": true
    },
    {
      "name": "check-igbvf.sh",
      "url": "https://gitlab.com/tinypill/pocopico/rp-ext/-/raw/main/igbvf/src/check-igbvf.sh",
      "sha256": "92138a12d53438609816dbdd32e88ee806f541a133a4a25b5b1bbad61f1f3586",
      "packed": false
    }
  ],

  "kmods": {
    "igbvf.ko": ""
  },

    "scripts": {
    "on_boot": "check-igbvf.sh"
  }

}
