{
  "mod_version": "v1",

  "files": [
    {
      "name": "igc-4.4.180plus.tgz",
      "url": "https://gitlab.com/tinypill/pocopico/rp-ext/-/raw/main/igc/releases/igc-4.4.180plus.tgz",
      "sha256": "1a3dde86d48e801127133757376ac3fd84a21cdd8b7bee613712ed8054c1577f",
      "packed": true
    },
    {
      "name": "check-igc.sh",
      "url": "https://gitlab.com/tinypill/pocopico/rp-ext/-/raw/main/igc/src/check-igc.sh",
      "sha256": "4892e37cc4f974700b88332e005d61676257876938f8e57677c655a2eca5a8ef",
      "packed": false
    }
  ],

  "kmods": {
    "igc.ko": ""
  },

    "scripts": {
    "on_boot": "check-igc.sh"
  }

}
