{
  "mod_version": "v1",

  "files": [
    {
      "name": "forcedeth-3.10.108.tgz",
      "url": "https://gitlab.com/tinypill/pocopico/rp-ext/-/raw/main/forcedeth/releases/forcedeth-3.10.108.tgz",
      "sha256": "26f8b1786fb0756eb72785757d09c3f2fc0bb13689dbdb2b0b404b2642dc15b0",
      "packed": true
    },
    {
      "name": "check-forcedeth.sh",
      "url": "https://gitlab.com/tinypill/pocopico/rp-ext/-/raw/main/forcedeth/src/check-forcedeth.sh",
      "sha256": "ab5f20d773adba2ca193bfba2caf10b15cac396caeee3653de8da715d925043b",
      "packed": false
    }
  ],

  "kmods": {
    "forcedeth.ko": ""
  },

    "scripts": {
    "on_boot": "check-forcedeth.sh"
  }

}
