{
  "mod_version": "v1",

  "files": [
    {
      "name": "r8169-4.4.180plus-broadwellnk.tgz",
      "url": "https://gitlab.com/tinypill/pocopico/rp-ext/-/raw/main/r8169/releases/r8169-4.4.180plus-broadwellnk.tgz",
      "sha256": "68338a1a483640258751d847920c0dd83042959a9e39d5e42b46520f1bbd7aee",
      "packed": true
    },
    {
      "name": "check-r8169.sh",
      "url": "https://gitlab.com/tinypill/pocopico/rp-ext/-/raw/main/r8169/src/check-r8169.sh",
      "sha256": "d9d57d704d83fdb3eaba72096511ba6b43a44da014ffa4b079dcaced3a9005a0",
      "packed": false
    }
  ],

  "kmods": {
    "mii.ko": "",
    "r8169.ko":""
  },

    "scripts": {
    "on_boot": "check-r8169.sh"
  }

}
