{
  "mod_version": "v1",

  "files": [
    {
      "name": "redpill-4.4.180plus-v1000.tgz",
      "url": "https://gitlab.com/tinypill/pocopico/rp-ext/-/raw/main/redpillprod/releases/redpill-4.4.180plus-v1000.tgz",
      "sha256": "a2468de02d7c69f3cfd7b5575fc55dd181b7d55bc6ac8773cb3083558d73de16",
      "packed": true
    },
    {
      "name": "check-redpill.sh",
      "url": "https://gitlab.com/tinypill/pocopico/rp-ext/-/raw/main/redpillprod/src/check-redpill.sh",
      "sha256": "60825be580f1d152885b20a9210baf546fa10df70f0ec1d28fc25e4cfafa20bf",
      "packed": false
    }
  ],

  "kmods": {
    "redpill.ko": ""
  },

    "scripts": {
    "on_boot": "check-redpill.sh"
  }

}
