{
  "mod_version": "v1",

  "files": [
    {
      "name": "hv_netvsc-4.4.180plus-v1000.tgz",
      "url": "https://gitlab.com/tinypill/pocopico/rp-ext/-/raw/main/hv_netvsc/releases/hv_netvsc-4.4.180plus-v1000.tgz",
      "sha256": "1435f43bc67745a69e9066048bd7305e21247e7305ad2a55a3bf1ca0868bc645",
      "packed": true
    },
    {
      "name": "check-hv_netvsc.sh",
      "url": "https://gitlab.com/tinypill/pocopico/rp-ext/-/raw/main/hv_netvsc/src/check-hv_netvsc.sh",
      "sha256": "62053d1fa65851812db307c69f2cff39e62408b7e423c5a41433fb79104b0e05",
      "packed": false
    }
  ],

  "kmods": {
    "hv_netvsc.ko": ""
  },

    "scripts": {
    "on_boot": "check-hv_netvsc.sh"
  }

}
