{
  "mod_version": "v1",

  "files": [
    {
      "name": "i40e-4.4.180plus-geminilake.tgz",
      "url": "https://gitlab.com/tinypill/pocopico/rp-ext/-/raw/main/i40e/releases/i40e-4.4.180plus-geminilake.tgz",
      "sha256": "755fe6f45764f0e46e6f20fa8194cc4f87573c7f009f48c09df3d4cb01e207cd",
      "packed": true
    },
    {
      "name": "check-i40e.sh",
      "url": "https://gitlab.com/tinypill/pocopico/rp-ext/-/raw/main/i40e/src/check-i40e.sh",
      "sha256": "11901e8f70ed4e17354b306dddc36bbe2548d33e9e7a000ddf5625e17052f2c1",
      "packed": false
    }
  ],

  "kmods": {
    "vxlan.ko": "",
    "i40e.ko":""
  },

    "scripts": {
    "on_boot": "check-i40e.sh"
  }

}
