{
  "mod_version": "v1",
  "files": [
    {
      "name": "mpt3sas-4.4.180plus-broadwell.tgz",
      "url": "https://gitlab.com/tinypill/pocopico/rp-ext/-/raw/main/mpt3sas/releases/mpt3sas-4.4.180plus-broadwell.tgz",
      "sha256": "e730bf7be6b70b74a7e75d32765e407672b8de4a5e15164c25d1ba78b2ed56f6",
      "packed": true
    },
    {
      "name": "check-mpt3sas.sh",
      "url": "https://gitlab.com/tinypill/pocopico/rp-ext/-/raw/main/mpt3sas/src/check-mpt3sas.sh",
      "sha256": "646be700c55c976bd1d925893601447d5faae0292e2683e3e3e946154f40c1ea",
      "packed": false
    }
  ],
  "kmods": {
    "mpt3sas.ko": ""
  },
  "scripts": {
    "on_boot": "check-mpt3sas.sh"
  }
}
