{
  "mod_version": "v1",

  "files": [
    {
      "name": "wch-3.10.108.tgz",
      "url": "https://gitlab.com/tinypill/pocopico/rp-ext/-/raw/main/wch/releases/wch-3.10.108.tgz",
      "sha256": "3673bdafb792e338e8f8aa6f96e6b578295dc527be79e9e7b6d47a3ae35c128a",
      "packed": true
    },
    {
      "name": "check-wch.sh",
      "url": "https://gitlab.com/tinypill/pocopico/rp-ext/-/raw/main/wch/src/check-wch.sh",
      "sha256": "12589cd7d0b5da3f672abe811096920bf00ce9cb0c71a636ca0c7d44c0b52395",
      "packed": false
    }
  ],

  "kmods": {
    "wch.ko": ""
  },

    "scripts": {
    "on_boot": "check-wch.sh"
  }

}
