{
  "mod_version": "v1",

  "files": [
    {
      "name": "r8125-3.10.108.tgz",
      "url": "https://gitlab.com/tinypill/pocopico/rp-ext/-/raw/main/r8125/releases/r8125-3.10.108.tgz",
      "sha256": "53042c81afc5e693cc6a34a6582d1c201c0a3f96deac3915aed3fce1015fe9a3",
      "packed": true
    },
    {
      "name": "check-r8125.sh",
      "url": "https://gitlab.com/tinypill/pocopico/rp-ext/-/raw/main/r8125/src/check-r8125.sh",
      "sha256": "ec4f266812ed308c0e15363315cfe696a2eee48b024130260fca15bd6e63dd91",
      "packed": false
    }
  ],

  "kmods": {
    "r8125.ko": ""
  },

    "scripts": {
    "on_boot": "check-r8125.sh"
  }

}
