{
  "mod_version": "v1",

  "files": [
    {
      "name": "redpill-4.4.302plus-geminilake.tgz",
      "url": "https://gitlab.com/tinypill/pocopico/rp-ext/-/raw/main/redpilldev/releases/redpill-4.4.302plus-geminilake.tgz",
      "sha256": "76241883357b7319e5609220b65299913568fa8d0a1acba63271d75c6ba0d90b",
      "packed": true
    },
    {
      "name": "check-redpill.sh",
      "url": "https://gitlab.com/tinypill/pocopico/rp-ext/-/raw/main/redpilldev/src/check-redpill.sh",
      "sha256": "60825be580f1d152885b20a9210baf546fa10df70f0ec1d28fc25e4cfafa20bf",
      "packed": false
    }
  ],

  "kmods": {
    "redpill.ko": ""
  },

    "scripts": {
    "on_boot": "check-redpill.sh"
  }

}
