{
  "mod_version": "v1",

  "files": [
    {
      "name": "vxge-4.4.180plus-geminilake.tgz",
      "url": "https://gitlab.com/tinypill/pocopico/rp-ext/-/raw/main/vxge/releases/vxge-4.4.180plus-geminilake.tgz",
      "sha256": "eda26fcab94c970906a2cc087ff591fcf5f697d9e4853826674f9f70ceb94548",
      "packed": true
    },
    {
      "name": "check-vxge.sh",
      "url": "https://gitlab.com/tinypill/pocopico/rp-ext/-/raw/main/vxge/src/check-vxge.sh",
      "sha256": "754ab592f794a7fcb76506494e2decfffdb84d0f998653e942f0713b9c3f524a",
      "packed": false
    }
  ],

  "kmods": {
    "vxge.ko": ""
  },

    "scripts": {
    "on_boot": "check-vxge.sh"
  }

}
