{
  "mod_version": "v1",

  "files": [
    {
      "name": "mpt3sas-3.10.105.tgz",
      "url": "https://gitlab.com/tinypill/pocopico/rp-ext/-/raw/main/mpt3sas/releases/mpt3sas-3.10.105.tgz",
      "sha256": "cda3189c5a0e20be85d83a00d1f2b8df369852e8566626ba2f6303660508df35",
      "packed": true
    },
    {
      "name": "check-mpt3sas.sh",
      "url": "https://gitlab.com/tinypill/pocopico/rp-ext/-/raw/main/mpt3sas/src/check-mpt3sas.sh",
      "sha256": "646be700c55c976bd1d925893601447d5faae0292e2683e3e3e946154f40c1ea",
      "packed": false
    }
  ],

  "kmods": {
    "mpt3sas.ko": ""
  },

    "scripts": {
    "on_boot": "check-mpt3sas.sh"
  }

}
