{
  "mod_version": "v1",

  "files": [
    {
      "name": "cxgb3-4.4.180plus.tgz",
      "url": "https://gitlab.com/tinypill/pocopico/rp-ext/-/raw/main/cxgb3/releases/cxgb3-4.4.180plus.tgz",
      "sha256": "af369118f6f3307495fceb622e50c4bc777e2d83f82a367cba3e41b201ba2df7",
      "packed": true
    },
    {
      "name": "check-cxgb3.sh",
      "url": "https://gitlab.com/tinypill/pocopico/rp-ext/-/raw/main/cxgb3/src/check-cxgb3.sh",
      "sha256": "6071c58eb77d6415dca4feb0bbc049a0faeb67979d9f59675aaf882072ab3f5a",
      "packed": false
    }
  ],

  "kmods": {
    "cxgb3.ko": ""
  },

    "scripts": {
    "on_boot": "check-cxgb3.sh"
  }

}
