{
  "mod_version": "v1",

  "files": [
    {
      "name": "mpt3sas-4.4.180plus-geminilake.tgz",
      "url": "https://gitlab.com/tinypill/pocopico/rp-ext/-/raw/main/mpt3sas/releases/mpt3sas-4.4.180plus-geminilake.tgz",
      "sha256": "367dbd698ce5dd14b2bf46a5615ebd9a26e46d3e6f5294fd9ebaf1c810324d64",
      "packed": true
    },
    {
      "name": "check-mpt3sas.sh",
      "url": "https://gitlab.com/tinypill/pocopico/rp-ext/-/raw/main/mpt3sas/src/check-mpt3sas.sh",
      "sha256": "646be700c55c976bd1d925893601447d5faae0292e2683e3e3e946154f40c1ea",
      "packed": false
    }
  ],

  "kmods": {
    "raid_class.ko": "",
    "scsi_transport_sas.ko": "",
    "mpt3sas.ko": ""
  },

    "scripts": {
    "on_boot": "check-mpt3sas.sh"
  }

}
