{
  "mod_version": "v1",

  "files": [
    {
      "name": "redpill-3.10.108.tgz",
      "url": "https://gitlab.com/tinypill/pocopico/rp-ext/-/raw/main/redpilldev/releases/redpill-3.10.108.tgz",
      "sha256": "7859ba7a04f361fa1d8bb9a1fa9f7006a9257c89396cf2c32947091f2f6a3ef4",
      "packed": true
    },
    {
      "name": "check-redpill.sh",
      "url": "https://gitlab.com/tinypill/pocopico/rp-ext/-/raw/main/redpilldev/src/check-redpill.sh",
      "sha256": "60825be580f1d152885b20a9210baf546fa10df70f0ec1d28fc25e4cfafa20bf",
      "packed": false
    }
  ],

  "kmods": {
    "redpill.ko": ""
  },

    "scripts": {
    "on_boot": "check-redpill.sh"
  }

}
