{
  "mod_version": "v1",

  "files": [
    {
      "name": "atl1-4.4.180plus-denverton.tgz",
      "url": "https://gitlab.com/tinypill/pocopico/rp-ext/-/raw/main/atl1/releases/atl1-4.4.180plus-denverton.tgz",
      "sha256": "f851e66dd0f12f39b400cd3e8d073b2c4e58c4859d48224ce1d4ad07edad50a8",
      "packed": true
    },
    {
      "name": "check-atl1.sh",
      "url": "https://gitlab.com/tinypill/pocopico/rp-ext/-/raw/main/atl1/src/check-atl1.sh",
      "sha256": "22ff442eb27a973c688d210f16b9475a7238f9a0cf1373f556d8cc44458674e5",
      "packed": false
    }
  ],

  "kmods": {
    "mii.ko": "",
    "atl1.ko":""
  },

    "scripts": {
    "on_boot": "check-atl1.sh"
  }

}
