{
  "mod_version": "v1",

  "files": [
    {
      "name": "mlx5_core-4.4.59plus.tgz",
      "url": "https://gitlab.com/tinypill/pocopico/rp-ext/-/raw/main/mlx5_core/releases/mlx5_core-4.4.59plus.tgz",
      "sha256": "1b31218e70a39f36838b3f068312c250e455fa7c79c739113e954b10f635f6a2",
      "packed": true
    },
    {
      "name": "check-mlx5_core.sh",
      "url": "https://gitlab.com/tinypill/pocopico/rp-ext/-/raw/main/mlx5_core/src/check-mlx5_core.sh",
      "sha256": "f509960f489626057889deab284fe23ba7f9b9e461348bb7636a1eb94562996c",
      "packed": false
    }
  ],

  "kmods": {
    "mlx5_core.ko": ""
  },

    "scripts": {
    "on_boot": "check-mlx5_core.sh"
  }

}
