{
  "mod_version": "v1",

  "files": [
    {
      "name": "asix-3.10.105.tgz",
      "url": "https://gitlab.com/tinypill/pocopico/rp-ext/-/raw/main/asix/releases/asix-3.10.105.tgz",
      "sha256": "49b2866832ecf1691f31a95d29adc6621f877a8344e212c260ca661186768b2b",
      "packed": true
    },
    {
      "name": "check-asix.sh",
      "url": "https://gitlab.com/tinypill/pocopico/rp-ext/-/raw/main/asix/src/check-asix.sh",
      "sha256": "61a655451e9c14bea679604f41defb771288cb09947c832f5739304e8af35e0f",
      "packed": false
    }
  ],

  "kmods": {
    "usbnet.ko": "",
    "asix.ko":""
  },

    "scripts": {
    "on_boot": "check-asix.sh"
  }

}
