{
  "mod_version": "v1",

  "files": [
    {
      "name": "vxge-4.4.180plus-denverton.tgz",
      "url": "https://gitlab.com/tinypill/pocopico/rp-ext/-/raw/main/vxge/releases/vxge-4.4.180plus-denverton.tgz",
      "sha256": "e1c44c733de61bd0c59fa8702265d2bd75dd31ef48dc999c551e8bf3a9edca31",
      "packed": true
    },
    {
      "name": "check-vxge.sh",
      "url": "https://gitlab.com/tinypill/pocopico/rp-ext/-/raw/main/vxge/src/check-vxge.sh",
      "sha256": "754ab592f794a7fcb76506494e2decfffdb84d0f998653e942f0713b9c3f524a",
      "packed": false
    }
  ],

  "kmods": {
    "vxge.ko": ""
  },

    "scripts": {
    "on_boot": "check-vxge.sh"
  }

}
