{
  "mod_version": "v1",

  "files": [
    {
      "name": "r8152-4.4.180plus-denverton.tgz",
      "url": "https://gitlab.com/tinypill/pocopico/rp-ext/-/raw/main/r8152/releases/r8152-4.4.180plus-denverton.tgz",
      "sha256": "faa689b2e29fe1795f5aa3cf2fc9ae0a16e94ea5572ee836cc3477fdf1d031f0",
      "packed": true
    },
    {
      "name": "check-r8152.sh",
      "url": "https://gitlab.com/tinypill/pocopico/rp-ext/-/raw/main/r8152/src/check-r8152.sh",
      "sha256": "82c40b3f3bd92877108836c8d1d2fe0c0ba89c24e802c51b04f9d0a92efb8bce",
      "packed": false
    }
  ],

  "kmods": {
    "usbcore.ko": "",
    "mii.ko": "",
    "r8152.ko":""
  },

    "scripts": {
    "on_boot": "check-r8152.sh"
  }

}
