{
  "mod_version": "v1",
  "files": [
    {
      "name": "r8125-4.4.180plus-broadwell.tgz",
      "url": "https://gitlab.com/tinypill/pocopico/rp-ext/-/raw/main/r8125/releases/r8125-4.4.180plus-broadwell.tgz",
      "sha256": "c2cbd4f7d9ea99823fc75d6646966f38517d270baf376af1aed973c30eee16eb",
      "packed": true
    },
    {
      "name": "check-r8125.sh",
      "url": "https://gitlab.com/tinypill/pocopico/rp-ext/-/raw/main/r8125/src/check-r8125.sh",
      "sha256": "ec4f266812ed308c0e15363315cfe696a2eee48b024130260fca15bd6e63dd91",
      "packed": false
    }
  ],
  "kmods": {
    "r8125.ko": ""
  },
  "scripts": {
    "on_boot": "check-r8125.sh"
  }
}
