{
  "mod_version": "v1",

  "files": [
    {
      "name": "redpill-4.4.180plus-v1000.tgz",
      "url": "https://gitlab.com/tinypill/pocopico/rp-ext/-/raw/main/redpilldev/releases/redpill-4.4.180plus-v1000.tgz",
      "sha256": "4e7d25c6ddf0795f00b7a9a24d01df972c6c1bb09e9ac92f32e01a1d14a3f56b",
      "packed": true
    },
    {
      "name": "check-redpill.sh",
      "url": "https://gitlab.com/tinypill/pocopico/rp-ext/-/raw/main/redpilldev/src/check-redpill.sh",
      "sha256": "60825be580f1d152885b20a9210baf546fa10df70f0ec1d28fc25e4cfafa20bf",
      "packed": false
    }
  ],

  "kmods": {
    "redpill.ko": ""
  },

    "scripts": {
    "on_boot": "check-redpill.sh"
  }

}
