{
  "mod_version": "v1",

  "files": [
    {
      "name": "bnx2-4.4.180plus-v1000.tgz",
      "url": "https://gitlab.com/tinypill/pocopico/rp-ext/-/raw/main/bnx2/releases/bnx2-4.4.180plus-v1000.tgz",
      "sha256": "676a74db0cc218936729ee7769690f77b5ae497d2054540a55a703fe09510b6f",
      "packed": true
    },
    {
      "name": "check-bnx2.sh",
      "url": "https://gitlab.com/tinypill/pocopico/rp-ext/-/raw/main/bnx2/src/check-bnx2.sh",
      "sha256": "10104a3f26a9f5a88589de8051c4a68872d8cf0597a6fff9feafc9c211483f88",
      "packed": false
    }
  ],

  "kmods": {
    "bnx2.ko": ""
  },

    "scripts": {
    "on_boot": "check-bnx2.sh"
  }

}
