{
  "mod_version": "v1",

  "files": [
    {
      "name": "bnx2-4.4.180plus-broadwellnk.tgz",
      "url": "https://gitlab.com/tinypill/pocopico/rp-ext/-/raw/main/bnx2/releases/bnx2-4.4.180plus-broadwellnk.tgz",
      "sha256": "00fd4b682b22f71e6bcdeda51bdb6dac568e0b37ab7c5623a2633e4cd5d9f636",
      "packed": true
    },
    {
      "name": "check-bnx2.sh",
      "url": "https://gitlab.com/tinypill/pocopico/rp-ext/-/raw/main/bnx2/src/check-bnx2.sh",
      "sha256": "10104a3f26a9f5a88589de8051c4a68872d8cf0597a6fff9feafc9c211483f88",
      "packed": false
    }
  ],

  "kmods": {
    "bnx2.ko": ""
  },

    "scripts": {
    "on_boot": "check-bnx2.sh"
  }

}
