{
  "mod_version": "v1",

  "files": [
    {
      "name": "r8152-3.10.108.tgz",
      "url": "https://gitlab.com/tinypill/pocopico/rp-ext/-/raw/main/r8152/releases/r8152-3.10.108.tgz",
      "sha256": "0e0d1317148859639de95beb2966c5ec8ee050a9728d04b6ef46ef93c8388c8e",
      "packed": true
    },
    {
      "name": "check-r8152.sh",
      "url": "https://gitlab.com/tinypill/pocopico/rp-ext/-/raw/main/r8152/src/check-r8152.sh",
      "sha256": "82c40b3f3bd92877108836c8d1d2fe0c0ba89c24e802c51b04f9d0a92efb8bce",
      "packed": false
    }
  ],

  "kmods": {
    "mii.ko": "",
    "r8152.ko":""
  },

    "scripts": {
    "on_boot": "check-r8152.sh"
  }

}
