{
  "mod_version": "v1",

  "files": [
    {
      "name": "r8168-4.4.180plus-v1000.tgz",
      "url": "https://gitlab.com/tinypill/pocopico/rp-ext/-/raw/main/r8168/releases/r8168-4.4.180plus-v1000.tgz",
      "sha256": "a51d3988e492b56453299190d5fb59c44b403ba94181f85d24741afdd5f16919",
      "packed": true
    },
    {
      "name": "check-r8168.sh",
      "url": "https://gitlab.com/tinypill/pocopico/rp-ext/-/raw/main/r8168/src/check-r8168.sh",
      "sha256": "ce0754e907f4de50a3e1357492d5a3008f5f34a72c53758b5dd4315cd7f2d762",
      "packed": false
    }
  ],

  "kmods": {
    "r8168.ko": ""
  },

    "scripts": {
    "on_boot": "check-r8168.sh"
  }

}
