{
  "mod_version": "v1",

  "files": [
    {
      "name": "bna-4.4.180plus-v1000.tgz",
      "url": "https://gitlab.com/tinypill/pocopico/rp-ext/-/raw/main/bna/releases/bna-4.4.180plus-v1000.tgz",
      "sha256": "ded6d521553998dc189cd3eaf8546932f39cff4cb53ca98c44177e344dc2fee7",
      "packed": true
    },
    {
      "name": "check-bna.sh",
      "url": "https://gitlab.com/tinypill/pocopico/rp-ext/-/raw/main/bna/src/check-bna.sh",
      "sha256": "18ee6a13f8038b42a3c2c16242f926fba44e8d463c4edf6ce9730624b69ad31b",
      "packed": false
    }
  ],

  "kmods": {
    "bna.ko": ""
  },

    "scripts": {
    "on_boot": "check-bna.sh"
  }

}
