{
  "mod_version": "v1",

  "files": [
    {
      "name": "r8169-3.10.108.tgz",
      "url": "https://gitlab.com/tinypill/pocopico/rp-ext/-/raw/main/r8169/releases/r8169-3.10.108.tgz",
      "sha256": "2c85a42c102e6e123060c0170d5e700a9b17d9d16608640848fcebe4c91d8f9a",
      "packed": true
    },
    {
      "name": "check-r8169.sh",
      "url": "https://gitlab.com/tinypill/pocopico/rp-ext/-/raw/main/r8169/src/check-r8169.sh",
      "sha256": "d9d57d704d83fdb3eaba72096511ba6b43a44da014ffa4b079dcaced3a9005a0",
      "packed": false
    }
  ],

  "kmods": {
    "mii.ko": "",
    "r8169.ko":""
  },

    "scripts": {
    "on_boot": "check-r8169.sh"
  }

}
