{
  "mod_version": "v1",

  "files": [
    {
      "name": "i40e-3.10.105.tgz",
      "url": "https://gitlab.com/tinypill/pocopico/rp-ext/-/raw/main/i40e/releases/i40e-3.10.105.tgz",
      "sha256": "adbdef011246b1f721102a4c0c890979a65435ff65c683c69a71018c6c75e73d",
      "packed": true
    },
    {
      "name": "check-i40e.sh",
      "url": "https://gitlab.com/tinypill/pocopico/rp-ext/-/raw/main/i40e/src/check-i40e.sh",
      "sha256": "11901e8f70ed4e17354b306dddc36bbe2548d33e9e7a000ddf5625e17052f2c1",
      "packed": false
    }
  ],

  "kmods": {
    "i40e.ko": ""
  },

    "scripts": {
    "on_boot": "check-i40e.sh"
  }

}
