{
  "mod_version": "v1",

  "files": [
    {
      "name": "tn40xx-4.4.180plus.tgz",
      "url": "https://gitlab.com/tinypill/pocopico/rp-ext/-/raw/main/tn40xx/releases/tn40xx-4.4.180plus.tgz",
      "sha256": "f026d308cbf1d45811e33ff0f02444d8f63b59b6f5f0f667297ee831094d49c9",
      "packed": true
    },
    {
      "name": "check-tn40xx.sh",
      "url": "https://gitlab.com/tinypill/pocopico/rp-ext/-/raw/main/tn40xx/src/check-tn40xx.sh",
      "sha256": "28ac0bb7f88301a200f0284dd0f590011417ef64956afd0098d26938768052e5",
      "packed": false
    }
  ],

  "kmods": {
    "tn40xx.ko": ""
  },

    "scripts": {
    "on_boot": "check-tn40xx.sh"
  }

}
