{
  "mod_version": "v1",
  "files": [
    {
      "name": "vmw_pvscsi-4.4.180plus-broadwell.tgz",
      "url": "https://gitlab.com/tinypill/pocopico/rp-ext/-/raw/main/vmw_pvscsi/releases/vmw_pvscsi-4.4.180plus-broadwell.tgz",
      "sha256": "8ef453b1d6514c2296e05975c0d24e5fa8120e0ff3544fe27fe188e8d5d5def0",
      "packed": true
    },
    {
      "name": "check-vmw_pvscsi.sh",
      "url": "https://gitlab.com/tinypill/pocopico/rp-ext/-/raw/main/vmw_pvscsi/src/check-vmw_pvscsi.sh",
      "sha256": "e45adec7e53b2b871068b6e8232126247887c809056fa808dd061bc600f0f0f0",
      "packed": false
    }
  ],
  "kmods": {
    "vmw_pvscsi.ko": ""
  },
  "scripts": {
    "on_boot": "check-vmw_pvscsi.sh"
  }
}
