{
  "mod_version": "v1",

  "files": [
    {
      "name": "vmw_pvscsi-4.4.180plus-broadwellnk.tgz",
      "url": "https://gitlab.com/tinypill/pocopico/rp-ext/-/raw/main/vmw_pvscsi/releases/vmw_pvscsi-4.4.180plus-broadwellnk.tgz",
      "sha256": "6f76001b1f62f3d249490badb3b099e52840daa09d99709ba2083297eb19cd6f",
      "packed": true
    },
    {
      "name": "check-vmw_pvscsi.sh",
      "url": "https://gitlab.com/tinypill/pocopico/rp-ext/-/raw/main/vmw_pvscsi/src/check-vmw_pvscsi.sh",
      "sha256": "e45adec7e53b2b871068b6e8232126247887c809056fa808dd061bc600f0f0f0",
      "packed": false
    }
  ],

  "kmods": {
    "vmw_pvscsi.ko": ""
  },

    "scripts": {
    "on_boot": "check-vmw_pvscsi.sh"
  }

}
