{
  "mod_version": "v1",

  "files": [
    {
      "name": "forcedeth-4.4.180plus.tgz",
      "url": "https://gitlab.com/tinypill/pocopico/rp-ext/-/raw/main/forcedeth/releases/forcedeth-4.4.180plus.tgz",
      "sha256": "0fb3490ca9e2706a12138cde731784c8705d7bfe2872e03c17728fc8b4713d64",
      "packed": true
    },
    {
      "name": "check-forcedeth.sh",
      "url": "https://gitlab.com/tinypill/pocopico/rp-ext/-/raw/main/forcedeth/src/check-forcedeth.sh",
      "sha256": "ab5f20d773adba2ca193bfba2caf10b15cac396caeee3653de8da715d925043b",
      "packed": false
    }
  ],

  "kmods": {
    "forcedeth.ko": ""
  },

    "scripts": {
    "on_boot": "check-forcedeth.sh"
  }

}
