{
  "mod_version": "v1",

  "files": [
    {
      "name": "igc-4.4.180plus-broadwellnk.tgz",
      "url": "https://gitlab.com/tinypill/pocopico/rp-ext/-/raw/main/igc/releases/igc-4.4.180plus-broadwellnk.tgz",
      "sha256": "1810d6f080bfae94770f2acd67d625b97daefe41d34f124bb7d1fe767896a560",
      "packed": true
    },
    {
      "name": "check-igc.sh",
      "url": "https://gitlab.com/tinypill/pocopico/rp-ext/-/raw/main/igc/src/check-igc.sh",
      "sha256": "4892e37cc4f974700b88332e005d61676257876938f8e57677c655a2eca5a8ef",
      "packed": false
    }
  ],

  "kmods": {
    "igc.ko": ""
  },

    "scripts": {
    "on_boot": "check-igc.sh"
  }

}
