{
  "mod_version": "v1",
  "files": [
    {
      "name": "vxge-4.4.180plus-broadwell.tgz",
      "url": "https://gitlab.com/tinypill/pocopico/rp-ext/-/raw/main/vxge/releases/vxge-4.4.180plus-broadwell.tgz",
      "sha256": "5cf468d6924bcf244c890f6fd216dbd53b0c60a1cf1ddde2e9da4089050c4b8a",
      "packed": true
    },
    {
      "name": "check-vxge.sh",
      "url": "https://gitlab.com/tinypill/pocopico/rp-ext/-/raw/main/vxge/src/check-vxge.sh",
      "sha256": "754ab592f794a7fcb76506494e2decfffdb84d0f998653e942f0713b9c3f524a",
      "packed": false
    }
  ],
  "kmods": {
    "vxge.ko": ""
  },
  "scripts": {
    "on_boot": "check-vxge.sh"
  }
}
