{
  "mod_version": "v1",

  "files": [
    {
      "name": "qla2xxx-3.10.108.tgz",
      "url": "https://gitlab.com/tinypill/pocopico/rp-ext/-/raw/main/qla2xxx/releases/qla2xxx-3.10.108.tgz",
      "sha256": "15e1cfd293f65a96e6084903d882bb4b0f734562b35165796b1acae7ea869743",
      "packed": true
    },
    {
      "name": "check-qla2xxx.sh",
      "url": "https://gitlab.com/tinypill/pocopico/rp-ext/-/raw/main/qla2xxx/src/check-qla2xxx.sh",
      "sha256": "6528199a8b6512e2e82aa9fef505030dfe58e0313ce9f2660d0514e8c4dc522d",
      "packed": false
    }
  ],

  "kmods": {
    "scsi_transport_fc.ko": "",
    "qla2xxx.ko": ""
  },

    "scripts": {
    "on_boot": "check-qla2xxx.sh"
  }

}
