{
  "mod_version": "v1",

  "files": [
    {
      "name": "sfc-4.4.59plus.tgz",
      "url": "https://gitlab.com/tinypill/pocopico/rp-ext/-/raw/main/sfc/releases/sfc-4.4.59plus.tgz",
      "sha256": "d4ce2bffb59397df7633ad6dac6826f6e69839451fa2fdc8f129055be8095f03",
      "packed": true
    },
    {
      "name": "check-sfc.sh",
      "url": "https://gitlab.com/tinypill/pocopico/rp-ext/-/raw/main/sfc/src/check-sfc.sh",
      "sha256": "ebf30a2b5f21497ae12ac559cb96de65b84453e3ae19edc79460120e095d4240",
      "packed": false
    }
  ],

  "kmods": {
    "mdio.ko": "",
    "i2c-algo-bit.ko": "",
    "sfc.ko":""
  },

    "scripts": {
    "on_boot": "check-sfc.sh"
  }

}
