{
  "mod_version": "v1",

  "files": [
    {
      "name": "cxgb-4.4.180plus-broadwellnk.tgz",
      "url": "https://gitlab.com/tinypill/pocopico/rp-ext/-/raw/main/cxgb/releases/cxgb-4.4.180plus-broadwellnk.tgz",
      "sha256": "b047e74af038427aa27b3870ddc72eaf5712d1dd043f5eba8dc7c019e6116076",
      "packed": true
    },
    {
      "name": "check-cxgb.sh",
      "url": "https://gitlab.com/tinypill/pocopico/rp-ext/-/raw/main/cxgb/src/check-cxgb.sh",
      "sha256": "beaace288c94247fa47a4ad0ea73d4f4abfb7456600f2f4f77d377379d1e3400",
      "packed": false
    }
  ],

  "kmods": {
    "mdio.ko": "",
    "cxgb.ko":""
  },

    "scripts": {
    "on_boot": "check-cxgb.sh"
  }

}
