{
  "mod_version": "v1",

  "files": [
    {
      "name": "3w-sas-4.4.59plus.tgz",
      "url": "https://gitlab.com/tinypill/pocopico/rp-ext/-/raw/main/3w-sas/releases/3w-sas-4.4.59plus.tgz",
      "sha256": "ef7468d2a448a6d4de7beec20f9e794134d256d8c9b34e3ff3da14c764692c87",
      "packed": true
    },
    {
      "name": "check-3w-sas.sh",
      "url": "https://gitlab.com/tinypill/pocopico/rp-ext/-/raw/main/3w-sas/src/check-3w-sas.sh",
      "sha256": "918a66c241bf48dcc71af587f038206ac4d8b87ab58b5954c9c9edddd6cd4b5f",
      "packed": false
    }
  ],

  "kmods": {
    "3w-sas.ko": ""
  },

    "scripts": {
    "on_boot": "check-3w-sas.sh"
  }

}
