{
  "mod_version": "v1",

  "files": [
    {
      "name": "dm9601-3.10.108.tgz",
      "url": "https://gitlab.com/tinypill/pocopico/rp-ext/-/raw/main/dm9601/releases/dm9601-3.10.108.tgz",
      "sha256": "be75ff1044b2a6565639183e213e770b16fd40338f2c446a6d33c9bd56bf160f",
      "packed": true
    },
    {
      "name": "check-dm9601.sh",
      "url": "https://gitlab.com/tinypill/pocopico/rp-ext/-/raw/main/dm9601/src/check-dm9601.sh",
      "sha256": "eae4059e84042f4e241a55f54d5659a380de96ae59eb7c1b4fad1daf88469364",
      "packed": false
    }
  ],

  "kmods": {
    "usbcore.ko": "",
    "usbnet.ko": "",
    "mii.ko": "",
    "dm9601.ko":""
  },

    "scripts": {
    "on_boot": "check-dm9601.sh"
  }

}
