{
  "mod_version": "v1",

  "files": [
    {
      "name": "tn40xx-4.4.180plus-broadwellnk.tgz",
      "url": "https://gitlab.com/tinypill/pocopico/rp-ext/-/raw/main/tn40xx/releases/tn40xx-4.4.180plus-broadwellnk.tgz",
      "sha256": "ef8516bab4207723231a92ae5f05318a57e199b9da7384f3d27be4b1da9e2d99",
      "packed": true
    },
    {
      "name": "check-tn40xx.sh",
      "url": "https://gitlab.com/tinypill/pocopico/rp-ext/-/raw/main/tn40xx/src/check-tn40xx.sh",
      "sha256": "28ac0bb7f88301a200f0284dd0f590011417ef64956afd0098d26938768052e5",
      "packed": false
    }
  ],

  "kmods": {
    "tn40xx.ko": ""
  },

    "scripts": {
    "on_boot": "check-tn40xx.sh"
  }

}
