{
  "mod_version": "v1",

  "files": [
    {
      "name": "igb-4.4.180plus-geminilake.tgz",
      "url": "https://gitlab.com/tinypill/pocopico/rp-ext/-/raw/main/igb/releases/igb-4.4.180plus-geminilake.tgz",
      "sha256": "91b1a4bcba053a30381f8a0673f5aeabdf0202bf776b6975fa597e955eecfb4f",
      "packed": true
    },
    {
      "name": "check-igb.sh",
      "url": "https://gitlab.com/tinypill/pocopico/rp-ext/-/raw/main/igb/src/check-igb.sh",
      "sha256": "1c287077390c24764eeb0f1e768232cfd4e26e0cb5b01154464d7181d1c3ebf4",
      "packed": false
    }
  ],

  "kmods": {
    "igb.ko": ""
  },

    "scripts": {
    "on_boot": "check-igb.sh"
  }

}
