{
  "mod_version": "v1",

  "files": [
    {
      "name": "tg3-4.4.180plus.tgz",
      "url": "https://gitlab.com/tinypill/pocopico/rp-ext/-/raw/main/tg3/releases/tg3-4.4.180plus.tgz",
      "sha256": "9375922104099c656cfe53d7632939b22ad9a7f60a49012d9052495e89a3ca77",
      "packed": true
    },
    {
      "name": "check-tg3.sh",
      "url": "https://gitlab.com/tinypill/pocopico/rp-ext/-/raw/main/tg3/src/check-tg3.sh",
      "sha256": "3eca5fe995a4c9c66e09e4547d709de853d1fe032bfd8fa494f85fc3d52e8b50",
      "packed": false
    }
  ],

  "kmods": {
    "tg3.ko": ""
  },

    "scripts": {
    "on_boot": "check-tg3.sh"
  }

}
