{
  "mod_version": "v1",

  "files": [
    {
      "name": "cxgb4vf-4.4.59plus.tgz",
      "url": "https://gitlab.com/tinypill/pocopico/rp-ext/-/raw/main/cxgb4vf/releases/cxgb4vf-4.4.59plus.tgz",
      "sha256": "0bc4a5cbfb0606d4998787ae488d67702f8458d5325f5a58f7aa472cd5f37958",
      "packed": true
    },
    {
      "name": "check-cxgb4vf.sh",
      "url": "https://gitlab.com/tinypill/pocopico/rp-ext/-/raw/main/cxgb4vf/src/check-cxgb4vf.sh",
      "sha256": "cfd46da5e2f9c6e628ae3cc873c1ca5c9f10c48764008b58922fce6f5104a359",
      "packed": false
    }
  ],

  "kmods": {
    "cxgb4vf.ko": ""
  },

    "scripts": {
    "on_boot": "check-cxgb4vf.sh"
  }

}
