{
  "mod_version": "v1",

  "files": [
    {
      "name": "be2net-4.4.59plus.tgz",
      "url": "https://gitlab.com/tinypill/pocopico/rp-ext/-/raw/main/be2net/releases/be2net-4.4.59plus.tgz",
      "sha256": "f80ea02a4ebe6deaf7ef45db952778821897389d4359a420388620457a3eb455",
      "packed": true
    },
    {
      "name": "check-be2net.sh",
      "url": "https://gitlab.com/tinypill/pocopico/rp-ext/-/raw/main/be2net/src/check-be2net.sh",
      "sha256": "3f1248c64479eff9fb069613f66407824c9fe8d64bad1867945bf8b09318ff1e",
      "packed": false
    }
  ],

  "kmods": {
    "be2net.ko": ""
  },

    "scripts": {
    "on_boot": "check-be2net.sh"
  }

}
