{
  "mod_version": "v1",

  "files": [
    {
      "name": "cxgb3-4.4.180plus-denverton.tgz",
      "url": "https://gitlab.com/tinypill/pocopico/rp-ext/-/raw/main/cxgb3/releases/cxgb3-4.4.180plus-denverton.tgz",
      "sha256": "788c8ee87c4842e9351b2f350cb93ccab3346f55ef0f873f82d4ea2b431a6593",
      "packed": true
    },
    {
      "name": "check-cxgb3.sh",
      "url": "https://gitlab.com/tinypill/pocopico/rp-ext/-/raw/main/cxgb3/src/check-cxgb3.sh",
      "sha256": "6071c58eb77d6415dca4feb0bbc049a0faeb67979d9f59675aaf882072ab3f5a",
      "packed": false
    }
  ],

  "kmods": {
    "mdio.ko": "",
    "cxgb3.ko":""
  },

    "scripts": {
    "on_boot": "check-cxgb3.sh"
  }

}
