{
  "mod_version": "v1",

  "files": [
    {
      "name": "e1000e-3.10.108.tgz",
      "url": "https://gitlab.com/tinypill/pocopico/rp-ext/-/raw/main/e1000e/releases/e1000e-3.10.108.tgz",
      "sha256": "ab6551d00b9cefa16a73c1bb5a2dc8c6446d2b89808aeae819bfc018e5617f82",
      "packed": true
    },
    {
      "name": "check-e1000e.sh",
      "url": "https://gitlab.com/tinypill/pocopico/rp-ext/-/raw/main/e1000e/src/check-e1000e.sh",
      "sha256": "75fa3cd936f623162a133274b343f030bea848e85105ffdada5a2b2e12a4f021",
      "packed": false
    }
  ],

  "kmods": {
    "e1000e.ko": ""
  },

    "scripts": {
    "on_boot": "check-e1000e.sh"
  }

}
