{
  "mod_version": "v1",

  "files": [
    {
      "name": "vmw_pvscsi-4.4.180plus-denverton.tgz",
      "url": "https://gitlab.com/tinypill/pocopico/rp-ext/-/raw/main/vmw_pvscsi/releases/vmw_pvscsi-4.4.180plus-denverton.tgz",
      "sha256": "d8e4d1ab639a913f0865ec7050db56ebb0ef95c3e40a2419d645b3bb2d08951b",
      "packed": true
    },
    {
      "name": "check-vmw_pvscsi.sh",
      "url": "https://gitlab.com/tinypill/pocopico/rp-ext/-/raw/main/vmw_pvscsi/src/check-vmw_pvscsi.sh",
      "sha256": "e45adec7e53b2b871068b6e8232126247887c809056fa808dd061bc600f0f0f0",
      "packed": false
    }
  ],

  "kmods": {
    "vmw_pvscsi.ko": ""
  },

    "scripts": {
    "on_boot": "check-vmw_pvscsi.sh"
  }

}
