{
  "mod_version": "v1",

  "files": [
    {
      "name": "via-velocity-4.4.180plus.tgz",
      "url": "https://gitlab.com/tinypill/pocopico/rp-ext/-/raw/main/via-velocity/releases/via-velocity-4.4.180plus.tgz",
      "sha256": "ae82e867a6edb0e062926e5abd7bc69c19f1085a019695b897dba15c239d3706",
      "packed": true
    },
    {
      "name": "check-via-velocity.sh",
      "url": "https://gitlab.com/tinypill/pocopico/rp-ext/-/raw/main/via-velocity/src/check-via-velocity.sh",
      "sha256": "43b3d64995e470968fe17d41a9de2451467b2240f967a00e9a92cd480e49e873",
      "packed": false
    }
  ],

  "kmods": {
    "crc-ccitt.ko": "",
    "via-velocity.ko":""
  },

    "scripts": {
    "on_boot": "check-via-velocity.sh"
  }

}
