{
  "mod_version": "v1",

  "files": [
    {
      "name": "atl1-3.10.105.tgz",
      "url": "https://gitlab.com/tinypill/pocopico/rp-ext/-/raw/main/atl1/releases/atl1-3.10.105.tgz",
      "sha256": "5a98aa8c04fd0223b2ab9da72a26bee21f5965934d6f0291d88ebc61f86a6eeb",
      "packed": true
    },
    {
      "name": "check-atl1.sh",
      "url": "https://gitlab.com/tinypill/pocopico/rp-ext/-/raw/main/atl1/src/check-atl1.sh",
      "sha256": "22ff442eb27a973c688d210f16b9475a7238f9a0cf1373f556d8cc44458674e5",
      "packed": false
    }
  ],

  "kmods": {
    "atl1.ko": ""
  },

    "scripts": {
    "on_boot": "check-atl1.sh"
  }

}
