{
  "mod_version": "v1",

  "files": [
    {
      "name": "atl1-4.4.180plus-geminilake.tgz",
      "url": "https://gitlab.com/tinypill/pocopico/rp-ext/-/raw/main/atl1/releases/atl1-4.4.180plus-geminilake.tgz",
      "sha256": "7efdb76ba989b1a3b600bf8cb949307901cd6823cf42f3d7f0e0108531f7bf3a",
      "packed": true
    },
    {
      "name": "check-atl1.sh",
      "url": "https://gitlab.com/tinypill/pocopico/rp-ext/-/raw/main/atl1/src/check-atl1.sh",
      "sha256": "22ff442eb27a973c688d210f16b9475a7238f9a0cf1373f556d8cc44458674e5",
      "packed": false
    }
  ],

  "kmods": {
    "mii.ko": "",
    "atl1.ko":""
  },

    "scripts": {
    "on_boot": "check-atl1.sh"
  }

}
