{
  "mod_version": "v1",

  "files": [
    {
      "name": "ax88179_178a-4.4.180plus-denverton.tgz",
      "url": "https://gitlab.com/tinypill/pocopico/rp-ext/-/raw/main/ax88179_178a/releases/ax88179_178a-4.4.180plus-denverton.tgz",
      "sha256": "d71b5387f30c74a71129aead46f996927667c4ff3c7598576c80a90d84286a0a",
      "packed": true
    },
    {
      "name": "check-ax88179_178a.sh",
      "url": "https://gitlab.com/tinypill/pocopico/rp-ext/-/raw/main/ax88179_178a/src/check-ax88179_178a.sh",
      "sha256": "a0d2839fe566a0b6d2275d11af7e6eb70c9c0b54282abee9321dd3b429a91282",
      "packed": false
    }
  ],

  "kmods": {
    "usbnet.ko": "",
    "usbcore.ko": "",
    "mii.ko": "",
    "ax88179_178a.ko":""
  },

    "scripts": {
    "on_boot": "check-ax88179_178a.sh"
  }

}
