{
  "mod_version": "v1",

  "files": [
    {
      "name": "via-velocity-3.10.105.tgz",
      "url": "https://gitlab.com/tinypill/pocopico/rp-ext/-/raw/main/via-velocity/releases/via-velocity-3.10.105.tgz",
      "sha256": "e1edea5d12a0abbed44109b65d8eb7dc595c5316bd5f12e80d4b333622e491e5",
      "packed": true
    },
    {
      "name": "check-via-velocity.sh",
      "url": "https://gitlab.com/tinypill/pocopico/rp-ext/-/raw/main/via-velocity/src/check-via-velocity.sh",
      "sha256": "43b3d64995e470968fe17d41a9de2451467b2240f967a00e9a92cd480e49e873",
      "packed": false
    }
  ],

  "kmods": {
    "via-velocity.ko": ""
  },

    "scripts": {
    "on_boot": "check-via-velocity.sh"
  }

}
