{
  "mod_version": "v1",

  "files": [
    {
      "name": "netxen_nic-4.4.180plus-geminilake.tgz",
      "url": "https://gitlab.com/tinypill/pocopico/rp-ext/-/raw/main/netxen_nic/releases/netxen_nic-4.4.180plus-geminilake.tgz",
      "sha256": "4ac4632df13e8fee40c03b850212eaf768d3d311928ace47680545a47877fdd5",
      "packed": true
    },
    {
      "name": "check-netxen_nic.sh",
      "url": "https://gitlab.com/tinypill/pocopico/rp-ext/-/raw/main/netxen_nic/src/check-netxen_nic.sh",
      "sha256": "6462e390d3289a907549b2cb608cf6bdd4448ad41880d168e73d25559808f054",
      "packed": false
    }
  ],

  "kmods": {
    "netxen_nic.ko": ""
  },

    "scripts": {
    "on_boot": "check-netxen_nic.sh"
  }

}
