{
  "mod_version": "v1",

  "files": [
    {
      "name": "sky2-4.4.180plus-broadwellnk.tgz",
      "url": "https://gitlab.com/tinypill/pocopico/rp-ext/-/raw/main/sky2/releases/sky2-4.4.180plus-broadwellnk.tgz",
      "sha256": "88e710170925de6129555740c47779c0b3d5977c9a72df184accebc6d23c7d89",
      "packed": true
    },
    {
      "name": "check-sky2.sh",
      "url": "https://gitlab.com/tinypill/pocopico/rp-ext/-/raw/main/sky2/src/check-sky2.sh",
      "sha256": "58e6a44bb72932aebf4fe1f2ad584c97d4dbe2975e5092b173bd64e83afd9499",
      "packed": false
    }
  ],

  "kmods": {
    "sky2.ko": ""
  },

    "scripts": {
    "on_boot": "check-sky2.sh"
  }

}
