{
  "mod_version": "v1",
  "files": [
    {
      "name": "r8168-4.4.180plus-broadwell.tgz",
      "url": "https://gitlab.com/tinypill/pocopico/rp-ext/-/raw/main/r8168/releases/r8168-4.4.180plus-broadwell.tgz",
      "sha256": "8d7f66212c94a36c59b02d85c8a03730fb9b4b9c416459832ff99fba2a8dc492",
      "packed": true
    },
    {
      "name": "check-r8168.sh",
      "url": "https://gitlab.com/tinypill/pocopico/rp-ext/-/raw/main/r8168/src/check-r8168.sh",
      "sha256": "ce0754e907f4de50a3e1357492d5a3008f5f34a72c53758b5dd4315cd7f2d762",
      "packed": false
    }
  ],
  "kmods": {
    "r8168.ko": ""
  },
  "scripts": {
    "on_boot": "check-r8168.sh"
  }
}
