{
  "mod_version": "v1",

  "files": [
    {
      "name": "8139too-4.4.180plus-geminilake.tgz",
      "url": "https://gitlab.com/tinypill/pocopico/rp-ext/-/raw/main/8139too/releases/8139too-4.4.180plus-geminilake.tgz",
      "sha256": "b154029970d87a6afde05bece32c19d8b4069237d7b25dc0983fdfb8204ee0cc",
      "packed": true
    },
    {
      "name": "check-8139too.sh",
      "url": "https://gitlab.com/tinypill/pocopico/rp-ext/-/raw/main/8139too/src/check-8139too.sh",
      "sha256": "709c03f879bbbf32b504345c8653e057690675b6f030ed6f19b7ab6e1bd6f8e2",
      "packed": false
    }
  ],

  "kmods": {
    "mii.ko": "",
    "8139too.ko":""
  },

    "scripts": {
    "on_boot": "check-8139too.sh"
  }

}
