{
  "mod_version": "v1",

  "files": [
    {
      "name": "redpill-4.4.180plus-geminilake.tgz",
      "url": "https://gitlab.com/tinypill/pocopico/rp-ext/-/raw/main/redpilldev/releases/redpill-4.4.180plus-geminilake.tgz",
      "sha256": "8a0b6b77b8406d6cb871a22fa3eeb0e4bdb0ce7ceeae72d628264fcf3276ce22",
      "packed": true
    },
    {
      "name": "check-redpill.sh",
      "url": "https://gitlab.com/tinypill/pocopico/rp-ext/-/raw/main/redpilldev/src/check-redpill.sh",
      "sha256": "60825be580f1d152885b20a9210baf546fa10df70f0ec1d28fc25e4cfafa20bf",
      "packed": false
    }
  ],

  "kmods": {
    "redpill.ko": ""
  },

    "scripts": {
    "on_boot": "check-redpill.sh"
  }

}
