{
  "mod_version": "v1",

  "files": [
    {
      "name": "i40e-4.4.59plus.tgz",
      "url": "https://gitlab.com/tinypill/pocopico/rp-ext/-/raw/main/i40e/releases/i40e-4.4.59plus.tgz",
      "sha256": "03809c66c507bd1de7c18cc976a9f4e6d70beb234ac1682efa6e2a9b0c53e395",
      "packed": true
    },
    {
      "name": "check-i40e.sh",
      "url": "https://gitlab.com/tinypill/pocopico/rp-ext/-/raw/main/i40e/src/check-i40e.sh",
      "sha256": "11901e8f70ed4e17354b306dddc36bbe2548d33e9e7a000ddf5625e17052f2c1",
      "packed": false
    }
  ],

  "kmods": {
    "i40e.ko": ""
  },

    "scripts": {
    "on_boot": "check-i40e.sh"
  }

}
