{
  "id": "pocopico.sata_nv",
  "url": "https://gitlab.com/tinypill/pocopico/rp-ext/-/raw/main/sata_nv/rpext-index.json",
  "info": {
    "name": "sata_nv",
    "description": "Adds low-level driver for NVIDIA nForce SATA controller Support",
    "author_url": "https://gitlab.com/tinypill/pocopico",
    "packer_url": "https://gitlab.com/tinypill//pocopico/rp-ext/tree/main/sata_nv",
    "help_url": "<todo>"
  },
  "releases": {
    "ds3615xs_25556": "https://gitlab.com/tinypill/pocopico/rp-ext/-/raw/main/sata_nv/releases/ds3615xs_25556.json",
    "ds3615xs_41222": "https://gitlab.com/tinypill/pocopico/rp-ext/-/raw/main/sata_nv/releases/ds3615xs_41222.json",
    "ds3615xs_42951": "https://gitlab.com/tinypill/pocopico/rp-ext/-/raw/main/sata_nv/releases/ds3615xs_42218.json",
    "ds3615xs_42218": "https://gitlab.com/tinypill/pocopico/rp-ext/-/raw/main/sata_nv/releases/ds3615xs_42218.json",
    "ds3615xs_42621": "https://gitlab.com/tinypill/pocopico/rp-ext/-/raw/main/sata_nv/releases/ds3615xs_42218.json",
    "ds3615xs_42661": "https://gitlab.com/tinypill/pocopico/rp-ext/-/raw/main/sata_nv/releases/ds3615xs_42218.json",
    "ds3617xs_42951": "https://gitlab.com/tinypill/pocopico/rp-ext/-/raw/main/sata_nv/releases/ds3617xs_42218.json",
    "ds3617xs_42218": "https://gitlab.com/tinypill/pocopico/rp-ext/-/raw/main/sata_nv/releases/ds3617xs_42218.json",
    "ds3617xs_42621": "https://gitlab.com/tinypill/pocopico/rp-ext/-/raw/main/sata_nv/releases/ds3617xs_42218.json",
    "ds3617xs_42661": "https://gitlab.com/tinypill/pocopico/rp-ext/-/raw/main/sata_nv/releases/ds3617xs_42218.json",
    "ds3622xsp_42951": "https://gitlab.com/tinypill/pocopico/rp-ext/-/raw/main/sata_nv/releases/ds3622xsp_42218.json",
    "ds3622xsp_42218": "https://gitlab.com/tinypill/pocopico/rp-ext/-/raw/main/sata_nv/releases/ds3622xsp_42218.json",
    "ds3622xsp_42621": "https://gitlab.com/tinypill/pocopico/rp-ext/-/raw/main/sata_nv/releases/ds3622xsp_42218.json",
    "ds3622xsp_42661": "https://gitlab.com/tinypill/pocopico/rp-ext/-/raw/main/sata_nv/releases/ds3622xsp_42218.json",
    "ds1621p_42951": "https://gitlab.com/tinypill/pocopico/rp-ext/-/raw/main/sata_nv/releases/ds1621p_42218.json",
    "ds1621p_42218": "https://gitlab.com/tinypill/pocopico/rp-ext/-/raw/main/sata_nv/releases/ds1621p_42218.json",
    "ds1621p_42621": "https://gitlab.com/tinypill/pocopico/rp-ext/-/raw/main/sata_nv/releases/ds1621p_42218.json",
    "ds1621p_42661": "https://gitlab.com/tinypill/pocopico/rp-ext/-/raw/main/sata_nv/releases/ds1621p_42218.json",
    "dva3221_42951": "https://gitlab.com/tinypill/pocopico/rp-ext/-/raw/main/sata_nv/releases/dva3221_42218.json",
    "dva3221_42218": "https://gitlab.com/tinypill/pocopico/rp-ext/-/raw/main/sata_nv/releases/dva3221_42218.json",
    "dva3221_42621": "https://gitlab.com/tinypill/pocopico/rp-ext/-/raw/main/sata_nv/releases/dva3221_42218.json",
    "dva3221_42661": "https://gitlab.com/tinypill/pocopico/rp-ext/-/raw/main/sata_nv/releases/dva3221_42218.json",
    "ds918p_25556": "https://gitlab.com/tinypill/pocopico/rp-ext/-/raw/main/sata_nv/releases/ds918p_25556.json",
    "ds918p_41890": "https://gitlab.com/tinypill/pocopico/rp-ext/-/raw/main/sata_nv/releases/ds918p_41890.json",
    "ds918p_42218": "https://gitlab.com/tinypill/pocopico/rp-ext/-/raw/main/sata_nv/releases/ds918p_42218.json",
    "ds918p_42621": "https://gitlab.com/tinypill/pocopico/rp-ext/-/raw/main/sata_nv/releases/ds918p_42218.json",
    "ds918p_42661": "https://gitlab.com/tinypill/pocopico/rp-ext/-/raw/main/sata_nv/releases/ds918p_42218.json",
    "ds920p_42621": "https://gitlab.com/tinypill/pocopico/rp-ext/-/raw/main/sata_nv/releases/ds920p_42218.json",
    "ds920p_42951": "https://gitlab.com/tinypill/pocopico/rp-ext/-/raw/main/sata_nv/releases/ds920p_42218.json",
    "ds920p_42661": "https://gitlab.com/tinypill/pocopico/rp-ext/-/raw/main/sata_nv/releases/ds920p_42218.json"
  }
}
