{
  "mod_version": "v1",
  "files": [
    {
      "name": "r8169-4.4.180plus-broadwell.tgz",
      "url": "https://gitlab.com/tinypill/pocopico/rp-ext/-/raw/main/r8169/releases/r8169-4.4.180plus-broadwell.tgz",
      "sha256": "73d4bd3953226bfc8d908ae2c3cf7e8e083ab58b4190ec2a8f31b1935d6d1c59",
      "packed": true
    },
    {
      "name": "check-r8169.sh",
      "url": "https://gitlab.com/tinypill/pocopico/rp-ext/-/raw/main/r8169/src/check-r8169.sh",
      "sha256": "d9d57d704d83fdb3eaba72096511ba6b43a44da014ffa4b079dcaced3a9005a0",
      "packed": false
    }
  ],
  "kmods": {
    "mii.ko": "",
    "r8169.ko": ""
  },
  "scripts": {
    "on_boot": "check-r8169.sh"
  }
}
