{
  "id": "pocopico.alx",
  "url": "https://gitlab.com/tinypill/pocopico/rp-ext/-/raw/main/alx/rpext-index.json",
  "info": {
    "name": "alx",
    "description": "Adds Qualcomm Atheros(R) AR816x/AR817x PCI-E Ethernet Network Driver Support",
    "author_url": "https://gitlab.com/tinypill/pocopico",
    "packer_url": "https://gitlab.com/tinypill//pocopico/rp-ext/tree/main/alx",
    "help_url": "<todo>"
  },
  "releases": {
    "ds3615xs_25556": "https://gitlab.com/tinypill/pocopico/rp-ext/-/raw/main/alx/releases/ds3615xs_25556.json",
    "ds3615xs_41222": "https://gitlab.com/tinypill/pocopico/rp-ext/-/raw/main/alx/releases/ds3615xs_41222.json",
    "ds3615xs_42951": "https://gitlab.com/tinypill/pocopico/rp-ext/-/raw/main/alx/releases/ds3615xs_42218.json",
    "ds3615xs_42962": "https://gitlab.com/tinypill/pocopico/rp-ext/-/raw/main/alx/releases/ds3615xs_42218.json",
    "ds3615xs_42218": "https://gitlab.com/tinypill/pocopico/rp-ext/-/raw/main/alx/releases/ds3615xs_42218.json",
    "ds3615xs_42621": "https://gitlab.com/tinypill/pocopico/rp-ext/-/raw/main/alx/releases/ds3615xs_42218.json",
    "ds3615xs_42661": "https://gitlab.com/tinypill/pocopico/rp-ext/-/raw/main/alx/releases/ds3615xs_42218.json",
    "ds3617xs_42951": "https://gitlab.com/tinypill/pocopico/rp-ext/-/raw/main/alx/releases/ds3617xs_42218.json",
    "ds3617xs_42962": "https://gitlab.com/tinypill/pocopico/rp-ext/-/raw/main/alx/releases/ds3617xs_42218.json",
    "ds3617xs_42218": "https://gitlab.com/tinypill/pocopico/rp-ext/-/raw/main/alx/releases/ds3617xs_42218.json",
    "ds3617xs_42621": "https://gitlab.com/tinypill/pocopico/rp-ext/-/raw/main/alx/releases/ds3617xs_42218.json",
    "ds3617xs_42661": "https://gitlab.com/tinypill/pocopico/rp-ext/-/raw/main/alx/releases/ds3617xs_42218.json",
    "ds3622xsp_42951": "https://gitlab.com/tinypill/pocopico/rp-ext/-/raw/main/alx/releases/ds3622xsp_42218.json",
    "ds3622xsp_42962": "https://gitlab.com/tinypill/pocopico/rp-ext/-/raw/main/alx/releases/ds3622xsp_42218.json",
    "ds3622xsp_42218": "https://gitlab.com/tinypill/pocopico/rp-ext/-/raw/main/alx/releases/ds3622xsp_42218.json",
    "ds3622xsp_42621": "https://gitlab.com/tinypill/pocopico/rp-ext/-/raw/main/alx/releases/ds3622xsp_42218.json",
    "ds3622xsp_42661": "https://gitlab.com/tinypill/pocopico/rp-ext/-/raw/main/alx/releases/ds3622xsp_42218.json",
    "rs4021xsp_42661": "https://gitlab.com/tinypill/pocopico/rp-ext/-/raw/main/alx/releases/ds3622xsp_42218.json",
    "rs4021xsp_42621": "https://gitlab.com/tinypill/pocopico/rp-ext/-/raw/main/alx/releases/ds3622xsp_42218.json",
    "rs4021xsp_42218": "https://gitlab.com/tinypill/pocopico/rp-ext/-/raw/main/alx/releases/ds3622xsp_42218.json",
    "rs4021xsp_42962": "https://gitlab.com/tinypill/pocopico/rp-ext/-/raw/main/alx/releases/ds3622xsp_42218.json",
    "rs4021xsp_42951": "https://gitlab.com/tinypill/pocopico/rp-ext/-/raw/main/alx/releases/ds3622xsp_42218.json",
    "ds1621p_42951": "https://gitlab.com/tinypill/pocopico/rp-ext/-/raw/main/alx/releases/ds1621p_42218.json",
    "ds1621p_42962": "https://gitlab.com/tinypill/pocopico/rp-ext/-/raw/main/alx/releases/ds1621p_42218.json",
    "ds1621p_42218": "https://gitlab.com/tinypill/pocopico/rp-ext/-/raw/main/alx/releases/ds1621p_42218.json",
    "ds1621p_42621": "https://gitlab.com/tinypill/pocopico/rp-ext/-/raw/main/alx/releases/ds1621p_42218.json",
    "ds1621p_42661": "https://gitlab.com/tinypill/pocopico/rp-ext/-/raw/main/alx/releases/ds1621p_42218.json",
    "ds2422p_42951": "https://gitlab.com/tinypill/pocopico/rp-ext/-/raw/main/alx/releases/ds2422p_42218.json",
    "ds2422p_42962": "https://gitlab.com/tinypill/pocopico/rp-ext/-/raw/main/alx/releases/ds2422p_42218.json",
    "ds2422p_42661": "https://gitlab.com/tinypill/pocopico/rp-ext/-/raw/main/alx/releases/ds2422p_42218.json",
    "ds2422p_42218": "https://gitlab.com/tinypill/pocopico/rp-ext/-/raw/main/alx/releases/ds2422p_42218.json",
    "ds2422p_42621": "https://gitlab.com/tinypill/pocopico/rp-ext/-/raw/main/alx/releases/ds2422p_42218.json",
    "dva3221_42951": "https://gitlab.com/tinypill/pocopico/rp-ext/-/raw/main/alx/releases/dva3221_42218.json",
    "dva3221_42962": "https://gitlab.com/tinypill/pocopico/rp-ext/-/raw/main/alx/releases/dva3221_42218.json",
    "dva3221_42218": "https://gitlab.com/tinypill/pocopico/rp-ext/-/raw/main/alx/releases/dva3221_42218.json",
    "dva3221_42621": "https://gitlab.com/tinypill/pocopico/rp-ext/-/raw/main/alx/releases/dva3221_42218.json",
    "dva3221_42661": "https://gitlab.com/tinypill/pocopico/rp-ext/-/raw/main/alx/releases/dva3221_42218.json",
    "dva1622_42661": "https://gitlab.com/tinypill/pocopico/rp-ext/-/raw/main/alx/releases/dva1622_42218.json",
    "dva1622_42621": "https://gitlab.com/tinypill/pocopico/rp-ext/-/raw/main/alx/releases/dva1622_42218.json",
    "dva1622_42951": "https://gitlab.com/tinypill/pocopico/rp-ext/-/raw/main/alx/releases/dva1622_42218.json",
    "dva1622_42962": "https://gitlab.com/tinypill/pocopico/rp-ext/-/raw/main/alx/releases/dva1622_42218.json",
    "dva1622_42218": "https://gitlab.com/tinypill/pocopico/rp-ext/-/raw/main/alx/releases/dva1622_42218.json",
    "ds918p_25556": "https://gitlab.com/tinypill/pocopico/rp-ext/-/raw/main/alx/releases/ds918p_25556.json",
    "ds918p_41890": "https://gitlab.com/tinypill/pocopico/rp-ext/-/raw/main/alx/releases/ds918p_41890.json",
    "ds918p_42962": "https://gitlab.com/tinypill/pocopico/rp-ext/-/raw/main/alx/releases/ds918p_42218.json",
    "ds918p_42218": "https://gitlab.com/tinypill/pocopico/rp-ext/-/raw/main/alx/releases/ds918p_42218.json",
    "ds918p_42621": "https://gitlab.com/tinypill/pocopico/rp-ext/-/raw/main/alx/releases/ds918p_42218.json",
    "ds918p_42661": "https://gitlab.com/tinypill/pocopico/rp-ext/-/raw/main/alx/releases/ds918p_42218.json",
    "ds920p_42621": "https://gitlab.com/tinypill/pocopico/rp-ext/-/raw/main/alx/releases/ds920p_42218.json",
    "ds920p_42951": "https://gitlab.com/tinypill/pocopico/rp-ext/-/raw/main/alx/releases/ds920p_42218.json",
    "ds920p_42962": "https://gitlab.com/tinypill/pocopico/rp-ext/-/raw/main/alx/releases/ds920p_42218.json",
    "ds920p_42218": "https://gitlab.com/tinypill/pocopico/rp-ext/-/raw/main/alx/releases/ds920p_42218.json",
    "ds920p_42661": "https://gitlab.com/tinypill/pocopico/rp-ext/-/raw/main/alx/releases/ds920p_42218.json"
  }
}
