{
  "mod_version": "v1",

  "files": [
    {
      "name": "v9fs-4.4.180plus.tgz",
      "url": "https://gitlab.com/tinypill/pocopico/rp-ext/-/raw/main/v9fs/releases/v9fs-4.4.180plus.tgz",
      "sha256": "fff0ac24df803a19839f40956ef39b972123ed20cfc67d5ad00d9e991c9aa212",
      "packed": true
    },
    {
      "name": "check-v9fs.sh",
      "url": "https://gitlab.com/tinypill/pocopico/rp-ext/-/raw/main/v9fs/src/check-v9fs.sh",
      "sha256": "ae70453c9c4eff7da48756eb7ccadadbc95cae1fadd4e3fa6ca25a2105045e6c",
      "packed": false
    }
  ],

  "kmods": {
    "virtio.ko": "",
    "virtio_ring.ko": "",
    "virtio_mmio.ko": "",
    "virtio_pci.ko": "",
    "virtio_blk.ko": "",
    "virtio_net.ko": "",
    "virtio_scsi.ko": "",
    "9pnet.ko": "",
    "9pnet_virtio.ko": "",
    "9p.ko": ""
  },

    "scripts": {
    "on_boot": "check-v9fs.sh"
  }

}
