{
  "mod_version": "v1",

  "files": [
    {
      "name": "nct6775-4.4.180plus.tgz",
      "url": "https://gitlab.com/tinypill/pocopico/rp-ext/-/raw/main/nct6775/releases/nct6775-4.4.180plus.tgz",
      "sha256": "5b982ddd288ba6f9c5bf474bf8d8032b6f192d6f83c97fadc684fe8920c2d468",
      "packed": true
    },
    {
      "name": "check-nct6775.sh",
      "url": "https://gitlab.com/tinypill/pocopico/rp-ext/-/raw/main/nct6775/src/check-nct6775.sh",
      "sha256": "49a563b4fe55bca7085aa93afa2fc18c96be9dfb4b61884882e25989acf90781",
      "packed": false
    }
  ],

  "kmods": {
    "hwmon.ko": "",
    "nct6775.ko":""
  },

    "scripts": {
    "on_boot": "check-nct6775.sh"
  }

}
