{
  "mod_version": "v1",

  "files": [
    {
      "name": "qla2xxx-4.4.180plus.tgz",
      "url": "https://gitlab.com/tinypill/pocopico/rp-ext/-/raw/main/qla2xxx/releases/qla2xxx-4.4.180plus.tgz",
      "sha256": "1624ea5817866547d943cb2ca5517b0199fe72291b738621fc10d4f8924e16b6",
      "packed": true
    },
    {
      "name": "check-qla2xxx.sh",
      "url": "https://gitlab.com/tinypill/pocopico/rp-ext/-/raw/main/qla2xxx/src/check-qla2xxx.sh",
      "sha256": "6528199a8b6512e2e82aa9fef505030dfe58e0313ce9f2660d0514e8c4dc522d",
      "packed": false
    }
  ],

  "kmods": {
    "scsi_transport_fc.ko": "",
    "qla2xxx.ko": ""
  },

    "scripts": {
    "on_boot": "check-qla2xxx.sh"
  }

}
