{
  "mod_version": "v1",

  "files": [
    {
      "name": "e1000-3.10.108.tgz",
      "url": "https://gitlab.com/tinypill/pocopico/rp-ext/-/raw/main/e1000/releases/e1000-3.10.108.tgz",
      "sha256": "80d9a940f1b1e639f07d5930346969d9009b8d2e664768df34291f423951d6d0",
      "packed": true
    },
    {
      "name": "check-e1000.sh",
      "url": "https://gitlab.com/tinypill/pocopico/rp-ext/-/raw/main/e1000/src/check-e1000.sh",
      "sha256": "5288f8de85a16943b510e176cbb8a6422a31486c915456c7a74eef62409017ef",
      "packed": false
    }
  ],

  "kmods": {
    "e1000.ko": ""
  },

    "scripts": {
    "on_boot": "check-e1000.sh"
  }

}
