{
  "id": "redpill-dtb-static",
  "url": "https://gitlab.com/tinypill/pocopico/rp-ext/-/raw/main/redpill-dtb-static/rpext-index.json",
  "info": {
    "name": "Device tree binary",
    "description": "Create your own device tree binary",
    "author_url": "https://gitlab.com/jumkey/redpill-load/raw/develop/redpill-dtb",
    "packer_url": "https://gitlab.com/tinypill//jumkey/redpill-load/raw/develop/redpill-dtb",
    "help_url": "<todo>"
  },
  "releases": {
    "ds920p_42951": "https://gitlab.com/tinypill/pocopico/rp-ext/-/raw/main/redpill-dtb-static/recipes/universal.json",
    "ds920p_42218": "https://gitlab.com/tinypill/pocopico/rp-ext/-/raw/main/redpill-dtb-static/recipes/universal.json",
    "ds920p_42550": "https://gitlab.com/tinypill/pocopico/rp-ext/-/raw/main/redpill-dtb-static/recipes/universal.json",
    "ds920p_42621": "https://gitlab.com/tinypill/pocopico/rp-ext/-/raw/main/redpill-dtb-static/recipes/universal.json",
    "ds920p_42661": "https://gitlab.com/tinypill/pocopico/rp-ext/-/raw/main/redpill-dtb-static/recipes/universal.json",
    "dva1622_42951": "https://gitlab.com/tinypill/pocopico/rp-ext/-/raw/main/redpill-dtb-static/recipes/universal.json",
    "dva1622_42661": "https://gitlab.com/tinypill/pocopico/rp-ext/-/raw/main/redpill-dtb-static/recipes/universal.json",
    "ds1621p_42951": "https://gitlab.com/tinypill/pocopico/rp-ext/-/raw/main/redpill-dtb-static/recipes/universal.json",
    "ds1621p_42218": "https://gitlab.com/tinypill/pocopico/rp-ext/-/raw/main/redpill-dtb-static/recipes/universal.json",
    "ds1621p_42621": "https://gitlab.com/tinypill/pocopico/rp-ext/-/raw/main/redpill-dtb-static/recipes/universal.json",
    "ds1621p_42661": "https://gitlab.com/tinypill/pocopico/rp-ext/-/raw/main/redpill-dtb-static/recipes/universal.json",
    "ds2422p_42951": "https://gitlab.com/tinypill/pocopico/rp-ext/-/raw/main/redpill-dtb-static/recipes/universal.json",
    "ds2422p_42218": "https://gitlab.com/tinypill/pocopico/rp-ext/-/raw/main/redpill-dtb-static/recipes/universal.json",
    "ds2422p_42621": "https://gitlab.com/tinypill/pocopico/rp-ext/-/raw/main/redpill-dtb-static/recipes/universal.json",
    "ds2422p_42661": "https://gitlab.com/tinypill/pocopico/rp-ext/-/raw/main/redpill-dtb-static/recipes/universal.json"
  }
}
