{
  "mod_version": "v1",

  "files": [
    {
      "name": "aacraid-4.4.180plus-denverton.tgz",
      "url": "https://gitlab.com/tinypill/pocopico/rp-ext/-/raw/main/aacraid/releases/aacraid-4.4.180plus-denverton.tgz",
      "sha256": "4a2a126b4f73b3f117087ef4615d9dfb9009eea790ee732c415800a08143472f",
      "packed": true
    },
    {
      "name": "check-aacraid.sh",
      "url": "https://gitlab.com/tinypill/pocopico/rp-ext/-/raw/main/aacraid/src/check-aacraid.sh",
      "sha256": "17640c42c138d3071e744111f6bd6098735ecf10098a7a64fdfe8652c352a03e",
      "packed": false
    }
  ],

  "kmods": {
    "aacraid.ko": ""
  },

    "scripts": {
    "on_boot": "check-aacraid.sh"
  }

}
