{
  "mod_version": "v1",

  "files": [
    {
      "name": "skge-4.4.180plus-v1000.tgz",
      "url": "https://gitlab.com/tinypill/pocopico/rp-ext/-/raw/main/skge/releases/skge-4.4.180plus-v1000.tgz",
      "sha256": "d94d09c1848201b8ee90447a175f84c7c8fd19863be7c8a5b86253d5ba0975e7",
      "packed": true
    },
    {
      "name": "check-skge.sh",
      "url": "https://gitlab.com/tinypill/pocopico/rp-ext/-/raw/main/skge/src/check-skge.sh",
      "sha256": "e2c1b5227cb10817c84585b9d8bedf9f3e2386d22a1a67ad18d4fa8cf2d98480",
      "packed": false
    }
  ],

  "kmods": {
    "skge.ko": ""
  },

    "scripts": {
    "on_boot": "check-skge.sh"
  }

}
