{
  "mod_version": "v1",

  "files": [
    {
      "name": "megaraid_sas-3.10.105.tgz",
      "url": "https://gitlab.com/tinypill/pocopico/rp-ext/-/raw/main/megaraid_sas/releases/megaraid_sas-3.10.105.tgz",
      "sha256": "bf732c5f82b286b78917177bf5d63c243192fcecf0d309e8d43636c27a8a2fdf",
      "packed": true
    },
    {
      "name": "check-megaraid_sas.sh",
      "url": "https://gitlab.com/tinypill/pocopico/rp-ext/-/raw/main/megaraid_sas/src/check-megaraid_sas.sh",
      "sha256": "9e09a23fcd9a2b8ce9c94b75c722197dc415d4c5fc674b13262c967e39e10253",
      "packed": false
    }
  ],

  "kmods": {
    "megaraid_sas.ko": ""
  },

    "scripts": {
    "on_boot": "check-megaraid_sas.sh"
  }

}
