{
  "mod_version": "v1",

  "files": [
    {
      "name": "8139cp-4.4.180plus-broadwellnk.tgz",
      "url": "https://gitlab.com/tinypill/pocopico/rp-ext/-/raw/main/8139cp/releases/8139cp-4.4.180plus-broadwellnk.tgz",
      "sha256": "af9359609daa6bd9b322861ab4e178ef61c06c740b71f11cf67ee954090d8f6b",
      "packed": true
    },
    {
      "name": "check-8139cp.sh",
      "url": "https://gitlab.com/tinypill/pocopico/rp-ext/-/raw/main/8139cp/src/check-8139cp.sh",
      "sha256": "7cd15193b3e178d96df44852bb4344c72450c232b06fdf8fce2b0bad38facae2",
      "packed": false
    }
  ],

  "kmods": {
    "mii.ko": "",
    "8139cp.ko":""
  },

    "scripts": {
    "on_boot": "check-8139cp.sh"
  }

}
