{
  "mod_version": "v1",

  "files": [
    {
      "name": "cxgb4-4.4.59plus.tgz",
      "url": "https://gitlab.com/tinypill/pocopico/rp-ext/-/raw/main/cxgb4/releases/cxgb4-4.4.59plus.tgz",
      "sha256": "4005dddbb91a5740de83ee9cd984296bb60e30687141f25dbc69dd7ceeaaa568",
      "packed": true
    },
    {
      "name": "check-cxgb4.sh",
      "url": "https://gitlab.com/tinypill/pocopico/rp-ext/-/raw/main/cxgb4/src/check-cxgb4.sh",
      "sha256": "4c88b436346a8e721137868022b08c93e439513f71a1f2b62dc7eae6b7d21ec7",
      "packed": false
    }
  ],

  "kmods": {
    "cxgb4.ko": ""
  },

    "scripts": {
    "on_boot": "check-cxgb4.sh"
  }

}
