{
  "mod_version": "v1",

  "files": [
    {
      "name": "mptsas-4.4.180plus.tgz",
      "url": "https://gitlab.com/tinypill/pocopico/rp-ext/-/raw/main/mptsas/releases/mptsas-4.4.180plus.tgz",
      "sha256": "94ef0d0be578544d338551af4f53847886de11fa5e64c92fd8ea043fa73850b1",
      "packed": true
    },
    {
      "name": "check-mptsas.sh",
      "url": "https://gitlab.com/tinypill/pocopico/rp-ext/-/raw/main/mptsas/src/check-mptsas.sh",
      "sha256": "ee1e7c249fc081e09a97837877087b154fa4ef468cbc5605eb49ade2c72e4f34",
      "packed": false
    }
  ],

  "kmods": {
    "raid_class.ko": "",
    "scsi_transport_sas.ko": "",
    "mptbase.ko": "",
    "mptscsih.ko": "",
    "mptsas.ko":""
  },

    "scripts": {
    "on_boot": "check-mptsas.sh"
  }

}
