{
  "id": "pocopico.netxen_nic",
  "url": "https://gitlab.com/tinypill/pocopico/rp-ext/-/raw/main/netxen_nic/rpext-index.json",
  "info": {
    "name": "netxen_nic",
    "description": "Adds QLogic/NetXen (1/10) GbE Intelligent Ethernet Driver Support",
    "author_url": "https://gitlab.com/tinypill/pocopico",
    "packer_url": "https://gitlab.com/tinypill//pocopico/rp-ext/tree/main/netxen_nic",
    "help_url": "<todo>"
  },
  "releases": {
"ds3615xs_42218": "https://gitlab.com/tinypill/pocopico/rp-ext/-/raw/main/netxen_nic/releases/ds3615xs_42218.json",
"ds3615xs_42621": "https://gitlab.com/tinypill/pocopico/rp-ext/-/raw/main/netxen_nic/releases/ds3615xs_42218.json",
"ds3615xs_42661": "https://gitlab.com/tinypill/pocopico/rp-ext/-/raw/main/netxen_nic/releases/ds3615xs_42218.json",
"ds3615xs_42951": "https://gitlab.com/tinypill/pocopico/rp-ext/-/raw/main/netxen_nic/releases/ds3615xs_42218.json",
"ds3615xs_42962": "https://gitlab.com/tinypill/pocopico/rp-ext/-/raw/main/netxen_nic/releases/ds3615xs_42218.json",
"ds3617xs_42218": "https://gitlab.com/tinypill/pocopico/rp-ext/-/raw/main/netxen_nic/releases/ds3617xs_42218.json",
"ds3617xs_42621": "https://gitlab.com/tinypill/pocopico/rp-ext/-/raw/main/netxen_nic/releases/ds3617xs_42218.json",
"ds3617xs_42661": "https://gitlab.com/tinypill/pocopico/rp-ext/-/raw/main/netxen_nic/releases/ds3617xs_42218.json",
"ds3617xs_42951": "https://gitlab.com/tinypill/pocopico/rp-ext/-/raw/main/netxen_nic/releases/ds3617xs_42218.json",
"ds3617xs_42962": "https://gitlab.com/tinypill/pocopico/rp-ext/-/raw/main/netxen_nic/releases/ds3617xs_42218.json",
"ds3622xsp_42218": "https://gitlab.com/tinypill/pocopico/rp-ext/-/raw/main/netxen_nic/releases/ds3622xsp_42218.json",
"ds3622xsp_42621": "https://gitlab.com/tinypill/pocopico/rp-ext/-/raw/main/netxen_nic/releases/ds3622xsp_42218.json",
"ds3622xsp_42661": "https://gitlab.com/tinypill/pocopico/rp-ext/-/raw/main/netxen_nic/releases/ds3622xsp_42218.json",
"ds3622xsp_42951": "https://gitlab.com/tinypill/pocopico/rp-ext/-/raw/main/netxen_nic/releases/ds3622xsp_42218.json",
"ds3622xsp_42962": "https://gitlab.com/tinypill/pocopico/rp-ext/-/raw/main/netxen_nic/releases/ds3622xsp_42218.json",
"ds1621p_42218": "https://gitlab.com/tinypill/pocopico/rp-ext/-/raw/main/netxen_nic/releases/ds1621p_42218.json",
"ds1621p_42621": "https://gitlab.com/tinypill/pocopico/rp-ext/-/raw/main/netxen_nic/releases/ds1621p_42218.json",
"ds1621p_42661": "https://gitlab.com/tinypill/pocopico/rp-ext/-/raw/main/netxen_nic/releases/ds1621p_42218.json",
"ds1621p_42951": "https://gitlab.com/tinypill/pocopico/rp-ext/-/raw/main/netxen_nic/releases/ds1621p_42218.json",
"ds1621p_42962": "https://gitlab.com/tinypill/pocopico/rp-ext/-/raw/main/netxen_nic/releases/ds1621p_42218.json",
"dva3221_42218": "https://gitlab.com/tinypill/pocopico/rp-ext/-/raw/main/netxen_nic/releases/dva3221_42218.json",
"dva3221_42621": "https://gitlab.com/tinypill/pocopico/rp-ext/-/raw/main/netxen_nic/releases/dva3221_42218.json",
"dva3221_42661": "https://gitlab.com/tinypill/pocopico/rp-ext/-/raw/main/netxen_nic/releases/dva3221_42218.json",
"dva3221_42951": "https://gitlab.com/tinypill/pocopico/rp-ext/-/raw/main/netxen_nic/releases/dva3221_42218.json",
"dva3221_42962": "https://gitlab.com/tinypill/pocopico/rp-ext/-/raw/main/netxen_nic/releases/dva3221_42218.json",
"ds918p_42218": "https://gitlab.com/tinypill/pocopico/rp-ext/-/raw/main/netxen_nic/releases/ds918p_42218.json",
"ds918p_42621": "https://gitlab.com/tinypill/pocopico/rp-ext/-/raw/main/netxen_nic/releases/ds918p_42218.json",
"ds918p_42661": "https://gitlab.com/tinypill/pocopico/rp-ext/-/raw/main/netxen_nic/releases/ds918p_42218.json",
"ds918p_42951": "https://gitlab.com/tinypill/pocopico/rp-ext/-/raw/main/netxen_nic/releases/ds918p_42218.json",
"ds918p_42962": "https://gitlab.com/tinypill/pocopico/rp-ext/-/raw/main/netxen_nic/releases/ds918p_42218.json",
"ds920p_42218": "https://gitlab.com/tinypill/pocopico/rp-ext/-/raw/main/netxen_nic/releases/ds920p_42218.json",
"ds920p_42621": "https://gitlab.com/tinypill/pocopico/rp-ext/-/raw/main/netxen_nic/releases/ds920p_42218.json",
"ds920p_42661": "https://gitlab.com/tinypill/pocopico/rp-ext/-/raw/main/netxen_nic/releases/ds920p_42218.json",
"ds920p_42951": "https://gitlab.com/tinypill/pocopico/rp-ext/-/raw/main/netxen_nic/releases/ds920p_42218.json",
"ds920p_42962": "https://gitlab.com/tinypill/pocopico/rp-ext/-/raw/main/netxen_nic/releases/ds920p_42218.json",
"ds2422p_42218": "https://gitlab.com/tinypill/pocopico/rp-ext/-/raw/main/netxen_nic/releases/ds2422p_42218.json",
"ds2422p_42621": "https://gitlab.com/tinypill/pocopico/rp-ext/-/raw/main/netxen_nic/releases/ds2422p_42218.json",
"ds2422p_42661": "https://gitlab.com/tinypill/pocopico/rp-ext/-/raw/main/netxen_nic/releases/ds2422p_42218.json",
"ds2422p_42951": "https://gitlab.com/tinypill/pocopico/rp-ext/-/raw/main/netxen_nic/releases/ds2422p_42218.json",
"ds2422p_42962": "https://gitlab.com/tinypill/pocopico/rp-ext/-/raw/main/netxen_nic/releases/ds2422p_42218.json",
"dva1622_42218": "https://gitlab.com/tinypill/pocopico/rp-ext/-/raw/main/netxen_nic/releases/dva1622_42218.json",
"dva1622_42621": "https://gitlab.com/tinypill/pocopico/rp-ext/-/raw/main/netxen_nic/releases/dva1622_42218.json",
"dva1622_42661": "https://gitlab.com/tinypill/pocopico/rp-ext/-/raw/main/netxen_nic/releases/dva1622_42218.json",
"dva1622_42951": "https://gitlab.com/tinypill/pocopico/rp-ext/-/raw/main/netxen_nic/releases/dva1622_42218.json",
"dva1622_42962": "https://gitlab.com/tinypill/pocopico/rp-ext/-/raw/main/netxen_nic/releases/dva1622_42218.json",
"rs4021xsp_42218": "https://gitlab.com/tinypill/pocopico/rp-ext/-/raw/main/netxen_nic/releases/rs4021xsp_42218.json",
"rs4021xsp_42621": "https://gitlab.com/tinypill/pocopico/rp-ext/-/raw/main/netxen_nic/releases/rs4021xsp_42218.json",
"rs4021xsp_42661": "https://gitlab.com/tinypill/pocopico/rp-ext/-/raw/main/netxen_nic/releases/rs4021xsp_42218.json",
"rs4021xsp_42951": "https://gitlab.com/tinypill/pocopico/rp-ext/-/raw/main/netxen_nic/releases/rs4021xsp_42218.json",
"rs4021xsp_42962": "https://gitlab.com/tinypill/pocopico/rp-ext/-/raw/main/netxen_nic/releases/rs4021xsp_42218.json",
"endofmodel": "endofurls"
  }
}
