{
  "mod_version": "v1",

  "files": [
    {
      "name": "igb-3.10.105.tgz",
      "url": "https://gitlab.com/tinypill/pocopico/rp-ext/-/raw/main/igb/releases/igb-3.10.105.tgz",
      "sha256": "523ee6f90ab20f8bdf08afd3fbf7ec11226db854ab04741834550fecc2c400c0",
      "packed": true
    },
    {
      "name": "check-igb.sh",
      "url": "https://gitlab.com/tinypill/pocopico/rp-ext/-/raw/main/igb/src/check-igb.sh",
      "sha256": "1c287077390c24764eeb0f1e768232cfd4e26e0cb5b01154464d7181d1c3ebf4",
      "packed": false
    }
  ],

  "kmods": {
    "igb.ko": ""
  },

    "scripts": {
    "on_boot": "check-igb.sh"
  }

}
