{
  "mod_version": "v1",

  "files": [
    {
      "name": "skge-4.4.180plus-geminilake.tgz",
      "url": "https://gitlab.com/tinypill/pocopico/rp-ext/-/raw/main/skge/releases/skge-4.4.180plus-geminilake.tgz",
      "sha256": "c8dda8da60755e90b6b190592fbffbad04dd18f8d9fe9ed67fae8bea6242e5fa",
      "packed": true
    },
    {
      "name": "check-skge.sh",
      "url": "https://gitlab.com/tinypill/pocopico/rp-ext/-/raw/main/skge/src/check-skge.sh",
      "sha256": "e2c1b5227cb10817c84585b9d8bedf9f3e2386d22a1a67ad18d4fa8cf2d98480",
      "packed": false
    }
  ],

  "kmods": {
    "skge.ko": ""
  },

    "scripts": {
    "on_boot": "check-skge.sh"
  }

}
