{
  "mod_version": "v1",

  "files": [
    {
      "name": "rtl8150-4.4.59plus.tgz",
      "url": "https://gitlab.com/tinypill/pocopico/rp-ext/-/raw/main/rtl8150/releases/rtl8150-4.4.59plus.tgz",
      "sha256": "958b9c50ca02f0962921b9a7413990396c0c641762d73f6743e39cbf485394de",
      "packed": true
    },
    {
      "name": "check-rtl8150.sh",
      "url": "https://gitlab.com/tinypill/pocopico/rp-ext/-/raw/main/rtl8150/src/check-rtl8150.sh",
      "sha256": "12e2c4767ae35ed2e7b5c752d47f6e7dcd441380f976be5d361a2c47d20483df",
      "packed": false
    }
  ],

  "kmods": {
    "rtl8150.ko": ""
  },

    "scripts": {
    "on_boot": "check-rtl8150.sh"
  }

}
