{
  "mod_version": "v1",

  "files": [
    {
      "name": "rtl8150-4.4.180plus-broadwellnk.tgz",
      "url": "https://gitlab.com/tinypill/pocopico/rp-ext/-/raw/main/rtl8150/releases/rtl8150-4.4.180plus-broadwellnk.tgz",
      "sha256": "de6d983c2d23ed996cfb46b92432adebf67741e4ad2877242d14c868d996d47b",
      "packed": true
    },
    {
      "name": "check-rtl8150.sh",
      "url": "https://gitlab.com/tinypill/pocopico/rp-ext/-/raw/main/rtl8150/src/check-rtl8150.sh",
      "sha256": "12e2c4767ae35ed2e7b5c752d47f6e7dcd441380f976be5d361a2c47d20483df",
      "packed": false
    }
  ],

  "kmods": {
    "usbcore.ko": "",
    "rtl8150.ko":""
  },

    "scripts": {
    "on_boot": "check-rtl8150.sh"
  }

}
