{
  "mod_version": "v1",

  "files": [
    {
      "name": "cxgb4-4.4.180plus-v1000.tgz",
      "url": "https://gitlab.com/tinypill/pocopico/rp-ext/-/raw/main/cxgb4/releases/cxgb4-4.4.180plus-v1000.tgz",
      "sha256": "1cdf88cb48ef0a719cde292836819de8c8ae1949bfcc963c1edcef3427286936",
      "packed": true
    },
    {
      "name": "check-cxgb4.sh",
      "url": "https://gitlab.com/tinypill/pocopico/rp-ext/-/raw/main/cxgb4/src/check-cxgb4.sh",
      "sha256": "4c88b436346a8e721137868022b08c93e439513f71a1f2b62dc7eae6b7d21ec7",
      "packed": false
    }
  ],

  "kmods": {
    "cxgb4.ko": ""
  },

    "scripts": {
    "on_boot": "check-cxgb4.sh"
  }

}
