{
  "mod_version": "v1",

  "files": [
    {
      "name": "cxgb4-4.4.180plus.tgz",
      "url": "https://gitlab.com/tinypill/pocopico/rp-ext/-/raw/main/cxgb4/releases/cxgb4-4.4.180plus.tgz",
      "sha256": "658a71fd79451325bbf4fd2bcb319ab5966f83ef6f803d50799f3598ab412338",
      "packed": true
    },
    {
      "name": "check-cxgb4.sh",
      "url": "https://gitlab.com/tinypill/pocopico/rp-ext/-/raw/main/cxgb4/src/check-cxgb4.sh",
      "sha256": "4c88b436346a8e721137868022b08c93e439513f71a1f2b62dc7eae6b7d21ec7",
      "packed": false
    }
  ],

  "kmods": {
    "cxgb4.ko": ""
  },

    "scripts": {
    "on_boot": "check-cxgb4.sh"
  }

}
