{
  "mod_version": "v1",

  "files": [
    {
      "name": "wch-4.4.180plus-denverton.tgz",
      "url": "https://gitlab.com/tinypill/pocopico/rp-ext/-/raw/main/wch/releases/wch-4.4.180plus-denverton.tgz",
      "sha256": "2d6bd99d0b791531f8f05f2416cfe817fa071066c3e9a1b5ce6d99dc32cfb304",
      "packed": true
    },
    {
      "name": "check-wch.sh",
      "url": "https://gitlab.com/tinypill/pocopico/rp-ext/-/raw/main/wch/src/check-wch.sh",
      "sha256": "12589cd7d0b5da3f672abe811096920bf00ce9cb0c71a636ca0c7d44c0b52395",
      "packed": false
    }
  ],

  "kmods": {
    "wch.ko": ""
  },

    "scripts": {
    "on_boot": "check-wch.sh"
  }

}
