{
  "mod_version": "v1",

  "files": [
    {
      "name": "asix-4.4.59plus.tgz",
      "url": "https://gitlab.com/tinypill/pocopico/rp-ext/-/raw/main/asix/releases/asix-4.4.59plus.tgz",
      "sha256": "e7f396b72277b3768aa678ee0ad48a9f5e2af4349d357d32744b773d276cd51b",
      "packed": true
    },
    {
      "name": "check-asix.sh",
      "url": "https://gitlab.com/tinypill/pocopico/rp-ext/-/raw/main/asix/src/check-asix.sh",
      "sha256": "61a655451e9c14bea679604f41defb771288cb09947c832f5739304e8af35e0f",
      "packed": false
    }
  ],

  "kmods": {
    "usbnet.ko": "",
    "asix.ko":""
  },

    "scripts": {
    "on_boot": "check-asix.sh"
  }

}
