{
  "mod_version": "v1",

  "files": [
    {
      "name": "e1000-4.4.180plus-broadwellnk.tgz",
      "url": "https://gitlab.com/tinypill/pocopico/rp-ext/-/raw/main/e1000/releases/e1000-4.4.180plus-broadwellnk.tgz",
      "sha256": "6044063924eed3f590b31e8c78dfc73936b58441a54c294a60df44cb600a7c5f",
      "packed": true
    },
    {
      "name": "check-e1000.sh",
      "url": "https://gitlab.com/tinypill/pocopico/rp-ext/-/raw/main/e1000/src/check-e1000.sh",
      "sha256": "5288f8de85a16943b510e176cbb8a6422a31486c915456c7a74eef62409017ef",
      "packed": false
    }
  ],

  "kmods": {
    "e1000.ko": ""
  },

    "scripts": {
    "on_boot": "check-e1000.sh"
  }

}
