{
  "id": "pocopico.forcedeth",
  "url": "https://gitlab.com/tinypill/pocopico/rp-ext/-/raw/main/forcedeth/rpext-index.json",
  "info": {
    "name": "forcedeth",
    "description": "Adds Reverse Engineered nForce ethernet driver Support",
    "author_url": "https://gitlab.com/tinypill/pocopico",
    "packer_url": "https://gitlab.com/tinypill//pocopico/rp-ext/tree/main/forcedeth",
    "help_url": "<todo>"
  },
  "releases": {
    "ds3615xs_42218": "https://gitlab.com/tinypill/pocopico/rp-ext/-/raw/main/forcedeth/releases/ds3615xs_42218.json",
    "ds3615xs_42621": "https://gitlab.com/tinypill/pocopico/rp-ext/-/raw/main/forcedeth/releases/ds3615xs_42218.json",
    "ds3615xs_42661": "https://gitlab.com/tinypill/pocopico/rp-ext/-/raw/main/forcedeth/releases/ds3615xs_42218.json",
    "ds3615xs_42951": "https://gitlab.com/tinypill/pocopico/rp-ext/-/raw/main/forcedeth/releases/ds3615xs_42218.json",
    "ds3615xs_42962": "https://gitlab.com/tinypill/pocopico/rp-ext/-/raw/main/forcedeth/releases/ds3615xs_42218.json",
    "ds3617xs_42218": "https://gitlab.com/tinypill/pocopico/rp-ext/-/raw/main/forcedeth/releases/ds3617xs_42218.json",
    "ds3617xs_42621": "https://gitlab.com/tinypill/pocopico/rp-ext/-/raw/main/forcedeth/releases/ds3617xs_42218.json",
    "ds3617xs_42661": "https://gitlab.com/tinypill/pocopico/rp-ext/-/raw/main/forcedeth/releases/ds3617xs_42218.json",
    "ds3617xs_42951": "https://gitlab.com/tinypill/pocopico/rp-ext/-/raw/main/forcedeth/releases/ds3617xs_42218.json",
    "ds3617xs_42962": "https://gitlab.com/tinypill/pocopico/rp-ext/-/raw/main/forcedeth/releases/ds3617xs_42218.json",
    "ds3622xsp_42218": "https://gitlab.com/tinypill/pocopico/rp-ext/-/raw/main/forcedeth/releases/ds3622xsp_42218.json",
    "ds3622xsp_42621": "https://gitlab.com/tinypill/pocopico/rp-ext/-/raw/main/forcedeth/releases/ds3622xsp_42218.json",
    "ds3622xsp_42661": "https://gitlab.com/tinypill/pocopico/rp-ext/-/raw/main/forcedeth/releases/ds3622xsp_42218.json",
    "rs4021xsp_42962": "https://gitlab.com/tinypill/pocopico/rp-ext/-/raw/main/forcedeth/releases/ds3622xsp_42218.json",
    "rs4021xsp_42951": "https://gitlab.com/tinypill/pocopico/rp-ext/-/raw/main/forcedeth/releases/ds3622xsp_42218.json",
    "rs4021xsp_42661": "https://gitlab.com/tinypill/pocopico/rp-ext/-/raw/main/forcedeth/releases/ds3622xsp_42218.json",
    "rs4021xsp_42621": "https://gitlab.com/tinypill/pocopico/rp-ext/-/raw/main/forcedeth/releases/ds3622xsp_42218.json",
    "rs4021xsp_42218": "https://gitlab.com/tinypill/pocopico/rp-ext/-/raw/main/forcedeth/releases/ds3622xsp_42218.json",
    "ds3622xsp_42951": "https://gitlab.com/tinypill/pocopico/rp-ext/-/raw/main/forcedeth/releases/ds3622xsp_42218.json",
    "ds3622xsp_42962": "https://gitlab.com/tinypill/pocopico/rp-ext/-/raw/main/forcedeth/releases/ds3622xsp_42218.json",
    "ds1621p_42218": "https://gitlab.com/tinypill/pocopico/rp-ext/-/raw/main/forcedeth/releases/ds1621p_42218.json",
    "ds1621p_42621": "https://gitlab.com/tinypill/pocopico/rp-ext/-/raw/main/forcedeth/releases/ds1621p_42218.json",
    "ds1621p_42661": "https://gitlab.com/tinypill/pocopico/rp-ext/-/raw/main/forcedeth/releases/ds1621p_42218.json",
    "ds1621p_42951": "https://gitlab.com/tinypill/pocopico/rp-ext/-/raw/main/forcedeth/releases/ds1621p_42218.json",
    "ds1621p_42962": "https://gitlab.com/tinypill/pocopico/rp-ext/-/raw/main/forcedeth/releases/ds1621p_42218.json",
    "dva3221_42218": "https://gitlab.com/tinypill/pocopico/rp-ext/-/raw/main/forcedeth/releases/dva3221_42218.json",
    "dva3221_42621": "https://gitlab.com/tinypill/pocopico/rp-ext/-/raw/main/forcedeth/releases/dva3221_42218.json",
    "dva3221_42661": "https://gitlab.com/tinypill/pocopico/rp-ext/-/raw/main/forcedeth/releases/dva3221_42218.json",
    "dva3221_42951": "https://gitlab.com/tinypill/pocopico/rp-ext/-/raw/main/forcedeth/releases/dva3221_42218.json",
    "dva3221_42962": "https://gitlab.com/tinypill/pocopico/rp-ext/-/raw/main/forcedeth/releases/dva3221_42218.json",
    "ds918p_42218": "https://gitlab.com/tinypill/pocopico/rp-ext/-/raw/main/forcedeth/releases/ds918p_42218.json",
    "ds918p_42621": "https://gitlab.com/tinypill/pocopico/rp-ext/-/raw/main/forcedeth/releases/ds918p_42218.json",
    "ds918p_42661": "https://gitlab.com/tinypill/pocopico/rp-ext/-/raw/main/forcedeth/releases/ds918p_42218.json",
    "ds918p_42951": "https://gitlab.com/tinypill/pocopico/rp-ext/-/raw/main/forcedeth/releases/ds918p_42218.json",
    "ds918p_42962": "https://gitlab.com/tinypill/pocopico/rp-ext/-/raw/main/forcedeth/releases/ds918p_42218.json",
    "ds920p_42218": "https://gitlab.com/tinypill/pocopico/rp-ext/-/raw/main/forcedeth/releases/ds920p_42218.json",
    "ds920p_42621": "https://gitlab.com/tinypill/pocopico/rp-ext/-/raw/main/forcedeth/releases/ds920p_42218.json",
    "ds920p_42661": "https://gitlab.com/tinypill/pocopico/rp-ext/-/raw/main/forcedeth/releases/ds920p_42218.json",
    "ds920p_42951": "https://gitlab.com/tinypill/pocopico/rp-ext/-/raw/main/forcedeth/releases/ds920p_42218.json",
    "ds920p_42962": "https://gitlab.com/tinypill/pocopico/rp-ext/-/raw/main/forcedeth/releases/ds920p_42218.json",
    "ds2422p_42218": "https://gitlab.com/tinypill/pocopico/rp-ext/-/raw/main/forcedeth/releases/ds2422p_42218.json",
    "ds2422p_42621": "https://gitlab.com/tinypill/pocopico/rp-ext/-/raw/main/forcedeth/releases/ds2422p_42218.json",
    "ds2422p_42661": "https://gitlab.com/tinypill/pocopico/rp-ext/-/raw/main/forcedeth/releases/ds2422p_42218.json",
    "ds2422p_42951": "https://gitlab.com/tinypill/pocopico/rp-ext/-/raw/main/forcedeth/releases/ds2422p_42218.json",
    "ds2422p_42962": "https://gitlab.com/tinypill/pocopico/rp-ext/-/raw/main/forcedeth/releases/ds2422p_42218.json",
    "dva1622_42218": "https://gitlab.com/tinypill/pocopico/rp-ext/-/raw/main/forcedeth/releases/dva1622_42218.json",
    "dva1622_42621": "https://gitlab.com/tinypill/pocopico/rp-ext/-/raw/main/forcedeth/releases/dva1622_42218.json",
    "dva1622_42661": "https://gitlab.com/tinypill/pocopico/rp-ext/-/raw/main/forcedeth/releases/dva1622_42218.json",
    "dva1622_42951": "https://gitlab.com/tinypill/pocopico/rp-ext/-/raw/main/forcedeth/releases/dva1622_42218.json",
    "dva1622_42962": "https://gitlab.com/tinypill/pocopico/rp-ext/-/raw/main/forcedeth/releases/dva1622_42218.json",
    "endofmodel": "endofurls"
  }
}
