{
  "os": {
    "id": "sa6400_42962",
    "pat_url": "https://global.download.synology.com/download/DSM/release/7.1.1/42962/DSM_SA6400_42962.pat",
    "sha256": "83fc408380ebb1381224261de6220b873d7b62a99e715557509ae9553f618a71"
  },
  "files": {
    "zlinux": {
      "name": "zImage",
      "sha256": "d5b8af848fc585695e35bd1c4f4c953fd8e54435b2799face4f8f350bac6df93"
    },
    "ramdisk": {
      "name": "rd.gz",
      "sha256": "d4efe45fc4dd71758fe365f7eb39d24982d1440b00986259cab9a03577982f68"
    },
    "vmlinux": {
      "sha256": "c507f1cd860da5b6af820533c423849d84616c59b135fbd6839e26dbd80b84e5"
    }
  },
  "patches": {
    "_comment": ".bsp patches are applied to FILES using bspatch(1); .patch are applied to DIRECTORIES using patch(1)",
    "zlinux": [
      "zImage-001-sa6400-42962-ramdisk-and-header.bsp"
    ],
    "ramdisk": [
      "@@@COMMON@@@/ramdisk-001-disable-root-pwd.patch",
      "@@@COMMON@@@/v7.1.1/ramdisk-002-init-script.patch",
      "@@@COMMON@@@/v7.1.1/ramdisk-003-post-init-script-noatime.patch",
      "@@@COMMON@@@/ramdisk-004-network-hosts.patch",
      "@@@COMMON@@@/ramdisk-common-etc-rc.patch"
    ]
  },
  "synoinfo": {
    "maxdisks": "24",
    "support_bde_internal_10g": "no",
    "support_disk_compatibility": "no",
    "internalportcfg": "0xfffff",
    "SasIdxMap": "0",
    "esataportcfg": "0x00",
    "rss_server": "https://raw.githubusercontent.com/PeterSuh-Q3/redpill-load/master/rss/7.1.1/rss.xml",
    "rss_server_ssl": "https://raw.githubusercontent.com/PeterSuh-Q3/redpill-load/master/rss/7.1.1/rss.xml",
    "rss_server_v2": "https://raw.githubusercontent.com/PeterSuh-Q3/redpill-load/master/rss/7.1.1/rss.json",
    "small_info_path": "https://example.com/null",
    "security_version_server": "https://example.com/smallupdate"
  },
  "grub": {
    "template": "@@@COMMON@@@/grub-template.conf",
    "base_cmdline": {
      "sn": "",
      "vid": "0x46f4",
      "pid": "0x0001",
      "SasIdxMap": "0",
      "SataPortMap": "1",
      "DiskIdxMap": "0",
      "mac1": "",
      "netif_num": 1,
      "syno_hw_version": "SA6400",
      "syno_hdd_powerup_seq": 0,
      "HddHotplug": 0,
      "vender_format_version": 2,
      "console": "ttyS0,115200n8",
      "withefi": null,
      "elevator": "elevator",
      "syno_port_thaw": 1,
      "syno_hdd_detect": 0,
      "root": "/dev/md0",
      "earlycon": "uart8250,io,0x3f8,115200n8",
      "sataboot2": null,
      "SMBusHddDynamicPower": "0",
      "syno_ttyS0": "serial,0x3f8",
      "syno_ttyS1": "serial,0x2f8"
    },
    "menu_entries": {
      "RedPill SA6400 v7.1.1-42962 Beta (USB, Verbose)": {
        "options": [
          "savedefault",
          "set root=(hd0,msdos1)",
          "echo Loading Linux...",
          "linux /zImage @@@CMDLINE@@@",
          "echo Loading initramfs...",
          "initrd (hd0,msdos3)/initrd-dsm",
          "echo Starting kernel with USB boot"
        ],
        "cmdline": {
          "earlyprintk": null,
          "loglevel": 15,
          "log_buf_len": "32M"
        }
      },
      "RedPill SA6400 v7.1.1-42962 Beta (SATA, Verbose)": {
        "options": [
          "savedefault",
          "set root=(hd0,msdos1)",
          "echo Loading Linux...",
          "linux /zImage @@@CMDLINE@@@",
          "echo Loading initramfs...",
          "initrd (hd0,msdos3)/initrd-dsm",
          "echo Starting kernel with SATA boot"
        ],
        "cmdline": {
          "earlyprintk": null,
          "loglevel": 15,
          "synoboot_satadom": 2,
          "log_buf_len": "32M"
        }
      }
    }
  },
  "extra": {
    "compress_rd": false,
    "ramdisk_copy": {
      "@@@EXT@@@/rp-lkm/redpill-linux-v5.10.55+.ko": "usr/lib/modules/rp.ko",
      "@@@COMMON@@@/iosched-trampoline5.sh": "usr/sbin/modprobe"
    },
    "bootp1_copy": {
      "@@@PAT@@@/GRUB_VER": "GRUB_VER",
      "@@@COMMON@@@/EFI/boot/SynoBootLoader.conf": "EFI/BOOT/",
      "@@@COMMON@@@/EFI/boot/SynoBootLoader.efi": "EFI/BOOT/"
    },
    "bootp2_copy": {
      "@@@PAT@@@/GRUB_VER": "GRUB_VER",
      "@@@COMMON@@@/EFI": "EFI",
      "@@@PAT@@@/grub_cksum.syno": "grub_cksum.syno",
      "@@@PAT@@@/rd.gz": "rd.gz",
      "@@@PAT@@@/zImage": "zImage"
    }
  }
}
