{
  "os": {
    "id": "ds920p_64551",
    "pat_url": "https://global.download.synology.com/download/DSM/release/7.2/64551/DSM_DS920%2B_64551.pat",
    "sha256": "d5dc4f98cfbf9b8b9bf77c607a6f0acd2cc2a4ee0651bf50b12a79e3de74204b"
  },
  "files": {
    "zlinux": {
      "name": "zImage",
      "sha256": "8cbe286e7b8085ca579695505311ba7265e018a7b4417ec33484fc8df13d2ec3"
    },
    "ramdisk": {
      "name": "rd.gz",
      "sha256": "641740f5783965ff10b6c333f589c4e31a55f94bc854e6cf2c849d6b1ab6be5c"
    },
    "vmlinux": {
      "sha256": "c69064c103784652ac12926525835299a1ed2259616d8650f8420fab8a34ef87"
    }
  },
  "patches": {
    "zlinux": [
      "zImage-001-920p-64551-ramdisk-and-flag-NOP.bsp"
    ],
    "ramdisk": [
      "@@@COMMON@@@/ramdisk-001-disable-root-pwd.patch",
      "@@@COMMON@@@/v7.2.0/ramdisk-002-init-script.patch",
      "@@@COMMON@@@/v7.2.0/ramdisk-003-post-init-script-noatime.patch",
      "@@@COMMON@@@/ramdisk-004-network-hosts.patch",
      "@@@COMMON@@@/ramdisk-common-etc-rc.patch"
    ]
  },
  "synoinfo": {
    "maxdisks": "16",
    "internalportcfg": "0xffff",
    "esataportcfg": "0x0",
    "buzzeroffen": "0xffff",
    "rss_server": "https://raw.githubusercontent.com/PeterSuh-Q3/redpill-load/master/rss/7.2.0/rss.xml",
    "rss_server_ssl": "https://raw.githubusercontent.com/PeterSuh-Q3/redpill-load/master/rss/7.2.0/rss.xml",
    "rss_server_v2": "https://raw.githubusercontent.com/PeterSuh-Q3/redpill-load/master/rss/7.2.0/rss.json",
    "small_info_path": "https://example.com/null",
    "security_version_server": "https://example.com/smallupdate"
  },
  "grub": {
    "template": "@@@COMMON@@@/grub-template.conf",
    "base_cmdline": {
      "sn": "",
      "vid": "0x46f4",
      "pid": "0x0001",
      "mac1": "",
      "netif_num": 1,
      "syno_hw_version": "DS920+",
      "intel_iommu": "igfx_off",
      "HddEnableDynamicPower": 1,
      "vender_format_version": 2,
      "console": "ttyS0,115200n8",
      "synoboot2": null,
      "elevator": "elevator",
      "syno_ttyS0": "serial,0x3f8",
      "syno_ttyS1": "serial,0x2f8",
      "root": "/dev/md0",
      "earlycon": "uart8250,io,0x3f8,115200n8"
    },
    "menu_entries": {
      "RedPill DS920+ v7.2.0-64551 (USB, Verbose)": {
        "options": [
          "savedefault",
          "set root=(hd0,msdos1)",
          "echo Loading Linux...",
          "linux /zImage @@@CMDLINE@@@",
          "echo Loading initramfs...",
          "initrd (hd0,msdos3)/initrd-dsm",
          "echo Starting kernel with USB boot"
        ],
        "cmdline": {
          "earlyprintk": null,
          "withefi": null,
          "loglevel": 15,
          "log_buf_len": "32M"
        }
      },
      "RedPill DS920+ v7.2.0-64551 (SATA, Verbose)": {
        "options": [
          "savedefault",
          "set root=(hd0,msdos1)",
          "echo Loading Linux...",
          "linux /zImage @@@CMDLINE@@@",
          "echo Loading initramfs...",
          "initrd (hd0,msdos3)/initrd-dsm",
          "echo Starting kernel with SATA boot",
          "echo WARNING: SATA boot support on this platform is experimental!"
        ],
        "cmdline": {
          "earlyprintk": null,
          "withefi": null,
          "loglevel": 15,
          "synoboot_satadom": 2,
          "log_buf_len": "32M"
        }
      }
    }
  },
  "extra": {
    "compress_rd": false,
    "ramdisk_copy": {
      "@@@EXT@@@/rp-lkm/redpill-linux-v4.4.302+.ko": "usr/lib/modules/rp.ko",
      "@@@COMMON@@@/iosched-trampoline.sh": "usr/sbin/modprobe"
    },
    "bootp1_copy": {
      "@@@PAT@@@/GRUB_VER": "GRUB_VER",
      "@@@COMMON@@@/EFI/boot/SynoBootLoader.conf": "EFI/BOOT/",
      "@@@COMMON@@@/EFI/boot/SynoBootLoader.efi": "EFI/BOOT/"
    },
    "bootp2_copy": {
      "@@@PAT@@@/GRUB_VER": "GRUB_VER",
      "@@@COMMON@@@/EFI": "EFI",
      "@@@PAT@@@/grub_cksum.syno": "grub_cksum.syno",
      "@@@PAT@@@/rd.gz": "rd.gz",
      "@@@PAT@@@/zImage": "zImage"
    }
  }
}
