{
  "os": {
    "id": "ds923p_42962",
    "pat_url": "https://global.download.synology.com/download/DSM/release/7.1.1-5/42962/DSM_DS923%2B_42962.pat",
    "sha256": "8fe1232e26661dd9e6db2a8e132bd8869b23b2887d77d298cd8e0b7cb2f9e2d6"
  },
  "files": {
    "zlinux": {
      "name": "zImage",
      "sha256": "2bf64e284b4aa3965bdd284cd76ec441fd1ab7b136bee6613bcbae12ef9b770d"
    },
    "ramdisk": {
      "name": "rd.gz",
      "sha256": "42169a168afc7589eff1f80c0c5f720a051edae8d4f40c489e8deed06195b20a"
    },
    "vmlinux": {
      "sha256": "37e9dbb350940b90a5c86fa9cd71ecaa9e784f00d65e12a6997a7c98867c6300"
    }
  },
  "patches": {
    "zlinux": [
      "zImage-001-923p-42962-ramdisk-and-flag-NOP.bsp"
    ],
    "ramdisk": [
      "@@@COMMON@@@/ramdisk-001-disable-root-pwd.patch",
      "@@@COMMON@@@/v7.1.1/ramdisk-002-init-script.patch",
      "@@@COMMON@@@/v7.1.1/ramdisk-003-post-init-script-noatime.patch",
      "@@@COMMON@@@/ramdisk-004-network-hosts.patch",
      "@@@COMMON@@@/ramdisk-common-etc-rc.patch"
    ]
  },
  "synoinfo": {
    "maxdisks": "16",
    "internalportcfg": "0xffff",
    "esataportcfg": "0x0",
    "HddHotplug": "",
    "support_led_brightness_adjustment": "",
    "support_leds_lp3943": "",
    "buzzeroffen": "0xffff",
    "rss_server": "https://raw.githubusercontent.com/PeterSuh-Q3/redpill-load/master/rss/7.1.1/rss.xml",
    "rss_server_ssl": "https://raw.githubusercontent.com/PeterSuh-Q3/redpill-load/master/rss/7.1.1/rss.xml",
    "rss_server_v2": "https://raw.githubusercontent.com/PeterSuh-Q3/redpill-load/master/rss/7.1.1/rss.json",
    "small_info_path": "https://example.com/null",
    "security_version_server": "https://example.com/smallupdate"
  },
  "grub": {
    "template": "@@@COMMON@@@/grub-template.conf",
    "base_cmdline": {
      "sn": "",
      "vid": "0x46f4",
      "pid": "0x0001",
      "mac1": "",
      "netif_num": 1,
      "syno_hw_version": "DS923+",
      "SMBusHddDynamicPower": 1,
      "vender_format_version": 2,
      "console": "ttyS0,115200n8",
      "synoboot2": null,
      "elevator": "elevator",
      "syno_ttyS0": "serial,0x3f8",
      "root": "/dev/md0",
      "earlycon": "uart8250,io,0x3f8,115200n8",
      "withefi": null,
      "syno_ttyS1": "serial,0x2f8"
    },
    "menu_entries": {
      "RedPill DS923+ v7.1.1-42962 (USB, Verbose)": {
        "options": [
          "savedefault",
          "set root=(hd0,msdos1)",
          "echo Loading Linux...",
          "linux /zImage @@@CMDLINE@@@",
          "echo Loading initramfs...",
          "initrd (hd0,msdos3)/initrd-dsm",
          "echo Starting kernel with USB boot"
        ],
        "cmdline": {
          "earlyprintk": null,
          "loglevel": 15,
          "log_buf_len": "32M"
        }
      },
      "RedPill DS923+ v7.1.1-42962 (SATA, Verbose)": {
        "options": [
          "savedefault",
          "set root=(hd0,msdos1)",
          "echo Loading Linux...",
          "linux /zImage @@@CMDLINE@@@",
          "echo Loading initramfs...",
          "initrd (hd0,msdos3)/initrd-dsm",
          "echo Starting kernel with SATA boot",
          "echo WARNING: SATA boot support on this platform is experimental!"
        ],
        "cmdline": {
          "earlyprintk": null,
          "loglevel": 15,
          "synoboot_satadom": 2,
          "log_buf_len": "32M"
        }
      }
    }
  },
  "extra": {
    "compress_rd": false,
    "ramdisk_copy": {
      "@@@EXT@@@/rp-lkm/redpill-linux-v4.4.180+.ko": "usr/lib/modules/rp.ko",
      "@@@COMMON@@@/iosched-trampoline.sh": "usr/sbin/modprobe"
    },
    "bootp1_copy": {
      "@@@PAT@@@/GRUB_VER": "GRUB_VER",
      "@@@COMMON@@@/EFI/boot/SynoBootLoader.conf": "EFI/BOOT/",
      "@@@COMMON@@@/EFI/boot/SynoBootLoader.efi": "EFI/BOOT/"
    },
    "bootp2_copy": {
      "@@@PAT@@@/GRUB_VER": "GRUB_VER",
      "@@@COMMON@@@/EFI": "EFI",
      "@@@PAT@@@/grub_cksum.syno": "grub_cksum.syno",
      "@@@PAT@@@/rd.gz": "rd.gz",
      "@@@PAT@@@/zImage": "zImage"
    }
  }
}
