{
  "os": {
    "id": "dva3221_64561",
    "pat_url": "https://global.download.synology.com/download/DSM/release/7.2/64561/DSM_DVA3221_64561.pat",
    "sha256": "5990e460da1268fb06037ab99bdf5ea886ca5e7c6d6cf4e31c04e7888b2647d1"
  },
  "files": {
    "zlinux": {
      "name": "zImage",
      "sha256": "1b5e136b57ffa2e21bd84991c85bf7a70862a00d2ae7684bef1a183e72e41a72"
    },
    "ramdisk": {
      "name": "rd.gz",
      "sha256": "4b991278ea877cdc62cd4dce804ed42cfe9704a46c0e55408726aa73da63d236"
    },
    "vmlinux": {
      "sha256": "31513a3df864786f1d22b1ea20637bfde586eb4eaae192ae71be0be5bcc79f97"
    }
  },
  "patches": {
    "_comment": ".bsp patches are applied to FILES using bspatch(1); .patch are applied to DIRECTORIES using patch(1)",
    "zlinux": [
      "zImage-001-dva3221-64561-ramdisk-and-flag-NOP.bsp"
    ],
    "ramdisk": [
      "@@@COMMON@@@/ramdisk-001-disable-root-pwd.patch",
      "@@@COMMON@@@/v7.2.0/ramdisk-002-init-script.patch",
      "@@@COMMON@@@/v7.2.0/ramdisk-003-post-init-script-noatime.patch",
      "@@@COMMON@@@/ramdisk-004-network-hosts.patch",
      "@@@COMMON@@@/ramdisk-common-etc-rc.patch"
    ]
  },
  "synoinfo": {
    "maxdisks": "24",
    "support_bde_internal_10g": "no",
    "support_disk_compatibility": "no",
    "supportraidgroup": "no",
    "support_syno_hybrid_raid": "yes",
    "internalportcfg": "0xfffff",
    "SasIdxMap": "0",
    "esataportcfg": "0x00",
    "rss_server": "https://raw.githubusercontent.com/PeterSuh-Q3/redpill-load/master/rss/7.2.0/rss.xml",
    "rss_server_ssl": "https://raw.githubusercontent.com/PeterSuh-Q3/redpill-load/master/rss/7.2.0/rss.xml",
    "rss_server_v2": "https://raw.githubusercontent.com/PeterSuh-Q3/redpill-load/master/rss/7.2.0/rss.json",
    "small_info_path": "https://example.com/null",
    "security_version_server": "https://example.com/smallupdate"
  },
  "grub": {
    "template": "@@@COMMON@@@/grub-template.conf",
    "base_cmdline": {
      "sn": "",
      "vid": "0x46f4",
      "pid": "0x0001",
      "SataPortMap": "1",
      "DiskIdxMap": "0",
      "mac1": "",
      "netif_num": 1,
      "syno_hw_version": "DVA3221",
      "syno_hdd_powerup_seq": 0,
      "HddHotplug": 0,
      "vender_format_version": 2,
      "console": "ttyS0,115200n8",
      "withefi": null,
      "elevator": "elevator",
      "syno_port_thaw": 1,
      "syno_hdd_detect": 0,
      "root": "/dev/md0",
      "earlycon": "uart8250,io,0x3f8,115200n8"
    },
    "menu_entries": {
      "RedPill DVA3221 v7.2.0-64561 (USB, Verbose)": {
        "options": [
          "savedefault",
          "set root=(hd0,msdos1)",
          "echo Loading Linux...",
          "linux /zImage @@@CMDLINE@@@",
          "echo Loading initramfs...",
          "initrd (hd0,msdos3)/initrd-dsm",
          "echo Starting kernel with USB boot"
        ],
        "cmdline": {
          "earlyprintk": null,
          "loglevel": 15,
          "log_buf_len": "32M"
        }
      },
      "RedPill DVA3221 v7.2.0-64561 (SATA, Verbose)": {
        "options": [
          "savedefault",
          "set root=(hd0,msdos1)",
          "echo Loading Linux...",
          "linux /zImage @@@CMDLINE@@@",
          "echo Loading initramfs...",
          "initrd (hd0,msdos3)/initrd-dsm",
          "echo Starting kernel with SATA boot"
        ],
        "cmdline": {
          "earlyprintk": null,
          "loglevel": 15,
          "synoboot_satadom": 2,
          "log_buf_len": "32M"
        }
      }
    }
  },
  "extra": {
    "compress_rd": false,
    "ramdisk_copy": {
      "@@@EXT@@@/rp-lkm/redpill-linux-v4.4.302+.ko": "usr/lib/modules/rp.ko",
      "@@@COMMON@@@/iosched-trampoline.sh": "usr/sbin/modprobe"
    },
    "bootp1_copy": {
      "@@@PAT@@@/GRUB_VER": "GRUB_VER",
      "@@@COMMON@@@/EFI/boot/SynoBootLoader.conf": "EFI/BOOT/",
      "@@@COMMON@@@/EFI/boot/SynoBootLoader.efi": "EFI/BOOT/"
    },
    "bootp2_copy": {
      "@@@PAT@@@/GRUB_VER": "GRUB_VER",
      "@@@COMMON@@@/EFI": "EFI",
      "@@@PAT@@@/grub_cksum.syno": "grub_cksum.syno",
      "@@@PAT@@@/rd.gz": "rd.gz",
      "@@@PAT@@@/zImage": "zImage"
    }
  }
}
