{
  "mod_version": "v1",

  "files": [
    {
      "name": "check-virtio.sh",
      "url": "https://gitlab.com/tinypill/redpill-ttg/redpill-virtio/-/raw/master/src/check-virtio.sh",
      "sha256": "cedced0bf29ff691ab6b4a7e2001efa40b2cc5fd31e3a9834d210a4b3408ded8",
      "packed": false
    },
    {
      "name": "virtio-4.4.180p.tgz",
      "url": "https://gitlab.com/tinypill/jumkey/redpill-load/-/raw/develop/redpill-virtio/releases/v1.0.0/geminilake/virtio-4.4.180p.tgz",
      "sha256": "4fb7d2b4a72f100c0c1d3aceeae769dbafd08fcccda6e13a9e02e15582f71ebd",
      "packed": true
    }
  ],

  "kmods": {
    "virtio.ko": "",
    "virtio_ring.ko": "",
    "virtio_mmio.ko": "",
    "virtio_pci.ko": "",
    "virtio_blk.ko": "",
    "virtio_net.ko": "",
    "virtio_scsi.ko": ""
  },

  "scripts": {
    "check_kmod": "check-virtio.sh"
  }
}
