module github.com/jetstack/cert-manager

go 1.17

require (
	github.com/Azure/azure-sdk-for-go v56.2.0+incompatible
	github.com/Azure/go-autorest/autorest v0.11.19
	github.com/Azure/go-autorest/autorest/adal v0.9.14
	github.com/Azure/go-autorest/autorest/to v0.4.0
	github.com/Venafi/vcert/v4 v4.14.3
	github.com/akamai/AkamaiOPEN-edgegrid-golang v1.1.1
	github.com/aws/aws-sdk-go v1.40.21
	github.com/cloudflare/cloudflare-go v0.20.0
	github.com/cpu/goacmedns v0.1.1
	github.com/digitalocean/godo v1.65.0
	github.com/go-logr/logr v1.2.0
	github.com/google/gofuzz v1.2.0
	github.com/googleapis/gnostic v0.5.5
	github.com/hashicorp/vault/api v1.1.1
	github.com/hashicorp/vault/sdk v0.2.1
	github.com/kr/pretty v0.3.0
	github.com/miekg/dns v1.1.34
	github.com/mitchellh/go-homedir v1.1.0
	github.com/munnerz/crd-schema-fuzz v1.0.0
	github.com/onsi/ginkgo v1.16.5
	github.com/onsi/gomega v1.17.0
	github.com/pavel-v-chernykh/keystore-go/v4 v4.2.0
	github.com/pkg/errors v0.9.1
	github.com/prometheus/client_golang v1.11.0
	github.com/sergi/go-diff v1.2.0
	github.com/spf13/cobra v1.2.1
	github.com/spf13/pflag v1.0.5
	github.com/stretchr/testify v1.7.0
	golang.org/x/crypto v0.0.0-20210921155107-089bfa567519
	golang.org/x/net v0.0.0-20211209124913-491a49abca63
	golang.org/x/oauth2 v0.0.0-20210819190943-2bc19b11175f
	golang.org/x/sync v0.0.0-20210220032951-036812b2e83c
	gomodules.xyz/jsonpatch/v2 v2.2.0
	google.golang.org/api v0.53.0
	helm.sh/helm/v3 v3.7.1
	k8s.io/api v0.23.1
	k8s.io/apiextensions-apiserver v0.23.1
	k8s.io/apimachinery v0.23.1
	k8s.io/apiserver v0.23.1
	k8s.io/cli-runtime v0.23.1
	k8s.io/client-go v0.23.1
	k8s.io/code-generator v0.23.1
	k8s.io/component-base v0.23.1
	k8s.io/klog/v2 v2.30.0
	k8s.io/kube-aggregator v0.23.1
	k8s.io/kube-openapi v0.0.0-20211115234752-e816edb12b65
	k8s.io/kubectl v0.23.1
	k8s.io/utils v0.0.0-20210930125809-cb0fa318a74b
	sigs.k8s.io/controller-runtime v0.11.0
	sigs.k8s.io/controller-tools v0.7.0
	sigs.k8s.io/gateway-api v0.3.0
	sigs.k8s.io/structured-merge-diff/v4 v4.2.0
	sigs.k8s.io/yaml v1.3.0
	software.sslmate.com/src/go-pkcs12 v0.0.0-20210415151418-c5206de65a78
)

require (
	cloud.google.com/go v0.90.0 // indirect
	github.com/Azure/go-ansiterm v0.0.0-20210617225240-d185dfc1b5a1 // indirect
	github.com/Azure/go-autorest v14.2.0+incompatible // indirect
	github.com/Azure/go-autorest/autorest/date v0.3.0 // indirect
	github.com/Azure/go-autorest/autorest/validation v0.3.1 // indirect
	github.com/Azure/go-autorest/logger v0.2.1 // indirect
	github.com/Azure/go-autorest/tracing v0.6.0 // indirect
	github.com/BurntSushi/toml v0.3.1 // indirect
	github.com/MakeNowJust/heredoc v0.0.0-20170808103936-bb23615498cd // indirect
	github.com/Masterminds/goutils v1.1.1 // indirect
	github.com/Masterminds/semver/v3 v3.1.1 // indirect
	github.com/Masterminds/sprig/v3 v3.2.2 // indirect
	github.com/Masterminds/squirrel v1.5.0 // indirect
	github.com/Microsoft/go-winio v0.5.1 // indirect
	github.com/Microsoft/hcsshim v0.9.2 // indirect
	github.com/NYTimes/gziphandler v1.1.1 // indirect
	github.com/Nvveen/Gotty v0.0.0-20120604004816-cd527374f1e5 // indirect
	github.com/PuerkitoBio/purell v1.1.1 // indirect
	github.com/PuerkitoBio/urlesc v0.0.0-20170810143723-de5bf2ad4578 // indirect
	github.com/asaskevich/govalidator v0.0.0-20200428143746-21a406dcc535 // indirect
	github.com/beorn7/perks v1.0.1 // indirect
	github.com/blang/semver v3.5.1+incompatible // indirect
	github.com/cenkalti/backoff/v3 v3.0.0 // indirect
	github.com/cespare/xxhash/v2 v2.1.1 // indirect
	github.com/chai2010/gettext-go v0.0.0-20160711120539-c6fed771bfd5 // indirect
	github.com/containerd/cgroups v1.0.2 // indirect
	github.com/containerd/containerd v1.5.9 // indirect
	github.com/containerd/continuity v0.2.2 // indirect
	github.com/coreos/go-semver v0.3.0 // indirect
	github.com/coreos/go-systemd/v22 v22.3.2 // indirect
	github.com/cpuguy83/go-md2man/v2 v2.0.1 // indirect
	github.com/cyphar/filepath-securejoin v0.2.3 // indirect
	github.com/davecgh/go-spew v1.1.1 // indirect
	github.com/docker/cli v20.10.7+incompatible // indirect
	github.com/docker/distribution v2.7.1+incompatible // indirect
	github.com/docker/docker v17.12.1-ce+incompatible // indirect
	github.com/docker/docker-credential-helpers v0.6.3 // indirect
	github.com/docker/go-connections v0.4.0 // indirect
	github.com/docker/go-metrics v0.0.1 // indirect
	github.com/docker/go-units v0.4.0 // indirect
	github.com/emicklei/go-restful v2.9.5+incompatible // indirect
	github.com/evanphx/json-patch v4.12.0+incompatible // indirect
	github.com/exponent-io/jsonpath v0.0.0-20151013193312-d6023ce2651d // indirect
	github.com/fatih/camelcase v1.0.0 // indirect
	github.com/fatih/color v1.12.0 // indirect
	github.com/felixge/httpsnoop v1.0.1 // indirect
	github.com/form3tech-oss/jwt-go v3.2.3+incompatible // indirect
	github.com/fsnotify/fsnotify v1.5.1 // indirect
	github.com/go-errors/errors v1.0.1 // indirect
	github.com/go-openapi/jsonpointer v0.19.5 // indirect
	github.com/go-openapi/jsonreference v0.19.5 // indirect
	github.com/go-openapi/swag v0.19.14 // indirect
	github.com/go-task/slim-sprig v0.0.0-20210107165309-348f09dbbbc0 // indirect
	github.com/gobuffalo/flect v0.2.3 // indirect
	github.com/gobwas/glob v0.2.3 // indirect
	github.com/gogo/protobuf v1.3.2 // indirect
	github.com/golang/groupcache v0.0.0-20210331224755-41bb18bfe9da // indirect
	github.com/golang/protobuf v1.5.2 // indirect
	github.com/golang/snappy v0.0.3 // indirect
	github.com/google/btree v1.0.1 // indirect
	github.com/google/go-cmp v0.5.6 // indirect
	github.com/google/go-querystring v1.0.0 // indirect
	github.com/google/shlex v0.0.0-20191202100458-e7afc7fbc510 // indirect
	github.com/google/uuid v1.3.0 // indirect
	github.com/googleapis/gax-go/v2 v2.0.5 // indirect
	github.com/gorilla/mux v1.8.0 // indirect
	github.com/gosuri/uitable v0.0.4 // indirect
	github.com/gotestyourself/gotestyourself v2.2.0+incompatible // indirect
	github.com/gregjones/httpcache v0.0.0-20180305231024-9cad4c3443a7 // indirect
	github.com/grpc-ecosystem/go-grpc-prometheus v1.2.0 // indirect
	github.com/grpc-ecosystem/grpc-gateway v1.16.0 // indirect
	github.com/hashicorp/errwrap v1.0.0 // indirect
	github.com/hashicorp/go-cleanhttp v0.5.1 // indirect
	github.com/hashicorp/go-multierror v1.1.0 // indirect
	github.com/hashicorp/go-retryablehttp v0.6.6 // indirect
	github.com/hashicorp/go-rootcerts v1.0.2 // indirect
	github.com/hashicorp/go-sockaddr v1.0.2 // indirect
	github.com/hashicorp/hcl v1.0.0 // indirect
	github.com/huandu/xstrings v1.3.2 // indirect
	github.com/imdario/mergo v0.3.12 // indirect
	github.com/inconshreveable/mousetrap v1.0.0 // indirect
	github.com/jmespath/go-jmespath v0.4.0 // indirect
	github.com/jmoiron/sqlx v1.3.1 // indirect
	github.com/josharian/intern v1.0.0 // indirect
	github.com/json-iterator/go v1.1.12 // indirect
	github.com/klauspost/compress v1.14.1 // indirect
	github.com/kr/text v0.2.0 // indirect
	github.com/lann/builder v0.0.0-20180802200727-47ae307949d0 // indirect
	github.com/lann/ps v0.0.0-20150810152359-62de8c46ede0 // indirect
	github.com/lib/pq v1.10.0 // indirect
	github.com/liggitt/tabwriter v0.0.0-20181228230101-89fcab3d43de // indirect
	github.com/mailru/easyjson v0.7.6 // indirect
	github.com/mattn/go-colorable v0.1.8 // indirect
	github.com/mattn/go-isatty v0.0.12 // indirect
	github.com/mattn/go-runewidth v0.0.9 // indirect
	github.com/matttproud/golang_protobuf_extensions v1.0.2-0.20181231171920-c182affec369 // indirect
	github.com/mitchellh/copystructure v1.1.1 // indirect
	github.com/mitchellh/go-wordwrap v1.0.0 // indirect
	github.com/mitchellh/mapstructure v1.4.1 // indirect
	github.com/mitchellh/reflectwalk v1.0.1 // indirect
	github.com/moby/locker v1.0.1 // indirect
	github.com/moby/spdystream v0.2.0 // indirect
	github.com/moby/term v0.0.0-20210610120745-9d4ed1856297 // indirect
	github.com/modern-go/concurrent v0.0.0-20180306012644-bacd9c7ef1dd // indirect
	github.com/modern-go/reflect2 v1.0.2 // indirect
	github.com/monochromegane/go-gitignore v0.0.0-20200626010858-205db1a8cc00 // indirect
	github.com/munnerz/goautoneg v0.0.0-20191010083416-a7dc8b61c822 // indirect
	github.com/nxadm/tail v1.4.8 // indirect
	github.com/opencontainers/go-digest v1.0.0 // indirect
	github.com/opencontainers/image-spec v1.0.2 // indirect
	github.com/opencontainers/runc v1.1.0 // indirect
	github.com/patrickmn/go-cache v2.1.0+incompatible // indirect
	github.com/peterbourgon/diskv v2.0.1+incompatible // indirect
	github.com/pierrec/lz4 v2.5.2+incompatible // indirect
	github.com/pmezard/go-difflib v1.0.0 // indirect
	github.com/prometheus/client_model v0.2.0 // indirect
	github.com/prometheus/common v0.28.0 // indirect
	github.com/prometheus/procfs v0.6.0 // indirect
	github.com/rogpeppe/go-internal v1.6.1 // indirect
	github.com/rubenv/sql-migrate v0.0.0-20210614095031-55d5740dbbcc // indirect
	github.com/russross/blackfriday v1.5.2 // indirect
	github.com/russross/blackfriday/v2 v2.1.0 // indirect
	github.com/ryanuber/go-glob v1.0.0 // indirect
	github.com/shopspring/decimal v1.2.0 // indirect
	github.com/sirupsen/logrus v1.8.1 // indirect
	github.com/spf13/cast v1.3.1 // indirect
	github.com/stretchr/objx v0.2.0 // indirect
	github.com/xeipuuv/gojsonpointer v0.0.0-20180127040702-4e3ac2762d5f // indirect
	github.com/xeipuuv/gojsonreference v0.0.0-20180127040603-bd5ef7bd5415 // indirect
	github.com/xeipuuv/gojsonschema v1.2.0 // indirect
	github.com/xlab/treeprint v0.0.0-20181112141820-a009c3971eca // indirect
	go.etcd.io/etcd/api/v3 v3.5.0 // indirect
	go.etcd.io/etcd/client/pkg/v3 v3.5.0 // indirect
	go.etcd.io/etcd/client/v3 v3.5.0 // indirect
	go.opencensus.io v0.23.0 // indirect
	go.opentelemetry.io/contrib v0.20.0 // indirect
	go.opentelemetry.io/contrib/instrumentation/google.golang.org/grpc/otelgrpc v0.20.0 // indirect
	go.opentelemetry.io/contrib/instrumentation/net/http/otelhttp v0.20.0 // indirect
	go.opentelemetry.io/otel v0.20.0 // indirect
	go.opentelemetry.io/otel/exporters/otlp v0.20.0 // indirect
	go.opentelemetry.io/otel/metric v0.20.0 // indirect
	go.opentelemetry.io/otel/sdk v0.20.0 // indirect
	go.opentelemetry.io/otel/sdk/export/metric v0.20.0 // indirect
	go.opentelemetry.io/otel/sdk/metric v0.20.0 // indirect
	go.opentelemetry.io/otel/trace v0.20.0 // indirect
	go.opentelemetry.io/proto/otlp v0.7.0 // indirect
	go.starlark.net v0.0.0-20200306205701-8dd3e2ee1dd5 // indirect
	go.uber.org/atomic v1.7.0 // indirect
	go.uber.org/multierr v1.6.0 // indirect
	go.uber.org/zap v1.19.1 // indirect
	golang.org/x/mod v0.4.2 // indirect
	golang.org/x/sys v0.0.0-20211216021012-1d35b9e2eb4e // indirect
	golang.org/x/term v0.0.0-20210615171337-6886f2dfbf5b // indirect
	golang.org/x/text v0.3.7 // indirect
	golang.org/x/time v0.0.0-20210723032227-1f47c861a9ac // indirect
	golang.org/x/tools v0.1.6-0.20210820212750-d4cc65f0b2ff // indirect
	golang.org/x/xerrors v0.0.0-20200804184101-5ec99f83aff1 // indirect
	google.golang.org/appengine v1.6.7 // indirect
	google.golang.org/genproto v0.0.0-20220118154757-00ab72f36ad5 // indirect
	google.golang.org/grpc v1.43.0 // indirect
	google.golang.org/protobuf v1.27.1 // indirect
	gopkg.in/gorp.v1 v1.7.2 // indirect
	gopkg.in/inf.v0 v0.9.1 // indirect
	gopkg.in/ini.v1 v1.62.0 // indirect
	gopkg.in/natefinch/lumberjack.v2 v2.0.0 // indirect
	gopkg.in/square/go-jose.v2 v2.5.1 // indirect
	gopkg.in/tomb.v1 v1.0.0-20141024135613-dd632973f1e7 // indirect
	gopkg.in/yaml.v2 v2.4.0 // indirect
	gopkg.in/yaml.v3 v3.0.0-20210107192922-496545a6307b // indirect
	k8s.io/gengo v0.0.0-20210813121822-485abfe95c7c // indirect
	oras.land/oras-go v0.4.0 // indirect
	sigs.k8s.io/apiserver-network-proxy/konnectivity-client v0.0.25 // indirect
	sigs.k8s.io/json v0.0.0-20211020170558-c049b76a60c6 // indirect
	sigs.k8s.io/kustomize/api v0.10.1 // indirect
	sigs.k8s.io/kustomize/kyaml v0.13.0 // indirect
)

replace (
	golang.org/x/net => golang.org/x/net v0.0.0-20210224082022-3d97a244fca7

	// Update gengo to ensure we have the --trim-path-prefix feature in code-generator tools.
	k8s.io/gengo => k8s.io/gengo v0.0.0-20211115164449-b448ea381d54
)
