{
  "id": 9,
  "name": "Alert Notify",
  "active": false,
  "nodes": [
    {
      "parameters": {},
      "name": "Start",
      "type": "n8n-nodes-base.start",
      "typeVersion": 1,
      "position": [
        250,
        300
      ]
    },
    {
      "parameters": {
        "fromEmail": "quicao.test@gmail.com",
        "toEmail": "quicao.test@gmail.com",
        "ccEmail": "quicpx@vng.com.vn",
        "subject": "Test email from ISO N8N",
        "text": "Test email from ISO N8N",
        "options": {
          "allowUnauthorizedCerts": true
        }
      },
      "name": "Send Email",
      "type": "n8n-nodes-base.emailSend",
      "typeVersion": 1,
      "position": [
        600,
        300
      ],
      "credentials": {
        "smtp": "Test"
      }
    },
    {
      "parameters": {
        "chatId": "1601607163",
        "text": "={{$node[\"Send Email\"].parameter[\"text\"]}}",
        "additionalFields": {}
      },
      "name": "Telegram",
      "type": "n8n-nodes-base.telegram",
      "typeVersion": 1,
      "position": [
        660,
        570
      ],
      "credentials": {
        "telegramApi": "Telegram test"
      }
    }
  ],
  "connections": {
    "Start": {
      "main": [
        []
      ]
    }
  },
  "createdAt": "2021-07-07T08:48:29.841Z",
  "updatedAt": "2021-07-07T08:50:14.235Z",
  "settings": {},
  "staticData": null
}