module gitlab.com/tin-roof/meerchat-aac/user

go 1.19

require (
	github.com/google/uuid v1.3.0
	github.com/jackc/pgx/v4 v4.17.2
	gitlab.com/tin-roof/meerchat-aac/database v1.0.9
	gitlab.com/tin-roof/meerchat-aac/logger v0.0.4
)

require (
	github.com/jackc/chunkreader/v2 v2.0.1 // indirect
	github.com/jackc/pgconn v1.13.0 // indirect
	github.com/jackc/pgio v1.0.0 // indirect
	github.com/jackc/pgpassfile v1.0.0 // indirect
	github.com/jackc/pgproto3/v2 v2.3.1 // indirect
	github.com/jackc/pgservicefile v0.0.0-20200714003250-2b9c44734f2b // indirect
	github.com/jackc/pgtype v1.12.0 // indirect
	golang.org/x/crypto v0.0.0-20220829220503-c86fa9a7ed90 // indirect
	golang.org/x/text v0.3.8 // indirect
)
