<svg width="24" height="24" viewBox="0 0 24 24" fill="none" xmlns="http://www.w3.org/2000/svg">
<path d="M4 20.0002V9.50024L11.5 4.00024L19 10.0002V20.0002C19 20.5002 18.5 21.0002 18 21.0002H14V14.0002C14 13.5002 13.5 13.0002 13 13.0002H10C9.5 13.0002 9 13.5002 9 14.0002V21.0002H5C4.5 21.0002 4 20.5002 4 20.0002Z" fill="#777777"/>
<path d="M2 11.0002L11.5 4.00024L21 11.0002" stroke="#777777" stroke-width="1.5" stroke-linecap="round" stroke-linejoin="round"/>
</svg>
