<svg width="31" height="30" viewBox="0 0 31 30" fill="none" xmlns="http://www.w3.org/2000/svg">
<path d="M12.5181 9.52255L15.9365 2.59611L19.3549 9.52255C19.7191 10.2604 20.423 10.7718 21.2373 10.8902L28.881 12.0009L23.35 17.3923L24.397 18.4665L23.35 17.3923C22.7607 17.9667 22.4919 18.7942 22.631 19.6052L23.9367 27.2181L17.0999 23.6237C16.3716 23.2408 15.5015 23.2408 14.7732 23.6237L7.93637 27.2181L9.24208 19.6052C9.38118 18.7942 9.11231 17.9667 8.52309 17.3923L2.992 12.0009L10.6358 10.8902C11.4501 10.7718 12.154 10.2604 12.5181 9.52255Z" stroke="#7EB621" stroke-width="3"/>
</svg>
