<svg width="50" height="50" viewBox="0 0 50 50" fill="none" xmlns="http://www.w3.org/2000/svg">
<path d="M42.7179 36.8043L39.7261 33.8126C38.2315 32.318 35.8085 32.318 34.3165 33.8126L31.9649 36.1641C31.4395 36.6895 30.6437 36.8655 29.9653 36.5671C26.5578 35.0751 23.1911 32.8128 20.1891 29.8108C17.1999 26.8216 14.9453 23.4702 13.4507 20.0755C13.1395 19.3741 13.3206 18.5503 13.8638 18.007L15.9706 15.9003C17.682 14.1889 17.682 11.7684 16.1874 10.2738L13.1956 7.28205C11.2036 5.2901 7.97469 5.2901 5.98273 7.28205L4.31979 8.94244C2.42986 10.8324 1.64174 13.5589 2.15185 16.2624C3.41181 22.9269 7.2835 30.224 13.5297 36.4702C19.7759 42.7164 27.073 46.5881 33.7375 47.8481C36.441 48.3582 39.1675 47.5701 41.0575 45.6801L42.7179 44.0197C44.7098 42.0278 44.7098 38.7988 42.7179 36.8043V36.8043Z" stroke="#7EB621" stroke-width="3" stroke-linecap="round" stroke-linejoin="round"/>
<path d="M27.5041 12.271C30.1337 12.2353 32.776 13.2096 34.7833 15.2168" stroke="#7EB621" stroke-width="3" stroke-linecap="round" stroke-linejoin="round"/>
<path d="M41.9961 8.00392C37.9944 4.00216 32.7479 2 27.5041 2" stroke="#7EB621" stroke-width="3" stroke-linecap="round" stroke-linejoin="round"/>
<path d="M37.7286 22.4957C37.7643 19.8662 36.79 17.2238 34.7827 15.2166" stroke="#7EB621" stroke-width="3" stroke-linecap="round" stroke-linejoin="round"/>
<path d="M41.9959 8.00391C45.9976 12.0057 47.9998 17.2521 47.9998 22.496" stroke="#7EB621" stroke-width="3" stroke-linecap="round" stroke-linejoin="round"/>
</svg>
