<svg width="136" height="127" viewBox="0 0 136 127" fill="none" xmlns="http://www.w3.org/2000/svg">
<path fill-rule="evenodd" clip-rule="evenodd" d="M37.6625 36.3433H37.6607H37.6625ZM68.2224 39.2929V39.2917V39.2911H68.2211V39.2905L68.2224 39.2929ZM47.7661 50.9174H47.7612H47.7661ZM57.3217 21.9139C57.7849 22.2977 58.2384 22.6975 58.6833 23.1107L57.3217 21.9139ZM68.2248 5.17804V5.20672V5.17804ZM79.1273 21.9139L77.7663 23.1107C78.21 22.6981 78.6641 22.2983 79.1273 21.9139ZM68.2248 7.91526V7.94394V7.91526ZM59.6329 19.2926V23.9456V19.2926ZM68.2248 12.8386V12.8685V12.8386ZM72.6599 23.2828V15.6234L68.2242 12.8386L63.7885 15.624V23.2828C62.9603 22.3655 61.6054 20.9746 59.6323 19.2926V13.3409C61.3747 12.232 65.3667 9.72726 68.2236 7.91526C71.081 9.72726 75.0724 12.232 76.8155 13.3409V19.2926C74.843 20.9746 73.4887 22.3655 72.6599 23.2828ZM72.6599 29.196V23.2834V29.196ZM68.2211 39.2905L68.2224 39.2911V39.2917V39.2923V39.2929L68.226 39.31V39.3106V39.3112V39.3118V39.3112V39.3106V39.31L68.2224 39.2929L68.2211 39.2966V39.2978V39.2984V39.2996L68.2199 39.3015L68.2193 39.3045L68.2187 39.3051V39.3064V39.3076H68.2181V39.3088V39.3094V39.31L68.2175 39.3106V39.3112V39.3118V39.3112V39.3106L68.2181 39.31V39.3094V39.3088V39.3076H68.2187V39.3064V39.3051L68.2193 39.3045L68.2199 39.3015L68.2211 39.2996V39.2984V39.2978V39.2966L68.2224 39.2929L68.2211 39.2905ZM68.2211 39.2856V39.2868V39.288V39.2887V39.2893V39.2899V39.2905V39.2899V39.2856ZM68.2199 39.2838L68.2211 39.285V39.2856V39.285L68.2199 39.2838ZM68.2187 39.2789L68.2193 39.2801V39.2813V39.2819V39.2826L68.2199 39.2838L68.2187 39.2789ZM57.3217 27.644V38.8834C61.0873 41.7732 64.1296 45.4808 66.2083 49.435L65.9563 48.3425C64.1553 40.5428 63.5395 35.4108 59.1288 29.7575L59.7275 30.4569V24.1311C60.2566 24.7115 62.8767 27.6098 63.7885 29.196C65.8916 32.4306 67.3911 35.7123 68.2181 39.2789L68.2175 39.2752V39.2746L68.2169 39.274L68.2175 39.2746V39.2752L68.2187 39.2801V39.2813V39.2819V39.2826L68.2193 39.2838V39.2844L68.2205 39.285V39.2856V39.2862V39.2868V39.288V39.2887V39.2893V39.2899V39.2905V39.2911H68.2217V39.2923L68.223 39.2887V39.2868V39.2856V39.2838V39.2826L68.2242 39.2813V39.2795V39.2783V39.2771H68.2254V39.2764V39.2752V39.2764V39.2771H68.2242V39.2783L68.223 39.2826V39.2838V39.2856V39.288L68.2217 39.2899V39.2929V39.2899L68.223 39.2887V39.288V39.2868V39.2856V39.2838V39.2826L68.2242 39.2813V39.2795V39.2783L68.2254 39.2764V39.2752V39.2746V39.2752V39.2746V39.274V39.2746V39.274C69.0524 35.7098 70.5574 32.4294 72.6599 29.196C73.5717 27.6104 76.1917 24.7115 76.7221 24.1311V30.4569L77.3196 29.7587C72.9089 35.4108 72.2943 40.5428 70.4927 48.3425L70.2406 49.435C72.3187 45.4808 75.3617 41.7732 79.1273 38.8834V21.9139V12.069L68.2248 5.17804L57.3217 12.069V21.9139V27.644ZM55.9973 52.1667C55.9839 52.1624 55.9699 52.1588 55.957 52.1545C55.9705 52.1588 55.9839 52.1624 55.9973 52.1667ZM103.276 32.499C101.851 32.297 100.408 32.1908 98.9562 32.1829C100.408 32.1908 101.851 32.297 103.276 32.499ZM68.2248 0.253479V0.282774V0.253479ZM33.1731 32.499C34.5975 32.297 36.0409 32.1914 37.4934 32.1829C36.0409 32.1914 34.5975 32.297 33.1731 32.499ZM85.5282 58.8392C82.0293 58.8392 78.5176 58.268 75.1261 57.1102C73.8512 56.6775 72.5964 56.1593 71.363 55.5612C70.3181 55.0541 69.2904 54.4889 68.2816 53.8597L68.2706 53.8542L68.259 53.8597L68.2236 53.8817L68.1882 53.8597L68.1772 53.8542L68.1656 53.8597C67.1574 54.4889 66.129 55.0541 65.0842 55.5612C63.8507 56.1593 62.5959 56.6775 61.3216 57.1102C57.9295 58.268 54.4185 58.8392 50.9196 58.8392C37.5777 58.8392 25.0835 50.4713 20.447 37.1483C24.3066 34.7236 28.6489 33.1362 33.1713 32.499C33.687 33.8234 34.3522 35.3668 34.8453 36.4831C35.773 36.3909 36.711 36.3433 37.657 36.3433C36.7104 36.3433 35.7724 36.3909 34.8453 36.4831C31.6473 36.8017 28.5757 37.661 25.7231 38.9963C27.7987 43.1952 30.8991 46.8052 34.7013 49.5009C37.159 48.4176 39.7247 47.6559 42.3374 47.2184C43.6484 48.3371 45.5605 49.789 47.096 50.9254H47.1064L47.1168 50.9247H47.1283H47.1387L47.1497 50.9241H47.1601L47.1711 50.9235H47.1814H47.1918H47.193L47.2028 50.9229H47.2132H47.2236L47.2345 50.9223H47.2455L47.2559 50.9217H47.2663H47.2773H47.2876L47.298 50.9211H47.309H47.3194H47.3304L47.3407 50.9205H47.3517H47.3621H47.3725L47.3835 50.9199H47.3938H47.4042H47.4152L47.4256 50.9193H47.4366H47.4469H47.4579H47.4683L47.4787 50.9186H47.4897H47.5H47.511H47.5214H47.5324L47.5427 50.918H47.5531H47.5641H47.5745H47.5849H47.5958H47.6062H47.6068H47.6172H47.6276H47.6373H47.6386H47.6489H47.6593H47.6703H47.6807H47.6911H47.702H47.713H47.7234L47.7338 50.9174H47.7448H47.7551H47.7655H47.7765H47.7509H47.7405H47.7301H47.7191L47.7088 50.918H47.6984H47.6874H47.6764H47.666H47.6557H47.6471H47.6367H47.6264H47.6251H47.6154H47.605H47.5946H47.594H47.5836H47.5727H47.5623H47.5519H47.5434H47.533L47.5226 50.9186H47.5116H47.5012H47.4903H47.4799H47.4689L47.4585 50.9193H47.4482H47.4396H47.4292H47.4182L47.4079 50.9199H47.3969H47.3865H47.3761L47.3651 50.9205H47.3548H47.3444H47.3359L47.3255 50.9211H47.3145H47.3041H47.2931L47.2828 50.9217H47.2724H47.2614H47.251L47.2406 50.9223H47.2321L47.2211 50.9229H47.2107H47.2004L47.1906 50.9235H47.1894H47.179H47.1686L47.1576 50.9241H47.1473L47.1363 50.9247H47.1283H47.1174L47.107 50.9254H47.0966C44.5162 50.9833 41.9255 51.402 39.3933 52.1863C43.0973 53.8554 47.0057 54.6824 50.9129 54.6824C53.7251 54.6824 56.5374 54.254 59.2716 53.4026C58.2024 52.9204 57.1081 52.5073 55.9967 52.1667C52.8347 50.5567 47.8534 46.7606 47.8534 46.7606C47.8223 46.7606 47.7942 46.7582 47.7643 46.7582C45.9523 46.7582 44.1348 46.9108 42.3381 47.2184C44.1342 46.9108 45.9523 46.7582 47.7643 46.7582C47.7948 46.7582 47.8229 46.7606 47.8534 46.7606C44.4253 44.0283 41.5129 40.5843 39.3238 36.3921C38.8941 35.6988 37.7107 32.7016 37.3866 31.8698L37.3702 31.8283C35.4556 26.1732 35.1786 20.1708 36.4395 14.4901C36.5176 14.4901 36.5951 14.4901 36.6738 14.4901C41.5813 14.4901 46.4411 15.6051 50.8537 17.7491V22.4735C47.5342 20.5449 43.829 19.2926 39.956 18.8379C39.5209 23.5043 40.2606 28.2037 42.0805 32.4935C45.0905 32.9146 47.9437 33.7208 50.8537 35.0263V39.6451C48.814 38.5593 46.742 37.7696 44.6517 37.2289C47.0142 40.7229 50.0981 43.5852 53.6312 45.6743C55.9003 47.0182 58.3555 48.041 60.9243 48.7057C60.8407 48.5836 60.7547 48.4652 60.6692 48.3425C58.5795 45.3667 55.9772 42.8876 53.1624 41.0195V9.78585L68.2248 0.253479L83.2865 9.78585V41.0195C80.4718 42.8876 77.8695 45.3667 75.7804 48.3425C75.6943 48.4646 75.6089 48.5842 75.5247 48.7057C78.0941 48.041 80.5487 47.0182 82.8184 45.6743C86.3515 43.5852 89.4354 40.7229 91.7967 37.2289C89.707 37.7696 87.6344 38.5587 85.5947 39.6451V35.0257C88.5047 33.7208 91.3585 32.9146 94.3679 32.4935C96.1878 28.2037 96.9275 23.5043 96.493 18.8379C92.6187 19.2926 88.9148 20.5449 85.5947 22.4735V17.7491C90.0085 15.6051 94.8671 14.4901 99.7752 14.4901C99.8533 14.4901 99.932 14.4901 100.01 14.4901C101.27 20.1708 100.993 26.1732 99.0782 31.8283L99.0623 31.8698C98.7383 32.7016 97.5543 35.6988 97.1246 36.3921C94.9361 40.5843 92.0237 44.0283 88.595 46.7606C88.595 46.7606 83.6137 50.5567 80.4517 52.1667C79.3415 52.5073 78.2466 52.9204 77.1768 53.4026C79.9115 54.2546 82.7232 54.6824 85.5355 54.6824C89.4421 54.6824 93.3517 53.8554 97.055 52.1863C94.5229 51.402 91.9315 50.9833 89.353 50.9254C90.8879 49.789 92.7988 48.3371 94.1103 47.2178C92.3142 46.9108 90.4973 46.7582 88.6841 46.7582C88.6536 46.7582 88.6261 46.7606 88.595 46.7606C88.6267 46.7606 88.6542 46.7582 88.6841 46.7582C90.4973 46.7582 92.3136 46.9108 94.1103 47.2178C96.7224 47.6559 99.2882 48.4176 101.746 49.5009C105.548 46.8052 108.649 43.1946 110.725 38.9963C107.873 37.661 104.8 36.8017 101.602 36.4831C102.096 35.3668 102.761 33.8234 103.277 32.499C107.798 33.1362 112.141 34.7242 116.001 37.1483C111.364 50.4713 98.8701 58.8392 85.5282 58.8392Z" fill="white"/>
<path d="M55.7587 52.0941C53.1618 51.3141 50.471 50.918 47.7661 50.9174C50.471 50.918 53.1612 51.3135 55.7587 52.0941ZM55.957 52.1545C55.9088 52.1399 55.8606 52.1246 55.8124 52.1106C55.8606 52.1246 55.9088 52.1399 55.957 52.1545Z" fill="white"/>
<path fill-rule="evenodd" clip-rule="evenodd" d="M55.9973 52.1674C55.9839 52.1631 55.9698 52.1588 55.9576 52.1546C55.9088 52.1399 55.86 52.1253 55.8124 52.1106C55.8112 52.11 55.8105 52.11 55.8087 52.11C55.8087 52.1094 55.8087 52.1094 55.8087 52.1094C55.7928 52.1045 55.7758 52.099 55.7587 52.0948C53.1612 51.3136 50.471 50.9187 47.7661 50.9181H47.7612C47.5409 50.9181 47.3181 50.9205 47.0972 50.926C45.5617 49.7896 43.6502 48.3377 42.3393 47.219C44.1348 46.9108 45.9529 46.7589 47.7649 46.7589C47.796 46.7589 47.8235 46.7613 47.854 46.7613C47.854 46.7613 52.8359 50.5574 55.9973 52.1674Z" fill="white"/>
<path fill-rule="evenodd" clip-rule="evenodd" d="M80.4517 52.1674C83.6137 50.5574 88.5956 46.7613 88.5956 46.7613C88.6273 46.7613 88.6536 46.7589 88.6847 46.7589C90.4973 46.7589 92.3142 46.9108 94.1109 47.2184C92.8 48.3377 90.8891 49.7896 89.353 50.926C89.1314 50.9205 88.9099 50.9181 88.6884 50.9181C85.8993 50.9181 83.1242 51.338 80.4517 52.1674Z" fill="white"/>
<path fill-rule="evenodd" clip-rule="evenodd" d="M37.6595 36.3433H37.6607H37.6595ZM39.325 36.3921C38.7684 36.3598 38.2142 36.3433 37.6625 36.3433C38.2148 36.3433 38.7684 36.3598 39.325 36.3921Z" fill="white"/>
<path fill-rule="evenodd" clip-rule="evenodd" d="M34.8471 36.4831C34.3534 35.3669 33.6888 33.8234 33.1731 32.499C34.5975 32.297 36.0409 32.1914 37.4934 32.1829C37.4562 32.0773 37.4214 31.9748 37.3878 31.8698C37.7119 32.7017 38.8953 35.6989 39.325 36.3922C38.7684 36.3592 38.2148 36.3434 37.6625 36.3434H37.6606H37.6588C36.7128 36.3434 35.7748 36.391 34.8471 36.4831Z" fill="white"/>
<path fill-rule="evenodd" clip-rule="evenodd" d="M101.602 36.4831C100.674 36.3903 99.7349 36.3434 98.7889 36.3434C98.2372 36.3434 97.6825 36.3592 97.124 36.3922C97.5537 35.6989 98.7377 32.7017 99.0617 31.8698C99.0282 31.9748 98.9928 32.0773 98.9562 32.1829C100.408 32.1908 101.851 32.297 103.276 32.499C102.76 33.8234 102.096 35.3669 101.602 36.4831Z" fill="white"/>
<path fill-rule="evenodd" clip-rule="evenodd" d="M63.7891 29.196C62.8773 27.6099 60.2572 24.7109 59.7275 24.1311V24.028L59.6329 23.945V19.2926C61.606 20.9746 62.9609 22.3655 63.7897 23.2828V29.196H63.7891Z" fill="white"/>
<path fill-rule="evenodd" clip-rule="evenodd" d="M72.6599 29.196V23.2828C73.4881 22.3655 74.8429 20.9746 76.8167 19.2926V23.945L76.7227 24.028V24.1311C76.1917 24.7115 73.5717 27.6099 72.6599 29.196Z" fill="white"/>
<path fill-rule="evenodd" clip-rule="evenodd" d="M59.6329 24.028C59.321 23.7155 59.0049 23.4098 58.6833 23.1107L59.6329 23.9456V24.028ZM59.1288 29.7576L57.3217 27.6447C57.9881 28.3606 58.5868 29.063 59.1288 29.7576Z" fill="white"/>
<path fill-rule="evenodd" clip-rule="evenodd" d="M59.7275 30.4569L59.13 29.7575C58.5868 29.063 57.9881 28.3605 57.3229 27.6447V21.9139L58.6839 23.1107C59.0043 23.4097 59.3216 23.7155 59.6335 24.028V23.9456V24.028C59.6335 24.028 59.6665 24.064 59.7275 24.1311V30.4569Z" fill="white"/>
<path fill-rule="evenodd" clip-rule="evenodd" d="M59.7275 24.1311C59.6659 24.064 59.6335 24.0279 59.6335 24.0279V23.9456L59.7275 24.0279V24.1311Z" fill="white"/>
<path fill-rule="evenodd" clip-rule="evenodd" d="M76.8161 24.0279V23.9456L77.7657 23.1113C77.4441 23.4091 77.1273 23.7149 76.8161 24.0279ZM77.3196 29.7587C77.8615 29.0636 78.4608 28.3611 79.1273 27.6446L77.3196 29.7587Z" fill="white"/>
<path fill-rule="evenodd" clip-rule="evenodd" d="M76.7221 30.4569V24.1311C76.7831 24.064 76.8155 24.028 76.8155 24.028C77.1273 23.7155 77.4441 23.4091 77.7657 23.1113L79.1261 21.9139V27.6447C78.4608 28.3612 77.8609 29.0636 77.319 29.7588L76.7221 30.4569Z" fill="white"/>
<path fill-rule="evenodd" clip-rule="evenodd" d="M76.7221 24.1311V24.0279L76.8155 23.9456V24.0279C76.8161 24.0279 76.7831 24.064 76.7221 24.1311Z" fill="white"/>
<path d="M7.94059 96.0465V76.4489H0.317871V72.817H19.7525V76.4489H12.1291V96.0465H7.94059Z" fill="white"/>
<path d="M17.9527 96.0465L26.0996 72.8164H30.5494L38.6964 96.0465H34.3778L32.3815 90.0917H24.2345L22.2712 96.0465H17.9527ZM25.2812 86.6563H31.3342L29.2726 80.4391L28.3566 76.8408H28.2913C27.9422 78.3677 27.637 79.5682 27.3752 80.4391L25.2812 86.6563Z" fill="white"/>
<path d="M40.2667 96.0465L42.1641 72.8164H46.6468L51.2271 84.2999L52.3721 87.703H52.4374C52.8518 86.3505 53.2338 85.2166 53.5829 84.2999L58.1633 72.8164H62.646L64.5434 96.0465H60.3225L59.3735 83.0573C59.3296 82.5996 59.3082 82.0711 59.3082 81.4705C59.3082 80.8712 59.3192 80.386 59.3412 80.0144V79.4584H59.2759C58.7742 80.9634 58.3482 82.1632 58.0003 83.0567L54.2372 92.0539H50.5729L46.8104 83.0567L45.5342 79.4254H45.4683C45.5336 80.8218 45.5226 82.032 45.4353 83.0567L44.4863 96.0459H40.2667V96.0465Z" fill="white"/>
<path d="M66.1137 96.0465L74.2607 72.8164H78.7105L86.8574 96.0465H82.5389L80.5426 90.0917H72.3956L70.4323 96.0465H66.1137ZM73.4423 86.6563H79.4953L77.4337 80.4391L76.5176 76.8408H76.4523C76.1032 78.3677 75.7981 79.5682 75.5363 80.4391L73.4423 86.6563Z" fill="white"/>
<path d="M89.3109 96.0465V72.8164H96.9672C98.9299 72.8164 100.391 73.0239 101.352 73.4383C102.573 73.94 103.532 74.7358 104.231 75.8264C104.929 76.9171 105.278 78.2365 105.278 79.7849C105.278 81.2032 104.929 82.4952 104.231 83.6628C103.532 84.8297 102.584 85.6536 101.385 86.1327V86.198C101.58 86.439 101.831 86.8418 102.136 87.4088L106.913 96.0459H102.169L97.5891 87.3753H93.5324V96.0459H89.3109V96.0465ZM93.5318 83.7116H97.3272C98.4606 83.7116 99.3553 83.379 100.01 82.7137C100.665 82.0485 100.992 81.1489 100.992 80.0144C100.992 78.4001 100.381 77.3424 99.1594 76.8408C98.5704 76.5789 97.7197 76.4483 96.6071 76.4483H93.5318V83.7116Z" fill="white"/>
<path d="M109.629 96.0465V72.8164H113.849V96.0465H109.629Z" fill="white"/>
<path d="M116.467 96.0465L123.665 84.2682L116.729 72.8164H121.539L124.745 78.5093L126.184 81.3558H126.25C126.685 80.3744 127.166 79.4254 127.689 78.5093L130.928 72.8164H135.737L128.769 84.2682L136 96.0465H131.288L127.656 89.7976L126.217 87.0493H126.152C125.715 87.9874 125.247 88.9029 124.745 89.7976L121.146 96.0465H116.467Z" fill="white"/>
<path d="M41.9468 115.183C41.9468 113.391 42.5584 111.876 43.782 110.637C45.0051 109.398 46.6084 108.778 48.5912 108.778C49.4701 108.778 50.3337 108.931 51.1814 109.233C52.0291 109.537 52.7328 109.994 53.2924 110.6L51.9253 112.688C51.0459 111.809 49.9901 111.368 48.7591 111.368C47.655 111.368 46.7597 111.733 46.0725 112.46C45.3847 113.188 45.0417 114.087 45.0417 115.159C45.0417 116.23 45.3932 117.137 46.0969 117.881C46.8006 118.624 47.7197 118.996 48.8561 118.996C50.1829 118.996 51.3828 118.476 52.4539 117.436L53.6293 119.595C53.0544 120.203 52.3141 120.687 51.4109 121.047C50.5076 121.407 49.5671 121.587 48.5925 121.587C46.6096 121.587 45.0063 120.974 43.7833 119.751C42.5584 118.529 41.9468 117.006 41.9468 115.183Z" fill="white"/>
<path d="M59.5291 106.98V104.269H62.5752V106.98H59.5291ZM59.5291 121.299V109.066H62.5752V121.299H59.5291Z" fill="white"/>
<path d="M70.1308 116.813V111.657H68.5476V109.233H70.2028V105.732H73.1768V109.233H75.9592V111.657H73.1768V116.429C73.1768 117.309 73.4283 117.913 73.9324 118.241C74.4359 118.569 74.9912 118.733 75.5991 118.733C75.8066 118.733 75.9909 118.718 76.1502 118.685V121.347C75.6705 121.395 75.3587 121.419 75.2152 121.419C74.799 121.419 74.3993 121.391 74.0154 121.335C73.6321 121.278 73.1915 121.154 72.6965 120.963C72.2003 120.771 71.7731 120.519 71.413 120.208C71.0529 119.897 70.749 119.449 70.5018 118.865C70.2541 118.281 70.1308 117.598 70.1308 116.813Z" fill="white"/>
<path d="M81.859 123.266C82.3064 123.602 82.755 123.77 83.2023 123.77C84.1776 123.77 84.8898 123.242 85.3372 122.187L85.7931 121.107L80.636 109.066H84.0659L86.6322 116.118L87.0881 117.773H87.1358C87.2798 117.134 87.4153 116.598 87.544 116.166L89.9425 109.066H93.2528L87.8077 123.146C87.4079 124.217 86.8123 125.017 86.0207 125.545C85.2291 126.072 84.354 126.337 83.394 126.337C82.9625 126.337 82.5346 126.273 82.1105 126.145C81.6869 126.016 81.3708 125.889 81.1627 125.761L80.8508 125.545L81.859 123.266Z" fill="white"/>
</svg>
