<svg width="16" height="19" viewBox="0 0 16 19" fill="none" xmlns="http://www.w3.org/2000/svg">
<path d="M10.4749 2.02537C11.8417 3.39221 11.8417 5.60828 10.4749 6.97512C9.10804 8.34196 6.89197 8.34196 5.52513 6.97512C4.15829 5.60828 4.15829 3.39221 5.52513 2.02537C6.89197 0.658534 9.10804 0.658534 10.4749 2.02537Z" fill="#777777"/>
<path d="M10.4749 2.02537C11.8417 3.39221 11.8417 5.60828 10.4749 6.97512C9.10804 8.34196 6.89197 8.34196 5.52513 6.97512C4.15829 5.60828 4.15829 3.39221 5.52513 2.02537C6.89197 0.658534 9.10804 0.658534 10.4749 2.02537" stroke="#777777" stroke-linecap="round" stroke-linejoin="round"/>
<path d="M1 15.998V16.9991C1 17.5517 1.392 18.0002 1.875 18.0002H14.125C14.608 18.0002 15 17.5517 15 16.9991V15.998C15 12.9685 11.542 11.0002 8 11.0002C4.458 11.0002 1 12.9685 1 15.998Z" fill="#777777" stroke="#777777" stroke-linecap="round" stroke-linejoin="round"/>
</svg>
