<svg width="62" height="78" viewBox="0 0 62 78" fill="none" xmlns="http://www.w3.org/2000/svg">
<path d="M26 3C26 2.44772 26.4477 2 27 2H59C59.5523 2 60 2.44772 60 3V75C60 75.5523 59.5523 76 59 76H27C26.4477 76 26 75.5523 26 75V3Z" stroke="#7EB621" stroke-width="4"/>
<path d="M49 10H53V16H49V10Z" fill="#7EB621"/>
<path d="M41 10H45V16H41V10Z" fill="#7EB621"/>
<path d="M49 20H53V26H49V20Z" fill="#7EB621"/>
<path d="M41 20H45V26H41V20Z" fill="#7EB621"/>
<path d="M49 30H53V36H49V30Z" fill="#7EB621"/>
<path d="M41 30H45V36H41V30Z" fill="#7EB621"/>
<path d="M49 40H53V46H49V40Z" fill="#7EB621"/>
<path d="M41 40H45V46H41V40Z" fill="#7EB621"/>
<path d="M33 10H37V16H33V10Z" fill="#7EB621"/>
<path d="M33 20H37V26H33V20Z" fill="#7EB621"/>
<path d="M33 30H37V36H33V30Z" fill="#7EB621"/>
<path d="M33 40H37V46H33V40Z" fill="#7EB621"/>
<path d="M31 44H55V48H31V44Z" fill="#7EB621"/>
<path d="M31 34H55V38H31V34Z" fill="#7EB621"/>
<path d="M31 24H55V28H31V24Z" fill="#7EB621"/>
<path d="M31 14H55V18H31V14Z" fill="#7EB621"/>
<path d="M41 63H45V75H41V63Z" fill="#7EB621"/>
<path d="M49 50H53V56H49V50Z" fill="#7EB621"/>
<path d="M41 50H45V56H41V50Z" fill="#7EB621"/>
<path d="M33 50H37V56H33V50Z" fill="#7EB621"/>
<path d="M31 54H55V58H31V54Z" fill="#7EB621"/>
<path d="M33 60H37V75H33V60Z" fill="#7EB621"/>
<path d="M49 60H53V75H49V60Z" fill="#7EB621"/>
<rect x="34" y="60" width="16" height="4" fill="#7EB621"/>
<path d="M24 15H2V76H27" stroke="#7EB621" stroke-width="4" stroke-linejoin="round"/>
<path d="M8 20H12V25H8V20Z" fill="#7EB621"/>
<path d="M16 20H20V25H16V20Z" fill="#7EB621"/>
<path d="M8 29H12V34H8V29Z" fill="#7EB621"/>
<path d="M16 29H20V34H16V29Z" fill="#7EB621"/>
<path d="M8 38H12V43H8V38Z" fill="#7EB621"/>
<path d="M16 38H20V43H16V38Z" fill="#7EB621"/>
<path d="M8 47H12V52H8V47Z" fill="#7EB621"/>
<path d="M16 47H20V52H16V47Z" fill="#7EB621"/>
<path d="M8 56H12V61H8V56Z" fill="#7EB621"/>
<path d="M16 56H20V61H16V56Z" fill="#7EB621"/>
<path d="M8 65H12V74H8V65Z" fill="#7EB621"/>
<path d="M16 65H20V70H16V65Z" fill="#7EB621"/>
</svg>
