<svg width="94" height="128" viewBox="0 0 94 128" fill="none" xmlns="http://www.w3.org/2000/svg">
<path d="M9.47458 105.827H2.82488V112.014H10.2643V113.873H0.583008V96.7109H9.8822V98.5696H2.82488V103.993H9.47458V105.827Z" fill="white"/>
<path d="M13.7534 101.548L15.5118 104.197C15.9958 104.884 16.378 105.495 16.7851 106.183H16.8365C17.2442 105.469 17.6518 104.833 18.0849 104.171L19.7923 101.548H22.2379L18.0339 107.507L22.3393 113.872H19.8172L17.983 111.097C17.4989 110.384 17.0908 109.696 16.6582 108.958H16.6067C16.1991 109.697 15.7915 110.359 15.3075 111.097L13.5242 113.872H11.053L15.4354 107.583L11.2568 101.548H13.7534Z" fill="white"/>
<path d="M32.9372 113.44C32.3513 113.72 31.052 114.153 29.3961 114.153C25.6761 114.153 23.2559 111.632 23.2559 107.864C23.2559 104.07 25.8545 101.294 29.8802 101.294C31.2049 101.294 32.3768 101.625 32.9882 101.956L32.4787 103.662C31.9432 103.382 31.1025 103.076 29.8802 103.076C27.0518 103.076 25.5233 105.19 25.5233 107.736C25.5233 110.588 27.3575 112.345 29.8032 112.345C31.077 112.345 31.9177 112.039 32.5551 111.759L32.9372 113.44Z" fill="white"/>
<path d="M35.4838 95.7938H37.7262V113.873H35.4838V95.7938Z" fill="white"/>
<path d="M51.4576 110.486C51.4576 111.785 51.4831 112.905 51.559 113.873H49.5719L49.4445 111.861H49.3935C48.8331 112.854 47.5078 114.153 45.3169 114.153C43.3807 114.153 41.0619 113.058 41.0619 108.755V101.548H43.3043V108.347C43.3043 110.689 44.0431 112.293 46.0562 112.293C47.5593 112.293 48.6038 111.249 49.0114 110.231C49.1382 109.925 49.2152 109.517 49.2152 109.085V101.548H51.4576V110.486Z" fill="white"/>
<path d="M54.6925 111.606C55.3803 112.014 56.5522 112.472 57.6732 112.472C59.2781 112.472 60.0424 111.683 60.0424 110.639C60.0424 109.569 59.4055 109.009 57.7751 108.398C55.5332 107.583 54.4887 106.386 54.4887 104.909C54.4887 102.923 56.1191 101.294 58.7437 101.294C59.9925 101.294 61.088 101.625 61.7503 102.058L61.2153 103.687C60.7313 103.382 59.8391 102.948 58.6927 102.948C57.368 102.948 56.6547 103.712 56.6547 104.629C56.6547 105.648 57.368 106.106 58.9729 106.742C61.0874 107.531 62.2089 108.601 62.2089 110.435C62.2089 112.624 60.5015 114.152 57.6222 114.152C56.272 114.152 55.0237 113.796 54.1575 113.286L54.6925 111.606Z" fill="white"/>
<path d="M67.226 98.0853C67.226 98.8492 66.6905 99.4607 65.7994 99.4607C64.9842 99.4607 64.4492 98.8497 64.4492 98.0853C64.4492 97.3209 65.0097 96.6849 65.8504 96.6849C66.6656 96.6855 67.226 97.296 67.226 98.0853ZM64.7289 113.873V101.549H66.9713V113.873H64.7289Z" fill="white"/>
<path d="M71.8881 101.548L74.3088 108.449C74.7164 109.595 75.0476 110.613 75.3024 111.632H75.3788C75.659 110.613 76.0157 109.595 76.4238 108.449L78.8186 101.548H81.1629L76.3219 113.872H74.182L69.4939 101.548H71.8881Z" fill="white"/>
<path d="M84.5236 108.118C84.5745 111.148 86.4852 112.396 88.7531 112.396C90.3581 112.396 91.3516 112.116 92.1674 111.759L92.575 113.363C91.7858 113.72 90.4096 114.153 88.4479 114.153C84.652 114.153 82.3842 111.631 82.3842 107.913C82.3842 104.196 84.5751 101.293 88.1672 101.293C92.2183 101.293 93.2634 104.807 93.2634 107.073C93.2634 107.532 93.2374 107.862 93.1864 108.118H84.5236V108.118ZM91.0969 106.514C91.1229 105.113 90.5109 102.899 87.9888 102.899C85.696 102.899 84.7274 104.961 84.5496 106.514H91.0969Z" fill="white"/>
<path fill-rule="evenodd" clip-rule="evenodd" d="M24.9065 120.636H22.0118C21.5374 120.636 21.2444 120.757 21.1282 121C21.0576 121.14 21.0231 121.472 21.0231 121.997C21.0231 122.269 21.1122 122.48 21.2911 122.63C21.4392 122.746 21.6796 122.805 22.0145 122.805H23.2156C23.7288 122.805 24.1385 122.945 24.4464 123.224C24.7531 123.504 24.9065 123.897 24.9065 124.402V125.637C24.9065 126.173 24.7489 126.583 24.432 126.867C24.1163 127.151 23.6879 127.292 23.1418 127.292H19.891V126.173H22.8122C23.2984 126.173 23.5977 126.04 23.7171 125.774C23.7713 125.647 23.7978 125.298 23.7978 124.724C23.7978 124.19 23.4831 123.923 22.8515 123.923H21.6462C21.1467 123.923 20.7359 123.791 20.4175 123.529C20.0661 123.241 19.891 122.853 19.891 122.365V121.157C19.891 120.605 20.081 120.173 20.4605 119.855C20.7248 119.63 21.109 119.517 21.6133 119.517H24.906V120.636H24.9065ZM40.2684 120.636H38.3323V127.292H37.2007V120.636H35.2762V119.517H40.2684V120.636ZM56.2953 127.292H55.0821L54.4059 125.358H51.3265L50.6503 127.292H49.4376L51.9687 120.147C52.1396 119.672 52.4395 119.435 52.8667 119.435C53.294 119.435 53.5933 119.672 53.7647 120.147L56.2953 127.292ZM54.0434 124.285L52.8073 120.8L51.6879 124.285H54.0434ZM72.0043 127.292H70.5968L68.6904 124.3C68.6171 124.185 68.5503 124.034 68.5503 123.809C68.5503 123.372 68.7838 123.142 69.2503 123.142H69.893C70.4455 123.142 70.7215 122.88 70.7215 122.357V121.468C70.7215 120.914 70.4095 120.636 69.7885 120.636H67.5036V127.292H66.3737V119.517H70.1149C71.2735 119.517 71.8525 120.07 71.8525 121.172V122.513C71.8525 123.002 71.7018 123.394 71.4035 123.685C71.1047 123.975 70.7083 124.121 70.22 124.121H69.9265L72.0043 127.292Z" fill="white" stroke="white" stroke-width="0.5"/>
<path d="M24.9065 120.636H22.0118C21.5374 120.636 21.2444 120.757 21.1282 121C21.0576 121.14 21.0231 121.472 21.0231 121.997C21.0231 122.269 21.1122 122.48 21.2911 122.63C21.4392 122.746 21.6796 122.805 22.0145 122.805H23.2156C23.7288 122.805 24.1385 122.945 24.4464 123.224C24.7531 123.504 24.9065 123.897 24.9065 124.402V125.637C24.9065 126.173 24.7489 126.583 24.432 126.867C24.1163 127.151 23.6879 127.292 23.1418 127.292H19.891V126.173H22.8122C23.2984 126.173 23.5977 126.04 23.7171 125.774C23.7713 125.647 23.7978 125.298 23.7978 124.724C23.7978 124.19 23.4831 123.923 22.8515 123.923H21.6462C21.1467 123.923 20.7359 123.791 20.4175 123.529C20.0661 123.241 19.891 122.853 19.891 122.365V121.157C19.891 120.605 20.081 120.173 20.4605 119.855C20.7248 119.63 21.109 119.517 21.6133 119.517H24.906V120.636H24.9065ZM40.2684 120.636H38.3323V127.292H37.2007V120.636H35.2762V119.517H40.2684V120.636ZM56.2953 127.292H55.0821L54.4059 125.358H51.3265L50.6503 127.292H49.4376L51.9687 120.147C52.1396 119.672 52.4395 119.435 52.8667 119.435C53.294 119.435 53.5933 119.672 53.7647 120.147L56.2953 127.292ZM54.0434 124.285L52.8073 120.8L51.6879 124.285H54.0434ZM72.0043 127.292H70.5968L68.6904 124.3C68.6171 124.185 68.5503 124.034 68.5503 123.809C68.5503 123.372 68.7838 123.142 69.2503 123.142H69.893C70.4455 123.142 70.7215 122.88 70.7215 122.357V121.468C70.7215 120.914 70.4095 120.636 69.7885 120.636H67.5036V127.292H66.3737V119.517H70.1149C71.2735 119.517 71.8525 120.07 71.8525 121.172V122.513C71.8525 123.002 71.7018 123.394 71.4035 123.685C71.1047 123.975 70.7083 124.121 70.22 124.121H69.9265L72.0043 127.292Z" fill="white" stroke="white" stroke-width="0.5" stroke-miterlimit="10"/>
<path fill-rule="evenodd" clip-rule="evenodd" d="M30.1036 45.725C30.4756 45.725 30.7787 45.386 30.7787 44.9707C30.7787 44.5554 30.4756 44.2164 30.1036 44.2164C29.7315 44.2164 29.4285 44.5554 29.4285 44.9707C29.4285 45.386 29.7315 45.725 30.1036 45.725Z" fill="white"/>
<path fill-rule="evenodd" clip-rule="evenodd" d="M43.3828 55.6645C44.1195 55.6645 44.7208 55.0274 44.7208 54.2456C44.7208 53.4647 44.1195 52.8271 43.3828 52.8271C42.6467 52.8271 42.0459 53.4647 42.0459 54.2456C42.0459 55.0274 42.6467 55.6645 43.3828 55.6645Z" fill="white"/>
<g opacity="0.5">
<g opacity="0.5">
<path opacity="0.5" fill-rule="evenodd" clip-rule="evenodd" d="M46.8268 32.6691C47.063 32.6691 47.2551 32.8606 47.2551 33.0972C47.2551 33.3327 47.0635 33.5248 46.8268 33.5248C46.5912 33.5248 46.399 33.3333 46.399 33.0972C46.399 32.8606 46.5906 32.6691 46.8268 32.6691Z" fill="white"/>
</g>
</g>
<g opacity="0.8">
<g opacity="0.8">
<path opacity="0.8" fill-rule="evenodd" clip-rule="evenodd" d="M44.4677 70.0178C44.8105 70.0178 45.0881 70.3266 45.0881 70.7069C45.0881 71.0877 44.8105 71.3959 44.4677 71.3959C44.1248 71.3959 43.8478 71.0877 43.8478 70.7069C43.8478 70.3266 44.1254 70.0178 44.4677 70.0178Z" fill="white"/>
</g>
</g>
<path fill-rule="evenodd" clip-rule="evenodd" d="M29.5659 79.8783C29.9921 79.8783 30.3392 79.4751 30.3392 78.9813C30.3392 78.4874 29.9921 78.0848 29.5659 78.0848C29.1397 78.0848 28.7926 78.4874 28.7926 78.9813C28.7926 79.4751 29.1403 79.8783 29.5659 79.8783Z" fill="white"/>
<path fill-rule="evenodd" clip-rule="evenodd" d="M62.3872 45.8046C62.7529 45.8046 63.0528 45.4237 63.0528 44.9569C63.0528 44.4901 62.7534 44.1093 62.3872 44.1093C62.021 44.1093 61.7217 44.4901 61.7217 44.9569C61.7217 45.4237 62.0215 45.8046 62.3872 45.8046Z" fill="white"/>
<g opacity="0.5">
<g opacity="0.5">
<path opacity="0.5" fill-rule="evenodd" clip-rule="evenodd" d="M66.6947 55.9817C66.8826 55.9817 67.0355 56.1758 67.0355 56.4151C67.0355 56.6548 66.8832 56.8484 66.6947 56.8484C66.5063 56.8484 66.354 56.6548 66.354 56.4151C66.3545 56.1758 66.5069 55.9817 66.6947 55.9817Z" fill="white"/>
</g>
</g>
<path fill-rule="evenodd" clip-rule="evenodd" d="M63.1159 71.4675C63.3845 71.4675 63.6037 71.189 63.6037 70.8469C63.6037 70.5048 63.3845 70.2257 63.1159 70.2257C62.8474 70.2257 62.6287 70.5048 62.6287 70.8469C62.6287 71.189 62.8474 71.4675 63.1159 71.4675Z" fill="white"/>
<g opacity="0.3">
<g opacity="0.3">
<path opacity="0.3" fill-rule="evenodd" clip-rule="evenodd" d="M59.9442 23.5837C60.0381 23.5837 60.114 23.6807 60.114 23.8001C60.114 23.9205 60.0376 24.017 59.9442 24.017C59.8497 24.017 59.7738 23.92 59.7738 23.8001C59.7733 23.6807 59.8497 23.5837 59.9442 23.5837Z" fill="white"/>
</g>
</g>
<g opacity="0.5">
<g opacity="0.5">
<path opacity="0.5" fill-rule="evenodd" clip-rule="evenodd" d="M62.9981 36.221C63.186 36.221 63.3394 36.4152 63.3394 36.6544C63.3394 36.8947 63.186 37.0883 62.9981 37.0883C62.8102 37.0883 62.6568 36.8947 62.6568 36.6544C62.6568 36.4152 62.8102 36.221 62.9981 36.221Z" fill="white"/>
</g>
</g>
<path d="M24.1454 85.8145H18.4171V87.2218H76.5083V85.8145H70.7953V26.0439L56.4928 16.594V85.8119H55.0847V16.594L24.1454 39.1671V85.8145Z" fill="white"/>
<path d="M23.8896 36.0651L54.1761 13.7269H40.2472L35.3564 0.785645L30.9883 13.798H16.793L28.0899 22.57L23.8896 36.0651Z" fill="white"/>
</svg>
