<svg width="30" height="30" viewBox="0 0 30 30" fill="none" xmlns="http://www.w3.org/2000/svg">
<path fill-rule="evenodd" clip-rule="evenodd" d="M29.7237 23.8418V12.0506V6.17136C29.7237 3.10116 27.2267 0.605225 24.1565 0.605225H6.48704C3.41684 0.605225 0.920898 3.10116 0.920898 6.17136V12.0506V23.8418C0.920898 26.9131 3.41684 29.409 6.48704 29.409H24.1575C27.2267 29.409 29.7237 26.9131 29.7237 23.8418ZM26.3913 3.92236V8.80408L21.5249 8.8204L21.5086 3.93766L26.3913 3.92236ZM15.3213 20.0751C18.115 20.0751 20.3927 17.8015 20.3927 15.0057C20.3927 13.902 20.0316 12.8831 19.4339 12.0507C18.5128 10.7737 17.0155 9.93628 15.3243 9.93628C13.6321 9.93628 12.1358 10.7727 11.2127 12.0497C10.6129 12.882 10.2549 13.901 10.2539 15.0047C10.2508 17.8005 12.5265 20.0751 15.3213 20.0751ZM23.1997 15.0057C23.1997 19.3479 19.6665 22.8832 15.3223 22.8832C10.9781 22.8832 7.44583 19.3479 7.44583 15.0057C7.44583 13.9612 7.65391 12.9627 8.02519 12.0508H3.72589V23.842C3.72589 25.3659 4.96315 26.6001 6.48601 26.6001H24.1555C25.6763 26.6001 26.9156 25.3659 26.9156 23.842V12.0508H22.6143C22.9886 12.9627 23.1997 13.9612 23.1997 15.0057Z" fill="#7EB621"/>
</svg>
