<svg width="33" height="23" viewBox="0 0 33 23" fill="none" xmlns="http://www.w3.org/2000/svg">
<path d="M0 9.84912L2.82843 7.02069L15.6777 19.8699L12.8492 22.6984L0 9.84912Z" fill="#7EB621"/>
<path d="M29.8701 0.0206886L32.6985 2.84911L12.8492 22.6984L10.0208 19.8699L29.8701 0.0206886Z" fill="#7EB621"/>
</svg>
