<svg width="52" height="20" viewBox="0 0 52 20" fill="none" xmlns="http://www.w3.org/2000/svg">
<path d="M10.962 16H9.072V9.952L6.48 16H5.724L3.114 9.952V16H1.224V7.306H3.69L6.102 12.922L8.478 7.306H10.962V16ZM12.5056 16.216V14.668C12.8776 14.668 13.1716 14.428 13.3876 13.948C13.6156 13.468 13.8016 12.664 13.9456 11.536L14.4676 7.306H21.1816V16H19.2916V8.962H16.1416L15.8356 11.752C15.6676 13.312 15.3136 14.446 14.7736 15.154C14.2336 15.862 13.4776 16.216 12.5056 16.216ZM25.5261 16H23.6361V7.306H25.5261V10.726H29.5221V7.306H31.4121V16H29.5221V12.382H25.5261V16ZM35.7206 15.838C35.4686 16.078 35.1746 16.198 34.8386 16.198C34.5026 16.198 34.2086 16.078 33.9566 15.838C33.7046 15.586 33.5786 15.286 33.5786 14.938C33.5786 14.59 33.7046 14.296 33.9566 14.056C34.2086 13.804 34.5026 13.678 34.8386 13.678C35.1746 13.678 35.4686 13.804 35.7206 14.056C35.9726 14.296 36.0986 14.59 36.0986 14.938C36.0986 15.286 35.9726 15.586 35.7206 15.838Z" fill="#777777"/>
<path d="M41 2H52V4H41V2Z" fill="#777777"/>
<path d="M41 6H52V8H41V6Z" fill="#777777"/>
<path d="M47.5 7L47.5 17H45.5L45.5 7H47.5Z" fill="#777777"/>
</svg>
