<svg width="127" height="90" viewBox="0 0 127 90" fill="none" xmlns="http://www.w3.org/2000/svg">
<path d="M15.83 75.2242H6.14697C4.46894 75.2242 3.16347 74.8168 2.23157 74.0005C1.20577 73.1388 0.693359 71.8919 0.693359 70.2603V57.0814C0.693359 55.473 1.14771 54.209 2.0569 53.2887C2.96558 52.3684 4.2241 51.908 5.83247 51.908H15.83V55.263H7.02083C5.06363 55.263 4.08426 56.1419 4.08426 57.8987V61.906H15.83V65.2615H4.08426V69.1982C4.08426 70.9782 5.07473 71.8692 7.05566 71.8692H15.83V75.2242Z" fill="#004C40"/>
<path d="M33.5085 75.2243H29.9081L25.6428 69.1063L21.3781 75.2243H17.8125L24.0001 66.2051L18.1972 57.7109H21.7279L25.608 63.3387L29.5577 57.7109H33.089L27.3562 66.2051L33.5085 75.2243Z" fill="#004C40"/>
<path d="M46.5232 75.2243H39.706C36.4428 75.2243 34.8118 73.675 34.8118 70.5749V62.115C34.8118 59.179 36.1869 57.7104 38.9372 57.7104H46.453V60.6465H40.1705C39.2815 60.6465 38.6605 60.8101 38.3102 61.1372C37.9588 61.4643 37.7837 62.0605 37.7837 62.9258V69.8691C37.7837 71.4351 38.6257 72.2176 40.3108 72.2176H46.5232V75.2243Z" fill="#004C40"/>
<path d="M51.9904 51.5227H49.0186V75.2242H51.9904V51.5227Z" fill="#004C40"/>
<path d="M69.5487 70.819C69.5487 73.7555 67.9757 75.2246 64.8291 75.2246H59.69C56.544 75.2246 54.9714 73.756 54.9714 70.819V57.7097H57.9423V69.9456C57.9423 70.6675 58.1655 71.2506 58.6127 71.6928C58.9646 72.0422 59.6456 72.2178 60.6562 72.2178H63.8982C65.6843 72.2178 66.5773 71.4717 66.5773 69.98V57.7092H69.5487V70.819Z" fill="#004C40"/>
<path d="M85.4057 60.6468H77.4966C76.7772 60.6468 76.2431 60.7639 75.8943 60.9986C75.4066 61.3288 75.1628 61.7751 75.1628 62.3389V63.0432C75.1628 64.2659 75.9675 64.8772 77.5743 64.8772H81.4903C82.6322 64.8772 83.5701 65.2614 84.3041 66.0302C85.0387 66.7996 85.4057 67.7552 85.4057 68.8971V71.0991C85.4057 72.1951 85.0341 73.1735 84.2895 74.0352C83.8483 74.5486 83.3833 74.8863 82.8947 75.0489C82.4994 75.166 81.9188 75.2241 81.1525 75.2241H72.1914V72.2178H80.3433C81.1788 72.2178 81.7366 71.9851 82.0158 71.5187C82.2243 71.1925 82.3293 70.5862 82.3293 69.7013C82.3293 68.4892 81.6765 67.8824 80.3716 67.8824H76.6662C75.4071 67.8824 74.3702 67.5447 73.5544 66.8682C72.6458 66.1463 72.1914 65.1796 72.1914 63.967V61.6246C72.1914 60.3202 72.7139 59.259 73.7594 58.4437C74.3874 57.9536 75.3637 57.7097 76.6889 57.7097H85.4057V60.6468Z" fill="#004C40"/>
<path d="M91.0684 75.2242H88.0965V57.7103H91.0684V75.2242ZM91.5232 53.0609C91.5232 53.5975 91.3254 54.063 90.9291 54.4598C90.5323 54.856 90.0663 55.0534 89.5307 55.0534C88.9941 55.0534 88.5337 54.8611 88.1495 54.4764C87.7654 54.0917 87.573 53.6318 87.573 53.0957C87.573 52.5369 87.7588 52.0593 88.1319 51.6625C88.5039 51.2663 88.9704 51.0684 89.5307 51.0684C90.0901 51.0684 90.5611 51.2612 90.9462 51.6449C91.3304 52.0295 91.5232 52.5021 91.5232 53.0609Z" fill="#004C40"/>
<path d="M110.568 57.7104L103.821 74.0016C103.425 74.9572 102.749 75.4343 101.794 75.4343C100.837 75.4343 100.162 74.9572 99.7659 74.0016L92.9836 57.7104H96.0949L101.758 71.379L107.491 57.7104H110.568Z" fill="#004C40"/>
<path d="M123.408 62.8975V62.6163C123.408 61.3033 122.619 60.647 121.041 60.647H117.733C115.9 60.647 114.983 61.3967 114.983 62.8975V66.3798L123.408 62.8975ZM126.484 64.5967L114.983 69.2815V69.806C114.983 70.7379 115.24 71.4017 115.754 71.798C116.105 72.0777 116.712 72.218 117.577 72.218H126.484V75.2238H117.022C115.387 75.2238 114.184 74.8977 113.413 74.2454C112.433 73.4301 111.942 72.1711 111.942 70.4699V62.1852C111.942 59.2022 113.538 57.7104 116.731 57.7104H122.01C124.993 57.7104 126.484 59.2724 126.484 62.3947V64.5967Z" fill="#004C40"/>
<path d="M27.3157 84.9106C27.3157 83.5577 27.773 82.4224 28.6863 81.5046C29.6 80.5874 30.7555 80.127 32.1519 80.127C33.5578 80.127 34.7154 80.5838 35.6246 81.4975C36.5337 82.4118 36.9881 83.5486 36.9881 84.9106C36.9881 86.0001 36.6458 86.9885 35.9603 87.876L37.0148 88.8246L36.04 89.9059L35.0117 88.8776C34.1949 89.4929 33.2418 89.8009 32.1519 89.8009C30.7555 89.8009 29.6 89.3299 28.6863 88.3899C27.773 87.4504 27.3157 86.2903 27.3157 84.9106ZM29.0684 84.9106C29.0684 85.8597 29.3627 86.6523 29.9513 87.2894C30.54 87.927 31.2735 88.245 32.1519 88.245C32.7844 88.245 33.3291 88.0784 33.7865 87.7447L32.745 86.7689L33.7072 85.7017L34.7219 86.7169C35.0647 86.1808 35.2358 85.579 35.2358 84.9112C35.2358 83.9888 34.9415 83.22 34.3529 82.6056C33.7643 81.9903 33.0308 81.6828 32.1519 81.6828C31.2735 81.6828 30.54 81.9903 29.9513 82.6056C29.3627 83.22 29.0684 83.9883 29.0684 84.9106Z" fill="#7EB621"/>
<path d="M41.2322 86.2814V80.2856H42.9319V86.2693C42.9319 86.8923 43.1187 87.3779 43.4923 87.7247C43.8658 88.072 44.3686 88.2452 45.0012 88.2452C45.6337 88.2452 46.1365 88.072 46.5101 87.7247C46.8832 87.3779 47.07 86.8928 47.07 86.2693V80.2856H48.7702V86.2814C48.7702 87.3269 48.4249 88.175 47.7358 88.8247C47.0457 89.4749 46.1391 89.8005 45.0143 89.8005C43.881 89.8005 42.9673 89.4749 42.2736 88.8247C41.579 88.175 41.2322 87.3274 41.2322 86.2814Z" fill="#7EB621"/>
<path d="M53.5671 89.6425V80.2861H56.6506C57.4417 80.2861 58.0298 80.3699 58.4165 80.5365C58.9087 80.7385 59.2949 81.059 59.5761 81.4982C59.8572 81.9374 59.9976 82.469 59.9976 83.0929C59.9976 83.6639 59.8572 84.1844 59.5761 84.6544C59.2949 85.1254 58.9127 85.4565 58.4296 85.6494V85.6761C58.5089 85.7726 58.6098 85.9356 58.7325 86.1638L60.6569 89.643H58.7461L56.901 86.1507H55.2669V89.643H53.5671V89.6425ZM55.2669 84.674H56.7955C57.2524 84.674 57.6123 84.5403 57.8763 84.2722C58.1393 84.0047 58.2716 83.6422 58.2716 83.1853C58.2716 82.5351 58.0258 82.109 57.5335 81.9076C57.2968 81.8021 56.954 81.7491 56.5057 81.7491H55.2669V84.674Z" fill="#7EB621"/>
<path d="M66.3492 89.6425V85.7286L63.2258 80.2861H65.1497L66.6122 83.0404L67.1791 84.2919H67.2053C67.3901 83.8436 67.5784 83.4266 67.7723 83.0404L69.2216 80.2861H71.146L68.0358 85.7286V89.6425H66.3492Z" fill="#7EB621"/>
<path d="M74.9539 89.6425V80.2856H76.6541V88.1801H80.6992V89.6425H74.9539Z" fill="#7EB621"/>
<path d="M85.6021 89.6425V85.7286L82.4788 80.2861H84.4026L85.8646 83.0404L86.432 84.2919H86.4583C86.6425 83.8436 86.8313 83.4266 87.0252 83.0404L88.4745 80.2861H90.3989L87.2887 85.7286V89.6425H85.6021Z" fill="#7EB621"/>
<path d="M93.2981 88.5224L94.2204 87.2442C94.5273 87.5163 94.8898 87.7495 95.3073 87.9428C95.7243 88.1362 96.1352 88.2326 96.5391 88.2326C96.9611 88.2326 97.2948 88.1337 97.5406 87.9358C97.7865 87.7379 97.9091 87.4814 97.9091 87.1654C97.9091 86.8398 97.7597 86.5591 97.4609 86.3224C97.162 86.0841 96.799 85.8781 96.374 85.7019C95.9479 85.5263 95.5198 85.3339 95.0892 85.1224C94.6586 84.9114 94.2941 84.613 93.9952 84.2263C93.6964 83.8401 93.547 83.3792 93.547 82.8431C93.547 82.0344 93.8483 81.3811 94.4501 80.8794C95.0513 80.3786 95.8136 80.1282 96.7359 80.1282C97.8344 80.1282 98.7477 80.4624 99.4771 81.1297L98.7265 82.513C98.4629 82.2757 98.1444 82.0808 97.7708 81.9274C97.3973 81.7729 97.0308 81.6967 96.6703 81.6967C96.2392 81.6967 95.8949 81.7926 95.6354 81.9859C95.376 82.1798 95.2467 82.4382 95.2467 82.7634C95.2467 83.0799 95.3961 83.352 95.695 83.5807C95.9933 83.8088 96.3558 84.0067 96.7819 84.1738C97.208 84.3404 97.636 84.5272 98.0666 84.7337C98.4973 84.9397 98.8617 85.2365 99.1606 85.6232C99.4589 86.0099 99.6089 86.4794 99.6089 87.0332C99.6089 87.8237 99.3317 88.4825 98.7784 89.01C98.2246 89.5371 97.4644 89.8006 96.4982 89.8006C95.9005 89.8006 95.3209 89.69 94.7586 89.4709C94.1982 89.2513 93.711 88.9348 93.2981 88.5224Z" fill="#7EB621"/>
<path d="M42.0364 0V6.77876L54.7322 3.7362L56.4879 11.0632L42.0364 14.5268V18.2463L54.9866 15.1422L56.7424 22.4702L42.0364 25.9944V29.7129L61.2489 25.1089L62.9931 32.3844L85.1412 23.866V0H42.0364Z" fill="#004C40"/>
<path d="M85.1412 23.866L62.98 32.3894L42.0364 37.3821V43.1048H85.1412V23.866Z" fill="#7EB621"/>
</svg>
