<svg width="15" height="27" viewBox="0 0 15 27" xmlns="http://www.w3.org/2000/svg">
  <path d="M13.4393 0L0.00427341 13.435L1.41849 14.8492L14.8535 1.41421L13.4393 0Z"/>
  <path d="M13.435 26.8746L-2.95639e-05 13.4395L1.41418 12.0253L14.8492 25.4604L13.435 26.8746Z"/>
</svg>
