<svg width="51" height="51" viewBox="0 0 51 51" fill="none" xmlns="http://www.w3.org/2000/svg">
<path d="M25.4349 0C11.3881 0 0 11.3876 0 25.4349C0 39.4823 11.3881 50.8699 25.4349 50.8699C39.4818 50.8699 50.8699 39.4823 50.8699 25.4349C50.8699 11.3876 39.4818 0 25.4349 0Z" fill="#7EB621"/>
<path d="M36.9871 19.0108C35.4257 19.0108 33.9851 18.4806 32.8282 17.5862C31.5014 16.5609 30.5481 15.0568 30.2115 13.3233C30.1281 12.895 30.0832 12.453 30.079 12H25.6187V24.4924L25.6133 31.3351C25.6133 33.1645 24.4511 34.7156 22.84 35.2611C22.3725 35.4194 21.8675 35.4945 21.3417 35.4649C20.6705 35.4271 20.0416 35.2195 19.495 34.8843C18.3317 34.1712 17.543 32.8774 17.5216 31.3975C17.4879 29.0845 19.3122 27.1987 21.5672 27.1987C22.0123 27.1987 22.4398 27.2732 22.84 27.4085V23.994V22.7665C22.4179 22.7025 21.9883 22.669 21.5538 22.669C19.0856 22.669 16.7772 23.7207 15.1271 25.6152C13.8799 27.047 13.1318 28.8736 13.0164 30.789C12.8652 33.3052 13.7635 35.6971 15.5055 37.4619C15.7614 37.7209 16.0302 37.9614 16.3113 38.1832C17.8048 39.3614 19.6307 40 21.5538 40C21.9883 40 22.4179 39.9671 22.84 39.9031C24.6365 39.6303 26.2941 38.7873 27.6022 37.4619C29.2096 35.8335 30.0977 33.6716 30.1073 31.3707L30.0843 21.1524C30.8511 21.7587 31.6895 22.2604 32.5894 22.6499C33.9888 23.2551 35.4727 23.5618 36.9999 23.5613V20.2415V19.0097C37.001 19.0108 36.9882 19.0108 36.9871 19.0108Z" fill="#F8F8F8"/>
</svg>
