<svg width="132" height="99" viewBox="0 0 132 99" fill="none" xmlns="http://www.w3.org/2000/svg">
<path d="M16.4333 79.0582H6.32075C4.56806 79.0582 3.20466 78.6331 2.23114 77.78C1.15986 76.881 0.624512 75.579 0.624512 73.8746V60.1101C0.624512 58.4307 1.09965 57.1102 2.04932 56.1492C2.9972 55.1876 4.31231 54.7071 5.99227 54.7071H16.4333V58.2113H7.23286C5.18866 58.2113 4.16625 59.1294 4.16625 60.9637V65.1487H16.4333V68.6535H4.16625V72.7646C4.16625 74.624 5.20058 75.554 7.26983 75.554H16.4333V79.0582Z" fill="white"/>
<path d="M34.8961 79.0582H31.1362L26.6818 72.6686L22.2273 79.0582H18.5031L24.966 69.6383L18.9055 60.767H22.5933L26.6454 66.6457L30.7708 60.767H34.458L28.4708 69.6383L34.8961 79.0582Z" fill="white"/>
<path d="M48.489 79.0581H41.3692C37.9616 79.0581 36.2583 77.4408 36.2583 74.2019V65.3669C36.2583 62.3003 37.6945 60.7664 40.5661 60.7664H48.4157V63.8336H41.8544C40.9256 63.8336 40.2776 64.0047 39.9116 64.3463C39.5443 64.6879 39.3619 65.3103 39.3619 66.214V73.4656C39.3619 75.1009 40.2412 75.9182 42.0011 75.9182H48.489V79.0581Z" fill="white"/>
<path d="M54.1984 54.3047H51.0948V79.0581H54.1984V54.3047Z" fill="white"/>
<path d="M72.5366 74.4576C72.5366 77.5254 70.8936 79.0588 67.6076 79.0588H62.2405C58.9545 79.0588 57.3121 77.5254 57.3121 74.4576V60.767H60.415V73.5455C60.415 74.3003 60.6481 74.9095 61.1149 75.371C61.4828 75.7364 62.194 75.9194 63.2492 75.9194H66.6353C68.5007 75.9194 69.433 75.1402 69.433 73.5825V60.767H72.5366V74.4576Z" fill="white"/>
<path d="M89.0972 63.8342H80.8375C80.0857 63.8342 79.5283 63.957 79.1641 64.202C78.6543 64.546 78.3998 65.0128 78.3998 65.6012V66.3375C78.3998 67.6144 79.2398 68.2523 80.9185 68.2523H85.0075C86.1999 68.2523 87.1805 68.6535 87.9472 69.4565C88.7138 70.2601 89.0972 71.2581 89.0972 72.4504V74.7504C89.0972 75.8944 88.7097 76.9168 87.9317 77.817C87.4708 78.3523 86.9856 78.7058 86.4753 78.8751C86.0627 78.9979 85.4564 79.0582 84.6552 79.0582H75.2968V75.9182H83.8105C84.6844 75.9182 85.2657 75.675 85.5578 75.1873C85.7748 74.8475 85.8851 74.215 85.8851 73.2892C85.8851 72.0236 85.2031 71.391 83.8403 71.391H79.97C78.6555 71.391 77.5723 71.0381 76.7198 70.3317C75.7713 69.5775 75.2968 68.5677 75.2968 67.3014V64.8548C75.2968 63.4926 75.8429 62.385 76.9344 61.5331C77.5908 61.0216 78.6096 60.7658 79.9933 60.7658H89.0972V63.8342Z" fill="white"/>
<path d="M95.011 79.0581H91.9074V60.7664H95.011V79.0581ZM95.4861 55.9113C95.4861 56.4717 95.2786 56.9582 94.8655 57.3719C94.4512 57.7862 93.9647 57.9925 93.4049 57.9925C92.8446 57.9925 92.3641 57.7916 91.9628 57.3898C91.561 56.9886 91.3607 56.5081 91.3607 55.9483C91.3607 55.3646 91.5551 54.8651 91.945 54.4513C92.3331 54.0376 92.8207 53.8307 93.4043 53.8307C93.9892 53.8307 94.481 54.0316 94.8828 54.4329C95.2852 54.8335 95.4861 55.3277 95.4861 55.9113Z" fill="white"/>
<path d="M115.377 60.767L108.33 77.7812C107.916 78.7792 107.211 79.2775 106.212 79.2775C105.214 79.2775 104.509 78.7792 104.095 77.7812L97.0117 60.767H100.261L106.176 75.0425L112.163 60.767H115.377Z" fill="white"/>
<path d="M128.785 66.1842V65.8903C128.785 64.5192 127.962 63.8336 126.314 63.8336H122.859C120.945 63.8336 119.987 64.6169 119.987 66.1842V69.8214L128.785 66.1842ZM131.999 67.9596L119.987 72.8528V73.4001C119.987 74.3742 120.256 75.0675 120.793 75.4806C121.159 75.7727 121.794 75.9194 122.697 75.9194H131.999V79.0587H122.117C120.409 79.0587 119.152 78.7189 118.348 78.0369C117.323 77.185 116.811 75.8705 116.811 74.094V65.4402C116.811 62.3253 118.478 60.7676 121.813 60.7676H127.326C130.442 60.7676 132 62.3981 132 65.6596V67.9596H131.999Z" fill="white"/>
<path d="M43.8027 0.495361V7.57527L57.0617 4.39718L58.8961 12.0494L43.8027 15.6674V19.5514L57.3276 16.3095L59.1613 23.9623L43.8027 27.6436V31.5275L63.868 26.7183L65.6892 34.3175L88.8211 25.4211V0.495361H43.8027Z" fill="white"/>
<path d="M88.8211 25.4211L65.6761 34.3228L43.8027 39.5362V45.5138H88.8211V25.4211Z" fill="white"/>
<path d="M41.2505 85.1425H43.0521V96.4157H48.8139V97.9806H41.2505V85.1425Z" fill="white" stroke="white"/>
<path d="M41.2505 85.1425H43.0521V96.4157H48.8139V97.9806H41.2505V85.1425Z" fill="white" stroke="white" stroke-miterlimit="22.926"/>
<path d="M59.8779 85.1431H58.0775V97.9806H59.8779V85.1431Z" fill="white" stroke="white"/>
<path d="M59.8779 85.1431H58.0775V97.9806H59.8779V85.1431Z" fill="white" stroke="white" stroke-miterlimit="22.926"/>
<path d="M70.5449 85.1425H77.6176V86.7074H72.3447V90.943H76.8361V92.5068H72.3447V97.9806H70.5449V85.1425Z" fill="white" stroke="white"/>
<path d="M70.5449 85.1425H77.6176V86.7074H72.3447V90.943H76.8361V92.5068H72.3447V97.9806H70.5449V85.1425Z" fill="white" stroke="white" stroke-miterlimit="22.926"/>
<path d="M87.1555 85.1425H94.6288V86.7074H88.9553V90.7261H93.5546V92.2892H88.9553V96.4157H94.9359V97.9806H87.1555V85.1425Z" fill="white" stroke="white"/>
<path d="M87.1555 85.1425H94.6288V86.7074H88.9553V90.7261H93.5546V92.2892H88.9553V96.4157H94.9359V97.9806H87.1555V85.1425Z" fill="white" stroke="white" stroke-miterlimit="22.926"/>
</svg>
