<svg width="148" height="83" viewBox="0 0 148 83" fill="none" xmlns="http://www.w3.org/2000/svg">
<path d="M135.316 66.409H138.369L143.06 59.6457C143.382 59.1485 143.854 58.4776 144.003 58.1295H144.052C144.027 58.4529 143.977 59.1737 143.977 59.6457V66.409H146.98V53.7282H143.928L139.238 60.5162C138.915 61.014 138.444 61.7095 138.295 62.0324H138.246C138.269 61.8334 138.32 61.0873 138.32 60.5162V53.7282H135.316V66.409ZM125.861 66.409H128.988V56.4137H133.183V53.7282H121.692V56.4137H125.861V66.409ZM107.868 66.409H110.922L115.611 59.6457C115.934 59.1485 116.405 58.4776 116.555 58.1295H116.604C116.579 58.4529 116.529 59.1737 116.529 59.6457V66.409H119.533V53.7282H116.48L111.789 60.5162C111.467 61.014 110.995 61.7095 110.847 62.0324H110.797C110.822 61.8334 110.872 61.0873 110.872 60.5162V53.7282H107.868V66.409ZM89.6518 57.5078C89.6518 62.7039 93.2259 66.7072 98.7599 66.7072C101.911 66.7072 104.171 65.3894 105.684 63.848L103.997 61.5358C102.657 62.853 100.77 63.7734 98.8835 63.7734C95.0616 63.7734 92.9523 60.7651 92.9523 57.4579C92.9523 54.2007 94.9872 51.3914 98.8583 51.3914C100.571 51.3914 102.432 52.1867 103.673 53.2562L105.211 50.8689C103.499 49.2036 101.018 48.4576 98.7095 48.4576C93.4 48.4576 89.6518 52.3857 89.6518 57.5078ZM70.1703 68.4483L69.1285 70.8097C69.1285 70.8097 70.2441 71.6303 71.7587 71.6303C73.6201 71.6303 75.4564 70.636 76.3253 68.3238L81.9588 53.7282H78.5342L76.0523 61.0879C75.8542 61.7594 75.6304 62.7538 75.6304 62.7538H75.5812C75.5812 62.7538 75.3574 61.7095 75.1095 61.0386L72.4542 53.7282H68.9047L74.2412 66.21L73.769 67.3288C73.2979 68.4483 72.4296 68.9695 71.5607 68.9695C70.8652 68.9701 70.1703 68.4483 70.1703 68.4483ZM59.5975 62.63C59.5975 60.8396 62.278 60.616 63.8664 60.616H64.4119V60.9641C64.4119 62.5049 63.2706 64.2952 61.5087 64.2952C60.2432 64.2952 59.5975 63.4752 59.5975 62.63ZM56.4705 62.9029C56.4705 65.2157 58.3565 66.7072 60.6398 66.7072C62.3524 66.7072 63.8664 65.7621 64.6357 64.4197H64.6855C64.6855 64.4197 64.6111 64.8177 64.6111 65.3401V66.409H67.5401V58.4776C67.5401 55.2702 65.5791 53.43 62.278 53.43C60.3914 53.43 58.3565 54.1508 57.3148 54.9967L58.4807 57.2595C59.4985 56.5628 60.7646 56.0409 62.005 56.0409C63.3204 56.0409 64.3873 56.6127 64.3873 58.2786V58.4529H63.8412C61.0371 58.4529 56.4705 59.0992 56.4705 62.9029ZM48.1318 66.409H51.2588V56.4137H55.4533V53.7282H43.9624V56.4137H48.1318V66.409ZM34.1595 62.63C34.1595 60.8396 36.8395 60.616 38.4279 60.616H38.9739V60.9641C38.9739 62.5049 37.8326 64.2952 36.0708 64.2952C34.8046 64.2952 34.1595 63.4752 34.1595 62.63ZM31.0325 62.9029C31.0325 65.2157 32.9185 66.7072 35.2018 66.7072C36.9139 66.7072 38.4279 65.7621 39.1978 64.4197H39.247C39.247 64.4197 39.1726 64.8177 39.1726 65.3401V66.409H42.101V58.4776C42.101 55.2702 40.1405 53.43 36.8395 53.43C34.9534 53.43 32.9185 54.1508 31.8762 54.9967L33.0428 57.2595C34.0599 56.5628 35.3255 56.0409 36.5664 56.0409C37.8818 56.0409 38.9493 56.6127 38.9493 58.2786V58.4529H38.4033C35.5991 58.4529 31.0325 59.0992 31.0325 62.9029ZM16.7368 66.5335C20.932 66.409 22.3962 63.2263 22.3962 57.7068V56.2892H25.4734V66.409H28.625V53.7282H19.3928V57.7068C19.3928 62.2067 18.3006 63.5251 16.7368 63.7488V66.5335ZM5.86697 59.2729L7.45538 54.5488C7.75302 53.5544 8.15027 51.814 8.15027 51.814H8.20008C8.20008 51.814 8.59733 53.555 8.89497 54.5488L10.4588 59.2729H5.86697ZM0.307831 66.409H3.58366L5.07306 61.8839H11.2527L12.7667 66.409H16.0425L9.8629 48.7557H6.48745L0.307831 66.409Z" fill="white"/>
<path d="M147.204 79.2907L148 79.4025C147.912 79.9502 147.69 80.3794 147.33 80.6896C146.971 81.0004 146.529 81.1549 146.005 81.1549C145.349 81.1549 144.822 80.9403 144.424 80.5111C144.024 80.0812 143.826 79.4656 143.826 78.6654C143.826 78.146 143.912 77.6939 144.083 77.3037C144.255 76.916 144.515 76.6238 144.868 76.4308C145.217 76.236 145.599 76.1386 146.013 76.1386C146.532 76.1386 146.959 76.2697 147.289 76.5342C147.621 76.7981 147.834 77.1739 147.926 77.659L147.14 77.7799C147.064 77.457 146.931 77.2142 146.738 77.05C146.547 76.8877 146.316 76.806 146.045 76.806C145.634 76.806 145.301 76.9526 145.043 77.246C144.787 77.5418 144.659 78.0053 144.659 78.6414C144.659 79.2871 144.782 79.756 145.029 80.0488C145.277 80.3397 145.6 80.487 145.996 80.487C146.317 80.487 146.584 80.3896 146.797 80.193C147.01 79.9977 147.147 79.6971 147.204 79.2907ZM139.905 76.2402H140.719V78.3167C140.977 78.3167 141.16 78.2668 141.265 78.1664C141.369 78.0684 141.521 77.7787 141.724 77.2983C141.886 76.9178 142.014 76.6677 142.113 76.5474C142.213 76.4272 142.327 76.3448 142.457 76.3034C142.588 76.2613 142.796 76.2408 143.082 76.2408H143.245V76.9124L143.018 76.9076C142.804 76.9076 142.666 76.9406 142.605 77.0037C142.543 77.0693 142.445 77.2677 142.316 77.5965C142.193 77.9115 142.08 78.1304 141.977 78.2506C141.875 78.3702 141.716 78.4809 141.502 78.5813C141.852 78.6757 142.197 79.0015 142.538 79.5612L143.43 81.0521H142.536L141.654 79.5648C141.478 79.2636 141.324 79.0658 141.192 78.9702C141.058 78.874 140.901 78.8271 140.719 78.8271V81.0521H139.904V76.2402H139.905ZM135.377 78.1869H138.052C138.016 77.7823 137.913 77.4793 137.745 77.2767C137.487 76.9635 137.151 76.8053 136.738 76.8053C136.365 76.8053 136.052 76.9304 135.798 77.1811C135.545 77.4312 135.404 77.7667 135.377 78.1869ZM138.043 79.4945L138.884 79.6063C138.753 80.0969 138.507 80.4774 138.15 80.7485C137.791 81.0185 137.335 81.1549 136.779 81.1549C136.078 81.1549 135.523 80.9391 135.112 80.5063C134.702 80.0746 134.497 79.4668 134.497 78.6871C134.497 77.8803 134.704 77.2526 135.119 76.8078C135.534 76.3611 136.073 76.1386 136.734 76.1386C137.374 76.1386 137.897 76.3563 138.302 76.7933C138.709 77.2316 138.912 77.8466 138.912 78.639C138.912 78.6871 138.911 78.7598 138.907 78.8554H135.331C135.361 79.3826 135.509 79.7872 135.777 80.0674C136.043 80.347 136.379 80.4876 136.779 80.4876C137.076 80.4876 137.331 80.4089 137.541 80.2508C137.752 80.0926 137.919 79.8408 138.043 79.4945ZM129.763 76.2402H133.548V81.0473H132.735V76.9166H130.578V79.3099C130.578 79.8678 130.559 80.2357 130.523 80.4149C130.486 80.5928 130.388 80.7479 130.226 80.8802C130.062 81.0131 129.828 81.0798 129.522 81.0798C129.332 81.0798 129.113 81.0672 128.865 81.0437V80.365H129.222C129.389 80.365 129.51 80.3482 129.583 80.3127C129.656 80.2784 129.703 80.2237 129.728 80.1474C129.75 80.0722 129.764 79.8263 129.764 79.4097V76.2402H129.763ZM124.353 76.2402H128.148V81.0521H127.334V76.9166H125.168V81.0521H124.354V76.2402H124.353ZM118.018 76.2402H119.27L120.539 80.0902L121.945 76.2402H123.108V81.0521H122.294V77.1781L120.881 81.0521H120.151L118.814 76.9917V81.0521H118.018V76.2402ZM113.369 78.6474C113.369 79.2624 113.504 79.7229 113.772 80.0277C114.043 80.3337 114.381 80.487 114.789 80.487C115.194 80.487 115.53 80.3337 115.799 80.0259C116.067 79.7181 116.202 79.2498 116.202 78.6215C116.202 78.0282 116.066 77.5785 115.796 77.2737C115.527 76.9671 115.19 76.8144 114.789 76.8144C114.38 76.8144 114.043 76.9659 113.772 77.2701C113.503 77.5755 113.369 78.0342 113.369 78.6474ZM112.536 78.6462C112.536 77.757 112.783 77.0987 113.278 76.6713C113.69 76.3154 114.195 76.1374 114.789 76.1374C115.447 76.1374 115.987 76.3539 116.408 76.7867C116.825 77.2184 117.035 77.8159 117.035 78.5776C117.035 79.1963 116.942 79.6814 116.758 80.0349C116.571 80.389 116.302 80.6638 115.946 80.8604C115.594 81.0564 115.207 81.1537 114.788 81.1537C114.116 81.1537 113.573 80.9391 113.158 80.5081C112.744 80.0764 112.536 79.456 112.536 78.6462ZM108.68 76.2402H109.494V78.3167C109.754 78.3167 109.935 78.2668 110.041 78.1664C110.143 78.0684 110.297 77.7787 110.5 77.2983C110.66 76.9178 110.79 76.6677 110.888 76.5474C110.989 76.4272 111.102 76.3448 111.231 76.3034C111.363 76.2613 111.572 76.2408 111.856 76.2408H112.02V76.9124L111.794 76.9076C111.579 76.9076 111.442 76.9406 111.382 77.0037C111.319 77.0693 111.221 77.2677 111.092 77.5965C110.968 77.9115 110.856 78.1304 110.753 78.2506C110.65 78.3702 110.492 78.4809 110.277 78.5813C110.628 78.6757 110.972 79.0015 111.313 79.5612L112.206 81.0521H111.311L110.431 79.5648C110.253 79.2636 110.098 79.0658 109.968 78.9702C109.834 78.874 109.679 78.8271 109.494 78.8271V81.0521H108.68V76.2402ZM103.76 74.4595H104.317C104.272 74.8413 104.132 75.1346 103.901 75.3391C103.669 75.5447 103.363 75.6469 102.979 75.6469C102.594 75.6469 102.285 75.5447 102.054 75.3427C101.824 75.1383 101.686 74.8449 101.642 74.4595H102.197C102.238 74.6687 102.323 74.8244 102.448 74.926C102.573 75.0294 102.743 75.0805 102.954 75.0805C103.199 75.0805 103.385 75.0312 103.509 74.9308C103.634 74.8316 103.719 74.6741 103.76 74.4595ZM100.947 76.2402H101.762V79.9099L104.024 76.2402H104.9V81.0521H104.086V77.4053L101.824 81.0521H100.947V76.2402ZM96.326 78.6474C96.326 79.2624 96.461 79.7229 96.7292 80.0277C96.9986 80.3337 97.3371 80.487 97.7451 80.487C98.1496 80.487 98.4856 80.3337 98.7557 80.0259C99.0245 79.7181 99.1589 79.2498 99.1589 78.6215C99.1589 78.0282 99.0227 77.5785 98.7533 77.2737C98.4826 76.9671 98.1466 76.8144 97.7451 76.8144C97.3365 76.8144 96.9986 76.9659 96.7292 77.2701C96.461 77.5755 96.326 78.0342 96.326 78.6474ZM95.4936 78.6462C95.4936 77.757 95.7409 77.0987 96.2359 76.6713C96.6476 76.3154 97.1523 76.1374 97.7457 76.1374C98.4046 76.1374 98.9447 76.3539 99.3642 76.7867C99.7824 77.2184 99.9924 77.8159 99.9924 78.5776C99.9924 79.1963 99.8994 79.6814 99.7146 80.0349C99.5292 80.389 99.2585 80.6638 98.9045 80.8604C98.5517 81.0564 98.164 81.1537 97.7451 81.1537C97.0731 81.1537 96.53 80.9391 96.1147 80.5081C95.7001 80.0764 95.4936 79.456 95.4936 78.6462ZM90.693 76.2402H94.4795V81.0473H93.6652V76.9166H91.5073V79.3099C91.5073 79.8678 91.4899 80.2357 91.4545 80.4149C91.4167 80.5928 91.3177 80.7479 91.1557 80.8802C90.9931 81.0131 90.7584 81.0798 90.4512 81.0798C90.2616 81.0798 90.0419 81.0672 89.7953 81.0437V80.365H90.1523C90.3198 80.365 90.4404 80.3482 90.5136 80.3127C90.5856 80.2784 90.633 80.2237 90.6576 80.1474C90.681 80.0722 90.6936 79.8263 90.6936 79.4097V76.2402H90.693ZM85.1237 76.2402H85.9386V79.9099L88.2015 76.2402H89.0758V81.0521H88.2621V77.4053L86.0016 81.0521H85.1237V76.2402ZM81.8388 76.2402V78.3167C82.1017 78.3167 82.2859 78.2668 82.3921 78.1694C82.4989 78.0708 82.6525 77.7817 82.8494 77.3001C83.0348 76.8426 83.2022 76.5522 83.3534 76.4254C83.5023 76.3016 83.7363 76.2402 84.0591 76.2402H84.3568V76.9118L84.1359 76.907C83.9181 76.907 83.7813 76.94 83.7207 77.0031C83.6577 77.0687 83.5605 77.2671 83.4314 77.5959C83.3114 77.9109 83.2004 78.128 83.0978 78.25C82.9964 78.3696 82.8356 78.4803 82.6195 78.5807C82.9712 78.675 83.3144 79.0009 83.6487 79.5606L84.5422 81.0515H83.6469L82.7774 79.5612C82.6003 79.2588 82.4437 79.0604 82.3135 78.9666C82.1797 78.8722 82.0237 78.8265 81.84 78.8265V81.0515H81.0065V78.8265C80.8259 78.8265 80.6699 78.8722 80.5397 78.9648C80.4064 79.058 80.2522 79.257 80.0764 79.563L79.1997 81.0515H78.3044L79.1943 79.5606C79.5321 79.0009 79.8784 78.675 80.23 78.5807C79.9894 78.4694 79.819 78.3474 79.723 78.2157C79.6264 78.0841 79.4823 77.7715 79.2897 77.2755C79.2237 77.1083 79.1523 77.0062 79.0773 76.9695C78.9975 76.9304 78.8816 76.9118 78.728 76.9118C78.6896 76.9118 78.6098 76.913 78.4892 76.9166V76.2402H78.602C78.9165 76.2402 79.1373 76.2577 79.2657 76.2973C79.3929 76.334 79.5063 76.414 79.6083 76.536C79.7092 76.6581 79.8406 76.9118 80.0008 77.3001C80.1964 77.7745 80.3476 78.0618 80.4533 78.164C80.5577 78.2662 80.7425 78.3173 81.0065 78.3173V76.2408H81.8388V76.2402ZM68.8963 76.2402H69.7106V81.0521H68.8963V76.2402ZM68.8963 74.4132H69.7106V75.3403H68.8963V74.4132ZM63.7488 81.0521V76.2402H64.4797V76.9232C64.8314 76.3989 65.3402 76.1374 66.0045 76.1374C66.295 76.1374 66.5608 76.1897 66.8026 76.2931C67.0445 76.3977 67.2269 76.5342 67.3475 76.7037C67.4675 76.8715 67.5527 77.0729 67.6008 77.3049C67.6302 77.4564 67.6446 77.7198 67.6446 78.0967V81.0521H66.8309V78.1286C66.8309 77.7961 66.8002 77.5472 66.7366 77.3831C66.6742 77.2202 66.5608 77.0885 66.4006 76.9899C66.2398 76.8925 66.0501 76.8432 65.8347 76.8432C65.4891 76.8432 65.1908 76.9526 64.9394 77.1739C64.688 77.3927 64.5632 77.8123 64.5632 78.4274V81.0527H63.7488V81.0521ZM59.2122 78.1869H61.8868C61.8508 77.7823 61.7482 77.4793 61.5796 77.2767C61.3221 76.9635 60.9861 76.8053 60.5738 76.8053C60.2006 76.8053 59.8873 76.9304 59.6329 77.1811C59.3797 77.4312 59.2398 77.7667 59.2122 78.1869ZM61.8772 79.4945L62.7197 79.6063C62.5883 80.0969 62.3435 80.4774 61.9852 80.7485C61.6276 81.0185 61.1709 81.1549 60.614 81.1549C59.9137 81.1549 59.3587 80.9391 58.9482 80.5063C58.5378 80.0746 58.3325 79.4668 58.3325 78.6871C58.3325 77.8803 58.539 77.2526 58.9542 76.8078C59.3695 76.3611 59.9077 76.1386 60.5696 76.1386C61.2093 76.1386 61.7326 76.3563 62.1382 76.7933C62.5439 77.2316 62.7479 77.8466 62.7479 78.639C62.7479 78.6871 62.7461 78.7598 62.7431 78.8554H59.1654C59.1966 79.3826 59.3449 79.7872 59.6131 80.0674C59.8801 80.347 60.2144 80.4876 60.614 80.4876C60.9117 80.4876 61.1661 80.4089 61.3761 80.2508C61.5874 80.0926 61.7542 79.8408 61.8772 79.4945ZM53.4533 81.0521V74.4132H54.2676V76.8023C54.6456 76.3587 55.1227 76.138 55.6994 76.138C56.0528 76.138 56.3595 76.2072 56.6217 76.3484C56.8827 76.4885 57.0688 76.6821 57.1816 76.9298C57.2944 77.1769 57.3502 77.537 57.3502 78.0071V81.0527H56.5359V78.0089C56.5359 77.6031 56.4477 77.3061 56.2731 77.121C56.0972 76.9346 55.85 76.8426 55.5296 76.8426C55.2901 76.8426 55.0651 76.9045 54.8539 77.0302C54.6426 77.1546 54.4926 77.3248 54.402 77.54C54.3126 77.7528 54.2676 78.048 54.2676 78.4256V81.0527H53.4533V81.0521ZM48.5014 79.6153L49.3067 79.4854C49.3511 79.8083 49.4778 80.056 49.6848 80.2285C49.8912 80.4005 50.1816 80.487 50.5513 80.487C50.9263 80.487 51.2042 80.4113 51.386 80.258C51.5666 80.1065 51.6578 79.9273 51.6578 79.7217C51.6578 79.5371 51.5756 79.3923 51.4136 79.2865C51.2996 79.2143 51.0224 79.1229 50.5813 79.0105C49.9854 78.8602 49.5738 78.7304 49.3421 78.6215C49.1123 78.5097 48.9377 78.3582 48.8195 78.1634C48.7007 77.9711 48.64 77.7558 48.64 77.5202C48.64 77.3061 48.6893 77.1077 48.7865 76.9262C48.8855 76.7428 49.0181 76.5925 49.1867 76.4717C49.3127 76.3791 49.4856 76.3004 49.7028 76.2348C49.9224 76.1705 50.1552 76.1374 50.4049 76.1374C50.7811 76.1374 51.1118 76.1921 51.3956 76.301C51.6806 76.4092 51.8907 76.5577 52.0263 76.7422C52.1607 76.9298 52.2543 77.1787 52.3053 77.4913L51.5096 77.6025C51.4742 77.3518 51.3692 77.1552 51.1964 77.0146C51.0236 76.8751 50.7799 76.8041 50.4637 76.8041C50.0916 76.8041 49.8246 76.8667 49.6662 76.9899C49.5072 77.1138 49.4267 77.2586 49.4267 77.4246C49.4267 77.5298 49.4598 77.6254 49.5258 77.7101C49.5924 77.7979 49.6956 77.8701 49.8372 77.9272C49.9194 77.9578 50.1564 78.0276 50.5543 78.1352C51.1286 78.2885 51.5294 78.4153 51.7581 78.5127C51.9861 78.6101 52.1649 78.7538 52.2945 78.939C52.4259 79.1271 52.4908 79.358 52.4908 79.6363C52.4908 79.9063 52.4121 80.1612 52.2531 80.4011C52.0941 80.6397 51.8661 80.8261 51.5678 80.9578C51.269 81.0888 50.9311 81.1537 50.5543 81.1537C49.9314 81.1537 49.4544 81.0245 49.1279 80.7654C48.8009 80.5069 48.5926 80.1233 48.5014 79.6153ZM44.2889 78.1869H46.9634C46.928 77.7823 46.8242 77.4793 46.6562 77.2767C46.3987 76.9635 46.0621 76.8053 45.6504 76.8053C45.2772 76.8053 44.964 76.9304 44.7095 77.1811C44.4569 77.4312 44.3165 77.7667 44.2889 78.1869ZM46.9538 79.4945L47.7963 79.6063C47.6649 80.0969 47.4201 80.4774 47.0618 80.7485C46.7042 81.0185 46.2481 81.1549 45.6907 81.1549C44.9904 81.1549 44.4353 80.9391 44.0242 80.5063C43.6144 80.0746 43.4091 79.4668 43.4091 78.6871C43.4091 77.8803 43.6156 77.2526 44.0308 76.8078C44.4461 76.3611 44.9844 76.1386 45.6462 76.1386C46.2865 76.1386 46.8092 76.3563 47.2149 76.7933C47.6205 77.2316 47.8239 77.8466 47.8239 78.639C47.8239 78.6871 47.8227 78.7598 47.8197 78.8554H44.2421C44.2733 79.3826 44.4215 79.7872 44.6897 80.0674C44.9568 80.347 45.291 80.4876 45.6907 80.4876C45.9883 80.4876 46.2427 80.4089 46.4528 80.2508C46.664 80.0926 46.8308 79.8408 46.9538 79.4945ZM39.0526 81.0521V74.4132H39.8675V78.1947L41.7925 76.2408H42.8445L41.0118 78.0288L43.0299 81.0527H42.0272L40.4322 78.5939L39.8675 79.144V81.0527H39.0526V81.0521ZM34.1937 76.2402H35.008V81.0521H34.1937V76.2402ZM30.1378 75.6463L30.7307 74.3759H31.8042L30.8141 75.6463H30.1378ZM31.8966 81.0521V80.3367C31.5234 80.8826 31.0175 81.1543 30.3772 81.1543C30.0946 81.1543 29.8312 81.1002 29.5857 80.9914C29.3409 80.882 29.1591 80.7461 29.0396 80.582C28.9208 80.4167 28.8374 80.2159 28.79 79.9778C28.7576 79.8167 28.7402 79.5636 28.7402 79.2167V76.2396H29.5551V78.9023C29.5551 79.3273 29.5719 79.6147 29.6043 79.7614C29.6553 79.976 29.7633 80.1431 29.9302 80.2652C30.0946 80.3872 30.2986 80.4497 30.5422 80.4497C30.7859 80.4497 31.0139 80.3872 31.2269 80.2622C31.44 80.1365 31.5912 79.9658 31.6806 79.7506C31.7688 79.5359 31.8132 79.2221 31.8132 78.8115V76.2396H32.6281V81.0515H31.8966V81.0521ZM21.04 81.0521V76.2402H21.7709V76.9232C22.1225 76.3989 22.632 76.1374 23.2963 76.1374C23.5867 76.1374 23.852 76.1897 24.0944 76.2931C24.3362 76.3977 24.518 76.5342 24.6387 76.7037C24.7587 76.8715 24.8439 77.0729 24.8919 77.3049C24.9213 77.4564 24.9363 77.7198 24.9363 78.0967V81.0521H24.122V78.1286C24.122 77.7961 24.0914 77.5472 24.0278 77.3831C23.9648 77.2202 23.852 77.0885 23.6917 76.9899C23.5315 76.8925 23.3413 76.8432 23.1253 76.8432C22.7796 76.8432 22.4826 76.9526 22.2305 77.1739C21.9791 77.3927 21.8543 77.8123 21.8543 78.4274V81.0527H21.04V81.0521ZM16.375 82.9026L16.2826 82.1475C16.4614 82.1956 16.6156 82.2203 16.7482 82.2203C16.9306 82.2203 17.0753 82.1896 17.1827 82.1289C17.2931 82.0687 17.3825 81.9846 17.4515 81.8764C17.5025 81.7934 17.5859 81.5908 17.6999 81.2668C17.7155 81.2217 17.7383 81.1555 17.7726 81.0672L15.9489 76.2402H16.819L17.8218 79.0183C17.9532 79.3688 18.069 79.7397 18.1716 80.1299C18.2664 79.7638 18.3768 79.4019 18.5065 79.0466L19.5314 76.2402H20.3445L18.5287 81.1363C18.3324 81.663 18.18 82.0243 18.0702 82.2239C17.925 82.4914 17.7582 82.6874 17.5721 82.813C17.3837 82.9381 17.1599 83 16.9006 83C16.7434 83 16.5676 82.9675 16.375 82.9026ZM12.4673 75.6463L13.0601 74.3759H14.1337L13.1435 75.6463H12.4673ZM11.7808 78.5644C11.7808 79.1933 11.9062 79.6526 12.1558 79.9411C12.4072 80.2303 12.7199 80.3752 13.0967 80.3752C13.4718 80.3752 13.785 80.2327 14.0395 79.9448C14.2927 79.6568 14.4187 79.2059 14.4187 78.5909C14.4187 78.0035 14.2879 77.5592 14.0269 77.2617C13.7664 76.9635 13.4514 76.815 13.0841 76.815C12.7217 76.815 12.415 76.9617 12.16 77.2556C11.9074 77.549 11.7808 77.9849 11.7808 78.5644ZM11.1147 81.4513L11.9014 81.5626C11.9332 81.8066 12.0262 81.9846 12.1774 82.097C12.3796 82.2473 12.6557 82.3231 13.0055 82.3231C13.3818 82.3231 13.674 82.2473 13.8792 82.097C14.0839 81.9473 14.2225 81.7357 14.2951 81.4646C14.3371 81.3004 14.3569 80.9511 14.3539 80.4221C13.9981 80.8423 13.5552 81.0527 13.0241 81.0527C12.364 81.0527 11.8516 80.8147 11.4909 80.3373C11.1285 79.8618 10.9478 79.2901 10.9478 78.6233C10.9478 78.164 11.0313 77.7408 11.1963 77.353C11.3613 76.9653 11.6019 76.6671 11.917 76.4555C12.2314 76.2432 12.6017 76.1386 13.0271 76.1386C13.5936 76.1386 14.0611 76.3707 14.4283 76.8336V76.2414H15.1778V80.3962C15.1778 81.1459 15.1022 81.6768 14.9498 81.9882C14.7986 82.3002 14.5561 82.5479 14.2273 82.7283C13.8972 82.9092 13.4916 83 13.0103 83C12.4378 83 11.977 82.8713 11.6247 82.6134C11.2719 82.3567 11.1021 81.969 11.1147 81.4513ZM8.17308 81.0521V76.2402H8.90398V76.9773C9.0906 76.6352 9.26343 76.4098 9.42245 76.3016C9.58147 76.1921 9.75549 76.138 9.94512 76.138C10.22 76.138 10.499 76.2252 10.7828 76.3965L10.493 77.1492C10.295 77.0374 10.0981 76.9827 9.90011 76.9827C9.72309 76.9827 9.56407 77.0362 9.42365 77.1432C9.28323 77.2502 9.18302 77.3987 9.12301 77.5881C9.0318 77.8773 8.98739 78.1941 8.98739 78.5386V81.0533H8.17308V81.0521ZM6.17182 81.0521V80.3367C5.79857 80.8826 5.2927 81.1543 4.65242 81.1543C4.36978 81.1543 4.10634 81.1002 3.86091 80.9914C3.61608 80.882 3.43365 80.7461 3.31484 80.582C3.19602 80.4167 3.11321 80.2159 3.06521 79.9778C3.0328 79.8167 3.016 79.5636 3.016 79.2167V76.2396H3.83031V78.9023C3.83031 79.3273 3.84711 79.6147 3.87951 79.7614C3.93052 79.976 4.03853 80.1431 4.20536 80.2652C4.36978 80.3872 4.57381 80.4497 4.81744 80.4497C5.06107 80.4497 5.2897 80.3872 5.50273 80.2622C5.71516 80.1365 5.86638 79.9658 5.95579 79.7506C6.044 79.5359 6.08901 79.2221 6.08901 78.8115V76.2396H6.90331V81.0515H6.17182V81.0521ZM2.2305 80.3241L2.34211 81.0443C2.11348 81.0924 1.90825 81.1171 1.72943 81.1171C1.43479 81.1171 1.20616 81.0702 1.04294 80.9758C0.880317 80.8826 0.766902 80.7606 0.700293 80.6073C0.633684 80.4546 0.60128 80.1329 0.60128 79.643V76.8703H0V76.2408H0.60128V75.0505L1.41619 74.5605V76.2414H2.2305V76.8709H1.41619V79.6899C1.41619 79.9237 1.42999 80.074 1.45939 80.1395C1.487 80.2063 1.5332 80.2586 1.59801 80.2995C1.66282 80.3373 1.75523 80.3584 1.87585 80.3584C1.96526 80.3572 2.08408 80.3463 2.2305 80.3241Z" fill="white"/>
<path d="M20.0403 0L26.2565 1.84144V46.5073H20.0559L20.0403 0Z" fill="white"/>
<path d="M26.9598 2.04764L33.182 3.88246V46.5073H26.9814L26.9598 2.04764Z" fill="white"/>
<path d="M33.8697 4.1055L39.9827 5.91147V46.5205H33.8937L33.8697 4.1055Z" fill="white"/>
<path d="M40.6956 6.13812L45.9277 7.68378V46.5019H40.7166L40.6956 6.13812Z" fill="white"/>
<path d="M46.5938 7.91223L50.3341 9.01782V46.5019H46.6082L46.5938 7.91223Z" fill="white"/>
<path d="M51.0284 10.2484L54.81 11.3005V46.5205H51.0433L51.0284 10.2484Z" fill="white"/>
<path d="M55.52 11.4929L58.8798 12.4278V46.5205H55.5326L55.52 11.4929Z" fill="white"/>
<path d="M63.705 12.7284L60.0829 11.6667V46.5169H63.705V12.7284Z" fill="white"/>
<path d="M68.2746 14.0431L64.4299 12.9255V46.5073H68.2746V14.0431Z" fill="white"/>
<path d="M72.5868 15.3093L68.9965 14.2656V46.5169H72.5868V15.3093Z" fill="white"/>
<path d="M76.6283 16.4858L73.3099 15.5089V46.5283H76.6283V16.4858Z" fill="white"/>
<path d="M80.6417 17.6599L77.3226 16.683V46.5097H80.6417V17.6599Z" fill="white"/>
<path d="M82.4887 16.4293L81.8514 17.0966V46.5283H82.4887V16.4293Z" fill="white"/>
<path d="M84.0075 14.7946L83.2112 15.6213V46.5283H84.0075V14.7946Z" fill="white"/>
<path d="M89.5769 8.802L84.7396 14.0245V46.5187H89.5769V8.802Z" fill="white"/>
<path d="M93.4402 9.49697L90.2808 8.32285V46.5223H93.4402V9.49697Z" fill="white"/>
<path d="M97.7812 11.1123L94.1531 9.75967V46.5127H97.7812V11.1123Z" fill="white"/>
<path d="M101.545 12.4933L98.5072 11.3943V46.5193H101.545V12.4933Z" fill="white"/>
<path d="M104.902 13.7425L102.249 12.747V46.5193H104.902V13.7425Z" fill="white"/>
<path d="M106.664 15.6874L105.577 15.293V46.5193H106.664V15.6874Z" fill="white"/>
<path d="M109.543 16.7677L107.396 15.9694V46.5289H109.543V16.7677Z" fill="white"/>
<path d="M112.358 17.8006L110.24 17.0124V46.5223H112.358V17.8006Z" fill="white"/>
<path d="M115.059 18.834L113.081 18.0981V46.5319H115.059V18.834Z" fill="white"/>
<path d="M116.496 18.3549L115.766 18.7871V46.5097H116.496V18.3549Z" fill="white"/>
<path d="M119.296 19.0126L117.224 18.2328V46.5253H119.296V19.0126Z" fill="white"/>
<path d="M121.678 19.8861L120.018 19.2849V46.5253H121.678V19.8861Z" fill="white"/>
<path d="M124.65 20.9947L122.39 20.1494V46.5253H124.65V20.9947Z" fill="white"/>
<path d="M127.275 21.953L125.372 21.2574V46.5223H127.275V21.953Z" fill="white"/>
</svg>
