<svg width="51" height="51" viewBox="0 0 51 51" fill="none" xmlns="http://www.w3.org/2000/svg">
<path d="M25.3225 0C11.3597 0 0 11.3597 0 25.3225C0 39.2843 11.3597 50.645 25.3225 50.645C39.2843 50.645 50.645 39.2843 50.645 25.3225C50.645 11.3597 39.2863 0 25.3225 0Z" fill="#7EB621"/>
<path fill-rule="evenodd" clip-rule="evenodd" d="M39.7239 34.1587V22.3675V16.4883C39.7239 13.4181 37.2269 10.9221 34.1567 10.9221H16.4873C13.4171 10.9221 10.9211 13.4181 10.9211 16.4883V22.3675V34.1587C10.9211 37.23 13.4171 39.7259 16.4873 39.7259H34.1578C37.2269 39.7259 39.7239 37.23 39.7239 34.1587ZM36.3916 14.2393V19.121L31.5251 19.1373L31.5088 14.2546L36.3916 14.2393ZM25.3215 30.392C28.1153 30.392 30.3929 28.1184 30.3929 25.3226C30.3929 24.2189 30.0319 23.2 29.4341 22.3676C28.5131 21.0906 27.0157 20.2532 25.3246 20.2532C23.6324 20.2532 22.136 21.0896 21.2129 22.3666C20.6132 23.1989 20.2552 24.2179 20.2541 25.3216C20.2511 28.1174 22.5267 30.392 25.3215 30.392ZM33.2 25.3226C33.2 29.6648 29.6667 33.2001 25.3225 33.2001C20.9783 33.2001 17.4461 29.6648 17.4461 25.3226C17.4461 24.2781 17.6542 23.2796 18.0254 22.3677H13.7261V34.1589C13.7261 35.6828 14.9634 36.917 16.4863 36.917H34.1557C35.6765 36.917 36.9158 35.6828 36.9158 34.1589V22.3677H32.6145C32.9888 23.2796 33.2 24.2781 33.2 25.3226Z" fill="#F8F8F8"/>
</svg>
