Division,WeightClassKg,Place,Name,Team,BodyweightKg,Best3SquatKg,Best3BenchKg,Best3DeadliftKg,TotalKg,Equipment,Event,Sex,BirthDate
Boys,51.71,1,Adrian Maya,Pasadena South Houston,50.89,106.59,61.23,127.01,294.84,Unlimited,SBD,M,
Boys,55.79,1,Juan Guerrero,Channelview,55.7,133.81,88.45,154.22,376.48,Unlimited,SBD,M,
Boys,59.87,1,Ismael Hernandez,Pasadena South Houston,59.87,190.51,106.59,224.53,521.63,Unlimited,SBD,M,
Boys,59.87,DQ,Derick Martinez,Channelview,58.06,,,,,Unlimited,SBD,M,
Boys,74.84,1,Rocky Sanchez,Houston Eisenhower,74.66,154.22,86.18,167.83,408.23,Unlimited,SBD,M,
Boys,82.1,1,Jayden Flores,Pasadena South Houston,80.29,265.35,161.03,265.35,691.73,Unlimited,SBD,M,
Boys,82.1,2,Deven Holman,Crosby,80.74,192.78,120.2,231.33,544.31,Unlimited,SBD,M,
Boys,82.1,3,Cojisce Peterson,Pasadena South Houston,81.83,224.53,120.2,192.78,537.51,Unlimited,SBD,M,
Boys,82.1,4,Rogelio Palma,Pasadena South Houston,79.11,179.17,104.33,165.56,449.06,Unlimited,SBD,M,
Boys,82.1,5,Jaden Jackson,Houston Eisenhower,80.74,158.76,92.99,176.9,428.64,Unlimited,SBD,M,
Boys,82.1,DQ,Rene Chavez,Pasadena South Houston,80.38,,,,,Unlimited,SBD,M,
Boys,89.81,1,Levi Fontenot,Crosby,87.09,265.35,129.27,260.82,655.44,Unlimited,SBD,M,
Boys,99.79,1,Joseph Escalante,Channelview,95.48,249.48,133.81,206.38,589.67,Unlimited,SBD,M,
Boys,99.79,2,Jarell Jackson,Houston Eisenhower,99.34,183.7,124.74,204.12,512.56,Unlimited,SBD,M,
Boys,99.79,3,Moises Perales,Crosby,92.08,142.88,108.86,167.83,419.57,Unlimited,SBD,M,
Boys,109.77,1,Gavin Ramirez,Crosby,109.32,283.5,145.15,224.53,653.17,Unlimited,SBD,M,
Boys,109.77,2,Shane Aguilar,Channelview,109.5,226.8,142.88,226.8,596.47,Unlimited,SBD,M,
Boys,109.77,3,Gerinho Lima,Houston Eisenhower,106.5,192.78,142.88,215.46,551.11,Unlimited,SBD,M,
Boys,109.77,4,Gabriel Fernandez,Crosby,107.5,226.8,124.74,188.24,539.77,Unlimited,SBD,M,
Boys,109.77,5,Jimmy Garner,Channelview,108.95,190.51,127.01,190.51,508.02,Unlimited,SBD,M,
Boys,124.74,1,Angel Rodriguez,Pasadena South Houston,120.29,242.67,151.95,197.31,591.94,Unlimited,SBD,M,
Boys,124.74,2,Nathaniel O'Flaherty,Crosby,114.67,226.8,142.88,183.7,553.38,Unlimited,SBD,M,
Boys,124.74,3,Kevin Cox,Pasadena South Houston,117.21,188.24,102.06,185.97,476.27,Unlimited,SBD,M,
Boys,139.71,1,Joshua Torres,Channelview,128.09,249.48,151.95,222.26,623.69,Unlimited,SBD,M,
Boys,139.71,2,Nicholas Majano,Pasadena South Houston,130.63,188.24,117.93,163.29,469.47,Unlimited,SBD,M,
Boys,139.71,3,Christopher Romero,Houston Eisenhower,137.26,142.88,102.06,176.9,421.84,Unlimited,SBD,M,
Boys,139.71+,1,Aanson Johnson,Crosby,165.56,226.8,142.88,204.12,573.79,Unlimited,SBD,M,
Boys,139.71+,2,Zion Perkins,Pasadena South Houston,155.58,219.99,102.06,213.19,535.24,Unlimited,SBD,M,
