Division,WeightClassKg,Place,Name,Team,BodyweightKg,Best3SquatKg,Best3BenchKg,Best3DeadliftKg,TotalKg,Equipment,Event,Sex,BirthDate
Boys,51.71,1,Leonardo Ruiz,Hidalgo Early College,50.53,185.97,127.01,192.78,505.76,Unlimited,SBD,M,
Boys,51.71,2,Damien Perez,Hidalgo Early College,50.44,156.49,115.67,172.37,444.52,Unlimited,SBD,M,
Boys,51.71,3,Daniel Perez,Hidalgo Early College,50.35,154.22,108.86,172.37,435.45,Unlimited,SBD,M,
Boys,51.71,4,Arnold Lopez,Port Isabel,50.62,156.49,88.45,176.9,421.84,Unlimited,SBD,M,
Boys,51.71,5,Albert Camacho,Zapata,46.9,154.22,92.99,151.95,399.16,Unlimited,SBD,M,
Boys,51.71,6,Emiliano Garcia,Bishop,50.12,151.95,83.91,158.76,394.63,Unlimited,SBD,M,
Boys,51.71,7,Alvaro Valdez,Hidalgo Early College,50.08,156.49,92.99,142.88,392.36,Unlimited,SBD,M,
Boys,51.71,8,Brody Wyatt,Corpus Christi Calallen,50.53,138.35,92.99,161.03,392.36,Unlimited,SBD,M,
Boys,51.71,9,Mark Garcia,Pearsall,50.89,147.42,90.72,147.42,385.55,Unlimited,SBD,M,
Boys,51.71,10,Jordan Hudson,Bishop,51.71,124.74,65.77,151.95,342.46,Unlimited,SBD,M,
Boys,51.71,11,Marc Ramirez,Pearsall,50.53,124.74,61.23,142.88,328.85,Unlimited,SBD,M,
Boys,51.71,DQ,Ricky Medina,Somerset,50.53,,,,,Unlimited,SBD,M,
Boys,55.79,1,Andrew Gonzalez,Kingsville King,55.16,192.78,120.2,195.04,508.02,Unlimited,SBD,M,
Boys,55.79,2,Caleb De La Cerda,Corpus Christi Tuloso-Midway,54.88,188.24,127.01,165.56,480.81,Unlimited,SBD,M,
Boys,55.79,3,Vicente Azuara,Port Isabel,54.43,183.7,106.59,183.7,474,Unlimited,SBD,M,
Boys,55.79,4,Connor Rackley,Corpus Christi Calallen,54.34,165.56,113.4,163.29,442.25,Unlimited,SBD,M,
Boys,55.79,5,Tanner Weaver,Orange Grove,54.79,174.63,102.06,158.76,435.45,Unlimited,SBD,M,
Boys,55.79,6,Anthony Mata,Somerset,54.88,170.1,86.18,154.22,410.5,Unlimited,SBD,M,
Boys,55.79,7,Lee Cruz,Floresville,54.34,145.15,102.06,147.42,394.63,Unlimited,SBD,M,
Boys,55.79,NS,Joe Guerrero,Devine,,,,,,Unlimited,SBD,M,
Boys,55.79,NS,Damian Perez,Hidalgo Early College,,,,,,Unlimited,SBD,M,
Boys,55.79,DQ,Juventino Zapata,Zapata,55.43,,,,,Unlimited,SBD,M,
Boys,55.79,DQ,Joshua Ramirez,Somerset,54.25,,,,,Unlimited,SBD,M,
Boys,55.79,DQ,Reymundo Falcon,Carrizo Springs,54.34,151.95,,,,Unlimited,SBD,M,
Boys,59.87,1,Tristian Davila,Corpus Christi Tuloso-Midway,59.06,242.67,170.1,231.33,644.1,Unlimited,SBD,M,
Boys,59.87,2,Sammy Ronje,Bishop,59.38,206.38,136.08,210.92,553.38,Unlimited,SBD,M,
Boys,59.87,3,Tre Galvan,Bishop,59.74,199.58,111.13,206.38,517.1,Unlimited,SBD,M,
Boys,59.87,4,Christopher Lowe,San Antonio Kennedy,59.87,183.7,113.4,201.85,498.95,Unlimited,SBD,M,
Boys,59.87,5,Brandon Leal,Hidalgo Early College,59.06,190.51,111.13,183.7,485.34,Unlimited,SBD,M,
Boys,59.87,6,David Salinas,Corpus Christi Calallen,58.69,174.63,122.47,174.63,471.74,Unlimited,SBD,M,
Boys,59.87,7,Isreal Perez,Corpus Christi Tuloso-Midway,58.79,206.38,92.99,170.1,469.47,Unlimited,SBD,M,
Boys,59.87,8,Ryan Sturgis,Robstown,58.24,192.78,108.86,161.03,462.66,Unlimited,SBD,M,
Boys,59.87,9,Julio Palomo-Montelongo,Bishop,58.06,158.76,102.06,188.24,449.06,Unlimited,SBD,M,
Boys,59.87,10,Byron Carter,Orange Grove,59.87,167.83,111.13,167.83,446.79,Unlimited,SBD,M,
Boys,59.87,NS,Sonny Imming,Somerset,,,,,,Unlimited,SBD,M,
Boys,59.87,NS,Patrick Barnett,Corpus Christi Calallen,,,,,,Unlimited,SBD,M,
Boys,59.87,DQ,Daniel Velasquez,San Antonio Memorial,58.97,,,,,Unlimited,SBD,M,
Boys,67.13,1,Pj Brown,Alice,65.59,242.67,165.56,242.67,650.91,Unlimited,SBD,M,
Boys,67.13,2,Gabriel Garza,Robstown,66.04,235.87,142.88,231.33,610.08,Unlimited,SBD,M,
Boys,67.13,3,Landen Longoria,Sinton,65.77,231.33,149.69,226.8,607.81,Unlimited,SBD,M,
Boys,67.13,4,Gilbert Perez,Corpus Christi Tuloso-Midway,65.32,224.53,142.88,226.8,594.21,Unlimited,SBD,M,
Boys,67.13,5,Traey Alvarado,Rockport-Fulton,65.95,226.8,140.61,219.99,587.4,Unlimited,SBD,M,
Boys,67.13,6,Roman Martinez,Pleasanton,66.22,210.92,136.08,224.53,571.53,Unlimited,SBD,M,
Boys,67.13,7,Chris Veloz,Zapata,65.14,197.31,138.35,229.06,564.72,Unlimited,SBD,M,
Boys,67.13,8,Joseph Salazar,Zapata,65.59,197.31,113.4,242.67,553.38,Unlimited,SBD,M,
Boys,67.13,9,Jaiden Gutierrez,Corpus Christi Tuloso-Midway,65.86,226.8,117.93,201.85,546.58,Unlimited,SBD,M,
Boys,67.13,10,Roel Gonzalez,Alice,66.13,215.46,129.27,199.58,544.31,Unlimited,SBD,M,
Boys,67.13,DQ,Seth DeLeon,Devine,65.59,235.87,163.29,,,Unlimited,SBD,M,
Boys,67.13,DQ,Andre Aguirre,Uvalde,64.32,,,,,Unlimited,SBD,M,
Boys,74.84,1,Josiah Lugo,Somerset,73.94,312.98,204.12,240.4,757.5,Unlimited,SBD,M,
Boys,74.84,2,Kingston Martinez,Pearsall,74.12,272.16,174.63,272.16,718.94,Unlimited,SBD,M,
Boys,74.84,3,Joaquin Soliz,Corpus Christi Calallen,73.39,251.74,170.1,249.48,671.32,Unlimited,SBD,M,
Boys,74.84,4,Nik Garza,Alice,73.03,265.35,170.1,224.53,659.98,Unlimited,SBD,M,
Boys,74.84,5,Noah Kiser,Corpus Christi Tuloso-Midway,73.3,260.82,142.88,222.26,625.96,Unlimited,SBD,M,
Boys,74.84,6,Ricardo Rodriguez,Corpus Christi Calallen,72.67,247.21,131.54,240.4,619.15,Unlimited,SBD,M,
Boys,74.84,7,Aiden Galvan,Sinton,73.84,247.21,154.22,215.46,616.89,Unlimited,SBD,M,
Boys,74.84,8,Fernando Vega,Corpus Christi West Oso,74.84,224.53,174.63,206.38,605.55,Unlimited,SBD,M,
Boys,74.84,9,Jaden Cantu,Corpus Christi Calallen,72.12,240.4,172.37,188.24,601.01,Unlimited,SBD,M,
Boys,74.84,10,AJ Vasquez,Floresville,71.12,231.33,145.15,222.26,598.74,Unlimited,SBD,M,
Boys,74.84,11,Michael Ramos,Rockport-Fulton,73.39,222.26,151.95,213.19,587.4,Unlimited,SBD,M,
Boys,74.84,DQ,Michael Reyes,Carrizo Springs,73.66,226.8,,,,Unlimited,SBD,M,
Boys,82.1,1,Lucian Medina,Corpus Christi Calallen,79.65,290.3,238.14,265.35,793.79,Unlimited,SBD,M,
Boys,82.1,2,Matthew Rodriguez,Corpus Christi Tuloso-Midway,77.2,249.48,170.1,244.94,664.51,Unlimited,SBD,M,
Boys,82.1,3,Frank Munguia,Corpus Christi Tuloso-Midway,80.74,251.74,165.56,247.21,664.51,Unlimited,SBD,M,
Boys,82.1,4,Israel Reyes,Devine,78.38,272.16,147.42,238.14,657.71,Unlimited,SBD,M,
Boys,82.1,5,Aaron Barrera,Port Isabel,78.56,251.74,176.9,229.06,657.71,Unlimited,SBD,M,
Boys,82.1,6,Gilbert Rios,Robstown,79.11,247.21,170.1,233.6,650.91,Unlimited,SBD,M,
Boys,82.1,7,Chayse Mrazek,Bishop,81.87,247.21,158.76,235.87,641.83,Unlimited,SBD,M,
Boys,82.1,8,Armando DeLeon,Alice,79.29,226.8,156.49,229.06,612.35,Unlimited,SBD,M,
Boys,82.1,9,Diego Fuentes,Corpus Christi Calallen,80.56,219.99,181.44,188.24,589.67,Unlimited,SBD,M,
Boys,82.1,10,Jose Galvan,Port Isabel,80.1,226.8,131.54,197.31,555.65,Unlimited,SBD,M,
Boys,82.1,11,Dante DeLeon,Sinton,79.02,199.58,129.27,217.72,546.58,Unlimited,SBD,M,
Boys,82.1,DQ,Noah Hernandez,Port Isabel,78.83,240.4,142.88,,,Unlimited,SBD,M,
Boys,89.81,1,Ryne Espinoza,Beeville Jones,85.91,310.71,190.51,272.16,773.37,Unlimited,SBD,M,
Boys,89.81,2,Hunter Gaines,Rockport-Fulton,85.28,269.89,151.95,242.67,664.51,Unlimited,SBD,M,
Boys,89.81,3,Kade Alston,Rockport-Fulton,86.82,254.01,167.83,242.67,664.51,Unlimited,SBD,M,
Boys,89.81,4,Michael Guajardo,Corpus Christi Tuloso-Midway,87.18,265.35,151.95,240.4,657.71,Unlimited,SBD,M,
Boys,89.81,5,Chuy Vasquez,Uvalde,85.46,249.48,163.29,235.87,648.64,Unlimited,SBD,M,
Boys,89.81,6,Sean Quintanilla,Corpus Christi Tuloso-Midway,86.91,272.16,142.88,222.26,637.3,Unlimited,SBD,M,
Boys,89.81,7,Homero Tovar,Raymondville,88.63,260.82,133.81,242.67,637.3,Unlimited,SBD,M,
Boys,89.81,8,Tristian Luna,Corpus Christi Calallen,84.91,242.67,142.88,249.48,635.03,Unlimited,SBD,M,
Boys,89.81,9,Gabriel Bruno,La Feria,87.27,256.28,158.76,219.99,635.03,Unlimited,SBD,M,
Boys,89.81,10,Bernardo Bernabe,San Antonio Kennedy,87.72,265.35,142.88,226.8,635.03,Unlimited,SBD,M,
Boys,89.81,11,Rylan Diaz,Uvalde,86.36,238.14,136.08,222.26,596.47,Unlimited,SBD,M,
Boys,89.81,DQ,Jayden Kemp,Corpus Christi Tuloso-Midway,87.91,251.74,,,,Unlimited,SBD,M,
Boys,99.79,1,Jonathan Cerda,Raymondville,90.26,297.1,195.04,251.74,743.89,Unlimited,SBD,M,
Boys,99.79,2,Sal Sanchez,Somerset,96.62,299.37,199.58,244.94,743.89,Unlimited,SBD,M,
Boys,99.79,3,Daniel Arellano,Floresville,92.71,281.23,188.24,272.16,741.62,Unlimited,SBD,M,
Boys,99.79,4,Adrian Estrada,Rockport-Fulton,96.25,283.5,183.7,265.35,732.55,Unlimited,SBD,M,
Boys,99.79,5,Zeke Palestina,Port Isabel,98.16,281.23,183.7,249.48,714.41,Unlimited,SBD,M,
Boys,99.79,6,Christian Torres,Raymondville,97.07,294.84,165.56,247.21,707.6,Unlimited,SBD,M,
Boys,99.79,7,Marcos Acosta,Corpus Christi Calallen,96.16,251.74,197.31,238.14,687.19,Unlimited,SBD,M,
Boys,99.79,8,Richard Rubio,Corpus Christi Calallen,97.34,258.55,204.12,206.38,669.05,Unlimited,SBD,M,
Boys,99.79,9,Miguel Silva,Carrizo Springs,94.98,251.74,172.37,240.4,664.51,Unlimited,SBD,M,
Boys,99.79,10,Ram Cantu,Alice,97.07,244.94,188.24,224.53,657.71,Unlimited,SBD,M,
Boys,99.79,NS,Malakai Lara,Uvalde,,,,,,Unlimited,SBD,M,
Boys,99.79,DQ,Jordan Garcia,Corpus Christi Calallen,96.16,,,,,Unlimited,SBD,M,
Boys,109.77,1,Randi Pedraza,Raymondville,105.32,347,197.31,294.84,839.15,Unlimited,SBD,M,
Boys,109.77,2,Cayetano Vidaurri,Beeville Jones,104.87,351.53,215.46,267.62,834.61,Unlimited,SBD,M,
Boys,109.77,3,Fabian Saenz,Corpus Christi Calallen,105.32,301.64,183.7,244.94,730.28,Unlimited,SBD,M,
Boys,109.77,4,Sebastian Aguilar,Pleasanton,105.78,285.76,170.1,272.16,728.02,Unlimited,SBD,M,
Boys,109.77,5,Mario Nava,Port Isabel,103.69,292.57,192.78,217.72,703.07,Unlimited,SBD,M,
Boys,109.77,6,Andrew Torres,Carrizo Springs,100.24,281.23,183.7,226.8,691.73,Unlimited,SBD,M,
Boys,109.77,7,Brandon Lopez,Rio Grande City Grulla,106.78,263.08,190.51,226.8,680.39,Unlimited,SBD,M,
Boys,109.77,8,Carlos Cabrera,Port Isabel,107.05,272.16,183.7,224.53,680.39,Unlimited,SBD,M,
Boys,109.77,9,Seth Barnes,Orange Grove,107.32,260.82,199.58,219.99,680.39,Unlimited,SBD,M,
Boys,109.77,10,Julio Jimenez,Carrizo Springs,101.06,254.01,167.83,233.6,655.44,Unlimited,SBD,M,
Boys,109.77,11,Jace Brandt,Orange Grove,101.24,226.8,179.17,217.72,623.69,Unlimited,SBD,M,
Boys,109.77,12,Jd Spurlock,Somerset,105.78,274.42,158.76,190.51,623.69,Unlimited,SBD,M,
Boys,124.74,1,Aiden Hinojosa,Corpus Christi Calallen,114.4,365.14,283.5,274.42,923.06,Unlimited,SBD,M,
Boys,124.74,2,Carlos Trevino,Robstown,120.11,308.44,204.12,240.4,752.96,Unlimited,SBD,M,
Boys,124.74,3,Diego Valdez,Pleasanton,121.56,283.5,210.92,238.14,732.55,Unlimited,SBD,M,
Boys,124.74,4,Arnulfo Puga,Beeville Jones,120.84,294.84,183.7,231.33,709.87,Unlimited,SBD,M,
Boys,124.74,5,Andrew Murillo,Pleasanton,116.3,294.84,201.85,206.38,703.07,Unlimited,SBD,M,
Boys,124.74,6,Manuel Hinojosa,Ingleside,119.75,285.76,181.44,235.87,703.07,Unlimited,SBD,M,
Boys,124.74,7,Alex Botello,Alice,119.66,299.37,156.49,233.6,689.46,Unlimited,SBD,M,
Boys,124.74,8,George Garcia,Corpus Christi Tuloso-Midway,114.85,260.82,174.63,244.94,680.39,Unlimited,SBD,M,
Boys,124.74,9,Luis Varela,Port Isabel,116.57,249.48,174.63,226.8,650.91,Unlimited,SBD,M,
Boys,124.74,10,Jose-Daniel Flores,Corpus Christi Tuloso-Midway,113.31,274.42,167.83,201.85,644.1,Unlimited,SBD,M,
Boys,124.74,DQ,Aaron Graves,Uvalde,111.86,,,,,Unlimited,SBD,M,
Boys,124.74,DQ,Walter Smart,Pearsall,124.01,258.55,,,,Unlimited,SBD,M,
Boys,139.71,1,Benjamin Oyervides,Robstown,134.54,306.17,231.33,256.28,793.79,Unlimited,SBD,M,
Boys,139.71,2,Cristobal Ortega,La Feria,133.72,317.51,185.97,267.62,771.11,Unlimited,SBD,M,
Boys,139.71,3,Exodus Acevedo,Floresville,131.72,290.3,188.24,265.35,743.89,Unlimited,SBD,M,
Boys,139.71,4,Joe Hernandez,Corpus Christi West Oso,136.71,299.37,204.12,231.33,734.82,Unlimited,SBD,M,
Boys,139.71,5,Evan Guardiola,Pleasanton,128.91,281.23,195.04,249.48,725.75,Unlimited,SBD,M,
Boys,139.71,6,Ricardo Barba,La Feria,136.35,306.17,158.76,224.53,689.46,Unlimited,SBD,M,
Boys,139.71,7,Jesus Martinez,Beeville Jones,130.73,256.28,190.51,233.6,680.39,Unlimited,SBD,M,
Boys,139.71,8,Arnold Munoz,Corpus Christi Calallen,127.28,267.62,165.56,229.06,662.24,Unlimited,SBD,M,
Boys,139.71,9,Nicholas Garcia,San Antonio Memorial,126.37,263.08,165.56,231.33,659.98,Unlimited,SBD,M,
Boys,139.71,10,Joseph Figueroa,La Feria,128.09,267.62,149.69,229.06,646.37,Unlimited,SBD,M,
Boys,139.71,11,Brady Buchanan,Corpus Christi Calallen,134.99,224.53,179.17,215.46,619.15,Unlimited,SBD,M,
Boys,139.71,DQ,Tacori Cook,Somerset,129.91,,,,,Unlimited,SBD,M,
Boys,139.71+,1,Javier Adams,Somerset,152.13,294.84,204.12,294.84,793.79,Unlimited,SBD,M,
Boys,139.71+,2,Miggy Saenz,Alice,142.16,317.51,210.92,254.01,782.45,Unlimited,SBD,M,
Boys,139.71+,3,Peyton Torres,Beeville Jones,146.51,294.84,192.78,238.14,725.75,Unlimited,SBD,M,
Boys,139.71+,4,Adriel Gonzalez,Uvalde,149.59,283.5,183.7,256.28,723.48,Unlimited,SBD,M,
Boys,139.71+,5,Carson Sifuentes,Corpus Christi Calallen,151.59,281.23,213.19,210.92,705.34,Unlimited,SBD,M,
Boys,139.71+,6,Ryan Hughes,Pearsall,149.05,294.84,192.78,185.97,673.58,Unlimited,SBD,M,
Boys,139.71+,7,Felipe Pena Chu,San Antonio Memorial,161.84,285.76,151.95,210.92,648.64,Unlimited,SBD,M,
Boys,139.71+,8,Jakob Perez,Somerset,146.42,258.55,174.63,204.12,637.3,Unlimited,SBD,M,
Boys,139.71+,9,Jerry Rodriguez,Carrizo Springs,143.06,238.14,133.81,240.4,612.35,Unlimited,SBD,M,
Boys,139.71+,DQ,Patrick Davis,Corpus Christi Calallen,148.96,,,,,Unlimited,SBD,M,
Boys,139.71+,NS,Lizandro Garcia,Rio Grande City Grulla,,,,,,Unlimited,SBD,M,
Boys,139.71+,DQ,Lyndell Cook,Somerset,141.7,172.37,,,,Unlimited,SBD,M,
