Place,Name,BirthDate,Sex,BirthYear,Age,Country,State,Equipment,Division,BodyweightKg,WeightClassKg,Squat1Kg,Squat2Kg,Squat3Kg,Best3SquatKg,Bench1Kg,Bench2Kg,Bench3Kg,Best3BenchKg,Deadlift1Kg,Deadlift2Kg,Deadlift3Kg,Best3DeadliftKg,TotalKg,Event
2,Aliki Ameer,,F,2004,20,USA,IL,Raw,FR-Jr,56.65,57,120.0,130.0,135.0,135.0,87.5,92.5,-95.0,92.5,132.5,145.0,152.5,152.5,380.0,SBD
1,Nataleigh Hunter,,F,2002,21,USA,DE,Raw,FR-Jr,61.75,63,175.0,185.5,190.5,190.5,90.0,95.0,100.0,100.0,187.5,200.0,-207.5,200.0,490.5,SBD
2,Angelina Martinez,,F,2001,23,USA,NY,Raw,FR-Jr,62.40,63,155.0,165.0,167.5,167.5,92.5,97.5,-100.0,97.5,195.0,210.0,215.0,215.0,480.0,SBD
3,Daisy Arreola Garcia,,F,2001,23,USA,OR,Raw,FR-Jr,61.95,63,-160.0,160.0,-167.5,160.0,92.5,97.5,100.0,100.0,170.0,180.0,-190.0,180.0,440.0,SBD
4,Hannah Smith #4,,F,2003,20,USA,IL,Raw,FR-Jr,61.60,63,130.0,-140.0,140.0,140.0,72.5,80.0,-87.5,80.0,125.0,137.5,147.5,147.5,367.5,SBD
5,Darlene Navarro,,F,2001,23,USA,OR,Raw,FR-Jr,61.75,63,120.0,130.0,-137.5,130.0,60.0,65.0,67.5,67.5,142.5,150.0,-152.5,150.0,347.5,SBD
6,Elizabeth Pizarro,,F,2004,19,USA,TX,Raw,FR-Jr,59.90,63,-115.0,115.0,122.5,122.5,62.5,67.5,70.0,70.0,112.5,117.5,-130.0,117.5,310.0,SBD
7,Samantha Occhionero,,F,2002,22,USA,OH,Raw,FR-Jr,59.05,63,112.5,117.5,-125.0,117.5,60.0,-62.5,62.5,62.5,110.0,115.0,-117.5,115.0,295.0,SBD
8,Taylor Boyle,,F,2001,23,USA,PA,Raw,FR-Jr,58.65,63,87.5,92.5,100.0,100.0,52.5,57.5,-60.0,57.5,115.0,122.5,-127.5,122.5,280.0,SBD
1,Carolyn Connor,,F,2003,21,USA,PA,Raw,FR-Jr,68.55,69,175.0,182.5,187.5,187.5,-92.5,97.5,103.0,103.0,203.0,213.0,-218.0,213.0,503.5,SBD
2,Haley Hunter #1,,F,2001,22,USA,CA,Raw,FR-Jr,68.05,69,182.5,-190.0,-190.0,182.5,95.0,-100.0,-100.0,95.0,180.0,187.5,-190.0,187.5,465.0,SBD
1,Emma Newman,,F,2003,21,USA,NY,Raw,FR-Jr,75.70,76,152.5,-160.0,160.0,160.0,97.5,102.5,107.5,107.5,165.0,175.0,182.5,182.5,450.0,SBD
4,Heaven Conner,,F,2004,20,USA,NV,Raw,FR-Jr,75.95,76,117.5,-125.0,125.0,125.0,70.0,-75.0,75.0,75.0,130.0,137.5,-147.5,137.5,337.5,SBD
1,Layla Taylor,,F,2001,23,USA,TX,Raw,FR-Jr,83.00,84,202.5,213.0,227.0,227.0,115.0,122.5,129.0,129.0,190.0,200.0,-210.0,200.0,556.0,SBD
2,Alexa-Briana Batchateu,,F,2001,23,USA,NY,Raw,FR-Jr,81.15,84,-182.5,187.5,192.5,192.5,75.0,80.0,85.0,85.0,205.0,-220.0,225.0,225.0,502.5,SBD
3,Antara Jackson,,F,2001,22,USA,NY,Raw,FR-Jr,83.00,84,165.0,172.5,175.0,175.0,107.5,115.0,117.5,117.5,195.0,205.0,-210.0,205.0,497.5,SBD
4,Natalie Smith #3,,F,2004,19,USA,NY,Raw,FR-Jr,84.00,84,130.0,147.5,155.0,155.0,77.5,82.5,85.0,85.0,155.0,165.0,170.0,170.0,410.0,SBD
5,Haley Beardin,,F,2003,21,USA,FL,Raw,FR-Jr,80.65,84,125.0,135.0,142.5,142.5,82.5,87.5,-90.0,87.5,157.5,172.5,-182.5,172.5,402.5,SBD
7,Mikayla VonLangen,,F,2005,19,USA,MT,Raw,FR-Jr,81.75,84,-100.0,105.0,115.0,115.0,67.5,72.5,77.5,77.5,100.0,110.0,115.0,115.0,307.5,SBD
DQ,Asha Hopkins,,F,2001,22,USA,TX,Raw,FR-Jr,83.75,84,-197.5,-202.5,-202.5,,112.5,120.0,125.0,125.0,192.5,210.0,220.0,220.0,,SBD
DQ,Amaya Wade,,F,2005,19,USA,KS,Raw,FR-Jr,107.04,84+,152.5,160.0,-167.5,160.0,-100.0,-100.0,-100.0,,182.5,-195.0,-195.0,182.5,,SBD
1,Cynthia Smith,,F,1983,41,USA,NC,Raw,FR-M1,46.65,47,-70.0,72.5,75.0,75.0,32.5,37.5,-45.0,37.5,70.0,75.0,80.0,80.0,192.5,SBD
1,Noelle Brigden,,F,1977,46,USA,WI,Raw,FR-M1,47.05,52,100.0,107.5,-112.5,107.5,67.5,72.5,75.0,75.0,130.0,137.5,-145.0,137.5,320.0,SBD
1,Erin Riddle,,F,1984,40,USA,AK,Raw,FR-M1,55.30,57,130.0,138.0,143.0,143.0,62.5,67.5,70.0,70.0,142.5,152.5,157.5,157.5,370.5,SBD
2,Astrid Girolamo,,F,1981,42,USA,NY,Raw,FR-M1,56.85,57,120.0,127.5,-130.0,127.5,70.0,75.0,77.5,77.5,145.0,155.0,-167.5,155.0,360.0,SBD
3,Kelly Tonini,,F,1981,42,USA,MA,Raw,FR-M1,55.90,57,107.5,117.5,-125.0,117.5,60.0,65.0,70.0,70.0,130.0,135.0,-140.0,135.0,322.5,SBD
4,Lindsay Shabansky,,F,1981,42,USA,CO,Raw,FR-M1,56.65,57,95.0,102.5,105.0,105.0,55.0,60.0,65.0,65.0,112.5,120.0,125.0,125.0,295.0,SBD
1,Jennifer Sauter,,F,1979,44,USA,NY,Raw,FR-M1,62.80,63,-145.0,145.0,150.0,150.0,72.5,77.5,80.0,80.0,162.5,172.5,177.5,177.5,407.5,SBD
2,Amy Mason,,F,1976,48,USA,NC,Raw,FR-M1,62.55,63,135.0,-142.5,142.5,142.5,72.5,75.0,77.5,77.5,162.5,-172.5,-182.5,162.5,382.5,SBD
3,Eleanor Gease,,F,1977,46,USA,DC,Raw,FR-M1,61.75,63,105.0,112.5,120.0,120.0,62.5,67.5,-72.5,67.5,120.0,-130.0,-132.5,120.0,307.5,SBD
4,Joyce Kuwae,,F,1977,46,USA,PA,Raw,FR-M1,59.55,63,85.0,90.0,95.0,95.0,47.5,50.0,52.5,52.5,105.0,112.5,120.0,120.0,267.5,SBD
DQ,Alexa Sperske,,F,1982,41,USA,CA,Raw,FR-M1,67.65,69,145.0,-152.5,152.5,152.5,72.5,75.0,77.5,77.5,180.0,190.0,-200.0,190.0,,SBD
1,Pamela Riley,,F,1976,48,USA,TX,Raw,FR-M1,66.85,69,110.0,117.5,122.5,122.5,65.0,70.0,-72.5,70.0,137.5,150.0,155.0,155.0,347.5,SBD
2,Joan Hon,,F,1979,44,USA,NY,Raw,FR-M1,67.20,69,110.0,117.5,125.0,125.0,65.0,70.0,72.5,72.5,137.5,145.0,150.0,150.0,347.5,SBD
4,Annette Morgan,,F,1977,46,USA,VA,Raw,FR-M1,66.50,69,92.5,-100.0,102.5,102.5,62.5,65.0,-70.0,65.0,132.5,140.0,145.0,145.0,312.5,SBD
5,Clair Crawford,,F,1979,44,USA,OH,Raw,FR-M1,68.40,69,102.5,110.0,-115.0,110.0,52.5,-55.0,55.0,55.0,115.0,-125.0,-125.0,115.0,280.0,SBD
6,Cherie Tan,,F,1980,43,USA,FL,Raw,FR-M1,68.05,69,70.0,80.0,82.5,82.5,30.0,35.0,37.5,37.5,75.0,85.0,90.0,90.0,210.0,SBD
2,Linette Bogdan,,F,1980,44,USA,NJ,Raw,FR-M1,75.75,76,140.0,150.0,157.5,157.5,87.5,92.5,-95.0,92.5,177.5,187.5,195.0,195.0,445.0,SBD
1,Chereny Woodard,,F,1981,42,USA,GA,Raw,FR-M1,80.45,84,-137.5,137.5,150.0,150.0,85.0,92.5,97.5,97.5,175.0,185.0,195.0,195.0,442.5,SBD
2,Elis Bradshaw,,F,1981,43,USA,MN,Raw,FR-M1,78.80,84,150.0,157.5,162.5,162.5,80.0,85.0,-90.0,85.0,165.0,175.0,180.0,180.0,427.5,SBD
3,Amy Hutchison,,F,1982,42,USA,NC,Raw,FR-M1,83.75,84,142.5,150.0,157.5,157.5,80.0,85.0,87.5,87.5,162.5,172.5,182.5,182.5,427.5,SBD
4,Rachael Dugan,,F,1982,41,USA,PA,Raw,FR-M1,77.80,84,92.5,97.5,102.5,102.5,65.0,70.0,-72.5,70.0,122.5,130.0,137.5,137.5,310.0,SBD
1,Melissa Copeland,,F,1977,46,USA,MD,Raw,FR-M1,120.25,84+,197.5,207.5,213.5,213.5,115.0,120.0,125.0,125.0,195.0,-205.0,205.0,205.0,543.5,SBD
2,Michelle Harrell,,F,1979,45,USA,AZ,Raw,FR-M1,107.15,84+,150.0,152.5,-155.0,152.5,95.0,97.5,-100.0,97.5,167.5,175.0,177.5,177.5,427.5,SBD
3,Rebecca Rutkoski,,F,1979,45,USA,PA,Raw,FR-M1,100.25,84+,155.0,162.5,167.5,167.5,77.5,80.0,-82.5,80.0,155.0,-165.0,-167.5,155.0,402.5,SBD
4,Diane Arthur,,F,1980,44,USA,NM,Raw,FR-M1,96.55,84+,117.5,125.0,132.5,132.5,80.0,85.0,90.0,90.0,157.5,167.5,-180.0,167.5,390.0,SBD
5,Nefertiti Borders,,F,1984,40,USA,MA,Raw,FR-M1,87.95,84+,132.5,137.5,142.5,142.5,67.5,72.5,-77.5,72.5,142.5,157.5,170.0,170.0,385.0,SBD
6,Erin Hall #2,,F,1980,44,USA,AZ,Raw,FR-M1,112.80,84+,112.5,120.0,122.5,122.5,60.0,65.0,-72.5,65.0,142.5,152.5,-162.5,152.5,340.0,SBD
2,Michelle Kane,,F,1974,49,USA,OH,Raw,FR-M2,82.95,84,135.0,145.0,152.5,152.5,97.5,105.5,108.5,108.5,155.0,165.0,172.5,172.5,433.5,SBD
1,Lisa Weiss #1,,F,1966,57,USA,OH,Raw,FR-M2,51.50,52,80.0,85.0,-87.5,85.0,52.5,57.5,-60.0,57.5,122.5,132.5,137.5,137.5,280.0,SBD
1,Suzanne Hartwig-Gary,,F,1968,55,USA,MT,Raw,FR-M2,55.75,57,127.5,135.0,-140.0,135.0,62.5,67.5,72.5,72.5,137.5,147.5,150.0,150.0,357.5,SBD
2,Donna Garofalo,,F,1970,53,USA,MI,Raw,FR-M2,56.15,57,75.0,80.0,90.0,90.0,47.5,52.5,55.0,55.0,110.0,120.0,130.0,130.0,275.0,SBD
1,Leah Cruciani,,F,1970,53,USA,PA,Raw,FR-M2,62.30,63,107.5,112.5,120.0,120.0,62.5,-67.5,-70.0,62.5,140.0,150.0,-157.5,150.0,332.5,SBD
G,Cathy Avery,,F,1969,54,USA,PA,Raw,FR-G,63.25,69,125.0,-132.5,-132.5,125.0,77.5,83.0,-84.0,83.0,140.0,150.0,-155.0,150.0,358.0,SBD
1,Roberta Carlson #1,,F,1965,59,USA,WA,Raw,FR-M2,67.35,69,127.5,135.0,140.0,140.0,65.0,70.0,72.5,72.5,167.5,177.5,182.5,182.5,395.0,SBD
2,Karen Kleyle,,F,1970,53,USA,MD,Raw,FR-M2,66.15,69,102.5,110.0,112.5,112.5,47.5,-52.5,-52.5,47.5,-127.5,132.5,140.0,140.0,300.0,SBD
1,Joah Iannotta,,F,1973,51,USA,PA,Raw,FR-M2,75.30,76,140.0,147.5,155.0,155.0,102.5,110.0,-115.0,110.0,180.0,190.0,197.5,197.5,462.5,SBD
1,Jackie Barone,,F,1964,59,USA,MI,Raw,FR-M3,70.70,76,60.0,65.0,70.0,70.0,40.0,45.0,-47.5,45.0,87.5,95.0,100.0,100.0,215.0,SBD
1,Siri Hoogen,,F,1974,50,USA,OR,Raw,FR-M2,83.15,84,145.0,155.0,160.0,160.0,87.5,92.5,95.0,95.0,-170.0,175.0,180.0,180.0,435.0,SBD
3,Stephanie Linder,,F,1972,52,USA,ID,Raw,FR-M2,82.00,84,137.5,147.5,-155.5,147.5,77.5,85.0,90.0,90.0,167.5,177.5,190.0,190.0,427.5,SBD
4,Lakhvir Sodhi-Gosal,,F,1971,53,USA,NV,Raw,FR-M2,83.85,84,145.0,150.0,155.0,155.0,70.0,77.5,-80.0,77.5,180.0,190.0,-205.0,190.0,422.5,SBD
5,Shari Langrall,,F,1971,52,USA,VA,Raw,FR-M2,83.60,84,115.0,122.5,130.0,130.0,72.5,77.5,-80.0,77.5,155.0,165.0,-175.0,165.0,372.5,SBD
6,Michal Harris,,F,1970,54,USA,FL,Raw,FR-M2,83.50,84,95.0,110.0,-115.0,110.0,47.5,55.0,57.5,57.5,130.0,142.5,-147.5,142.5,310.0,SBD
1,Patricia Johnson,,F,1970,53,USA,CA,Raw,FR-M2,101.55,84+,160.0,172.5,182.5,182.5,115.0,120.0,-122.5,120.0,205.0,217.5,227.5,227.5,530.0,SBD
2,Lilyan Jackson,,F,1970,54,USA,TX,Raw,FR-M2,168.05,84+,142.5,150.0,160.0,160.0,115.0,122.5,127.5,127.5,165.0,175.0,187.5,187.5,475.0,SBD
3,Heidi Meeley,,F,1966,57,USA,WA,Raw,FR-M2,101.85,84+,120.0,130.0,137.5,137.5,62.5,-67.5,70.0,70.0,130.0,142.5,152.5,152.5,360.0,SBD
1,Dora Justice,,F,1957,66,USA,TX,Raw,FR-M3,55.45,57,70.0,75.0,77.5,77.5,62.5,65.0,67.5,67.5,97.5,105.0,110.0,110.0,255.0,SBD
1,Lynne Homan,,F,1962,61,USA,SC,Raw,FR-M3,57.85,63,70.0,75.0,77.5,77.5,55.0,57.5,60.0,60.0,107.5,112.5,117.5,117.5,255.0,SBD
2,Loraine Efron,,F,1963,60,USA,TX,Raw,FR-M3,58.50,63,82.5,-87.5,-87.5,82.5,45.0,47.5,-50.0,47.5,95.0,100.0,-105.0,100.0,230.0,SBD
1,Jessica Marshall #1,,F,1963,60,USA,NY,Raw,FR-M3,65.60,69,110.0,118.0,123.0,123.0,52.5,57.5,62.5,62.5,150.0,160.0,167.5,167.5,353.0,SBD
2,Tina Weber,,F,1956,68,USA,FL,Raw,FR-M3,67.75,69,102.5,107.5,112.5,112.5,62.5,-65.0,-65.0,62.5,117.5,125.0,130.0,130.0,305.0,SBD
3,Susan Gibson,,F,1961,62,USA,NV,Raw,FR-M3,66.80,69,80.0,87.5,97.5,97.5,57.5,62.5,-65.0,62.5,120.0,130.0,-137.5,130.0,290.0,SBD
1,Alma Kimura,,F,1954,69,USA,WA,Raw,FR-M4,67.45,69,105.5,110.5,113.0,113.0,47.5,52.5,-55.0,52.5,132.5,140.5,-148.0,140.5,306.0,SBD
1,Vicki Brackett,,F,1957,66,USA,GA,Raw,FR-M3,126.70,84+,110.0,120.0,-130.0,120.0,75.0,-80.5,-80.5,75.0,155.0,162.5,-167.5,162.5,357.5,SBD
2,Barbara Beaudin,,F,1961,62,USA,NH,Raw,FR-M3,89.35,84+,97.5,105.0,115.0,115.0,57.5,60.0,62.5,62.5,137.5,147.5,152.5,152.5,330.0,SBD
1,Denise Johnson,,F,1947,76,USA,WA,Raw,FR-M4,50.30,52,32.5,35.0,37.5,37.5,27.5,30.0,32.5,32.5,70.0,75.0,77.5,77.5,147.5,SBD
1,Nancy Sassaman,,F,1948,76,USA,CA,Raw,FR-M4,55.00,57,35.0,45.0,57.5,57.5,25.0,32.5,-35.0,32.5,75.0,90.0,97.5,97.5,187.5,SBD
2,Gale Williams,,F,1947,76,USA,GA,Raw,FR-M4,67.45,69,82.5,90.0,92.5,92.5,55.0,60.0,62.5,62.5,117.5,127.5,130.0,130.0,285.0,SBD
1,Linda Gorham,,F,1951,72,USA,MD,Raw,FR-M4,99.25,84+,100.0,105.0,112.5,112.5,62.5,67.5,70.0,70.0,120.0,127.5,-140.0,127.5,310.0,SBD
3,Katie Achille,,F,1984,39,USA,NJ,Raw,FR-M1,67.65,69,115.0,122.5,-127.5,122.5,67.5,72.5,75.0,75.0,130.0,140.0,147.5,147.5,345.0,SBD
1,Esther Scott,,F,1984,39,USA,VA,Raw,FR-M1,75.70,76,165.0,175.0,-180.0,175.0,90.0,95.0,97.5,97.5,177.5,-187.5,187.5,187.5,460.0,SBD
1,Lauren Jansen,,F,2006,17,USA,WI,Raw,FR-Sj,52.00,52,115.0,120.0,-127.5,120.0,60.0,62.5,-65.0,62.5,125.0,135.0,-140.0,135.0,317.5,SBD
2,Katelyn Plourde,,F,2008,16,USA,MA,Raw,FR-Sj,51.95,52,90.0,97.5,102.5,102.5,65.0,-70.0,70.0,70.0,120.0,127.5,-130.0,127.5,300.0,SBD
3,Trinity Klingler,,F,2006,18,USA,AZ,Raw,FR-Sj,51.35,52,85.0,90.0,97.5,97.5,47.5,-52.5,-52.5,47.5,100.0,-105.0,105.0,105.0,250.0,SBD
1,Octavia Hill,,F,2005,18,USA,OK,Raw,FR-Jr,55.35,57,125.0,132.5,137.5,137.5,72.5,-75.0,,72.5,160.0,170.0,-177.5,170.0,380.0,SBD
1,Eleni Guerrera,,F,2006,18,USA,VA,Raw,FR-Sj,55.65,57,-140.0,140.0,147.5,147.5,-77.5,77.5,82.5,82.5,173.0,183.0,-188.0,183.0,413.0,SBD
2,Lily Nguyen,,F,2006,18,USA,IA,Raw,FR-Sj,55.60,57,127.5,137.5,142.5,142.5,65.0,72.5,-77.5,72.5,150.0,160.0,-175.0,160.0,375.0,SBD
3,Isabella Gregory,,F,2006,17,USA,NV,Raw,FR-Sj,54.70,57,105.0,-110.0,-110.0,105.0,70.0,75.0,-77.5,75.0,120.0,127.5,-135.0,127.5,307.5,SBD
4,Jaden Corpuz,,F,2008,15,USA,NC,Raw,FR-Sj,55.35,57,110.0,-115.0,-120.0,110.0,45.0,47.5,52.5,52.5,120.0,127.5,-132.5,127.5,290.0,SBD
5,Laynie Buli,,F,2006,18,USA,PA,Raw,FR-Sj,56.05,57,77.5,-82.5,85.0,85.0,47.5,50.0,55.0,55.0,112.5,117.5,122.5,122.5,262.5,SBD
1,Barbara Lopez,,F,2006,18,USA,TX,Raw,FR-Sj,61.65,63,-152.5,-157.5,157.5,157.5,70.0,72.5,-75.0,72.5,147.5,157.5,-165.0,157.5,387.5,SBD
1,Stella Tintari,,F,2006,17,USA,IN,Raw,FR-Sj,68.55,69,150.0,-160.5,163.0,163.0,80.0,85.0,90.0,90.0,140.0,150.0,155.0,155.0,408.0,SBD
2,Jae Anna Spears,,F,2008,15,USA,MS,Raw,FR-Sj,67.70,69,85.0,92.5,97.5,97.5,45.0,-50.0,-50.0,45.0,105.0,-110.0,-110.0,105.0,247.5,SBD
2,Lily Rubenstein,,F,2005,18,USA,FL,Raw,FR-Jr,74.35,76,145.0,150.0,152.5,152.5,90.0,95.0,100.0,100.0,160.0,167.5,-175.0,167.5,420.0,SBD
3,Sarah Rogers #2,,F,2005,18,USA,GA,Raw,FR-Jr,75.00,76,125.0,132.5,135.0,135.0,57.5,62.5,65.0,65.0,132.5,140.0,-145.0,140.0,340.0,SBD
1,Esperanza Delgado #2,,F,2006,18,USA,FL,Raw,FR-Sj,75.40,76,182.5,192.5,195.0,195.0,92.5,100.0,105.0,105.0,177.5,187.5,192.5,192.5,492.5,SBD
2,Kaelyn McCann,,F,2006,17,USA,NC,Raw,FR-Sj,73.90,76,140.0,150.0,155.0,155.0,82.5,90.0,95.0,95.0,177.5,-187.5,-187.5,177.5,427.5,SBD
6,Rachel Olshansky,,F,2005,18,USA,IL,Raw,FR-Jr,83.85,84,130.0,-137.5,137.5,137.5,67.5,70.0,72.5,72.5,147.5,155.0,157.5,157.5,367.5,SBD
1,Chealsea Enemor,,F,2005,18,USA,FL,Raw,FR-Jr,113.65,84+,182.5,192.5,202.5,202.5,-112.5,112.5,,112.5,170.0,,,170.0,485.0,SBD
1,Shanti Khalsa,,F,2006,17,USA,NM,Raw,FR-Sj,93.00,84+,150.0,160.0,167.5,167.5,65.0,70.0,-75.0,70.0,142.5,152.5,-165.0,152.5,390.0,SBD
2,Saige Back,,F,2008,16,USA,NY,Raw,FR-Sj,102.15,84+,90.0,100.0,107.5,107.5,60.0,65.0,67.5,67.5,102.5,110.0,115.0,115.0,290.0,SBD
1,Justin Chapa,,M,2005,19,USA,TX,Raw,MR-Jr,52.15,53,160.0,175.0,-180.5,175.0,-120.0,122.5,-130.0,122.5,207.5,-227.5,227.5,227.5,525.0,SBD
2,Travis Browning,,M,2004,19,USA,NY,Raw,MR-Jr,52.65,53,135.0,140.0,147.5,147.5,105.0,-112.5,112.5,112.5,165.0,175.0,185.0,185.0,445.0,SBD
1,Bodie LaCoe,,M,2003,21,USA,PA,Raw,MR-Jr,58.15,59,182.5,190.0,197.5,197.5,105.0,110.0,112.5,112.5,250.0,267.5,275.0,275.0,585.0,SBD
2,Peter Vong,,M,2005,19,USA,WA,Raw,MR-Jr,58.40,59,172.5,190.0,200.0,200.0,97.5,105.0,110.0,110.0,210.0,230.0,245.0,245.0,555.0,SBD
3,Scott Silva #2,,M,2002,21,USA,MI,Raw,MR-Jr,58.15,59,182.5,-187.5,-187.5,182.5,117.5,-125.0,125.0,125.0,192.5,205.0,215.0,215.0,522.5,SBD
4,Tylor Reed Fuenger,,M,2005,19,USA,WI,Raw,MR-Jr,58.95,59,175.0,185.0,-192.5,185.0,115.0,-122.5,122.5,122.5,185.0,-200.0,-202.5,185.0,492.5,SBD
5,Justin Noller,,M,2005,19,USA,GA,Raw,MR-Jr,59.00,59,165.0,175.0,-182.5,175.0,85.0,90.0,92.5,92.5,190.0,-200.0,-200.0,190.0,457.5,SBD
6,Khalil Johnson,,M,2002,21,USA,IN,Raw,MR-Jr,57.75,59,165.0,172.5,-177.5,172.5,90.0,92.5,97.5,97.5,167.5,177.5,185.0,185.0,455.0,SBD
1,Austin Nikolai,,M,2003,20,USA,WI,Raw,MR-Jr,65.30,66,237.5,250.0,258.0,258.0,132.5,140.0,142.5,142.5,275.0,290.0,-305.0,290.0,690.5,SBD
2,Miguel Jimenez,,M,2002,22,USA,NJ,Raw,MR-Jr,65.35,66,205.0,-217.5,225.0,225.0,142.5,152.5,-155.0,152.5,-227.5,237.5,250.0,250.0,627.5,SBD
3,Asante Gordon,,M,2003,20,USA,IA,Raw,MR-Jr,65.95,66,-195.0,207.5,-217.5,207.5,125.0,132.5,-137.5,132.5,252.5,267.5,-290.0,267.5,607.5,SBD
4,Isaac Estrada #1,,M,2002,21,USA,TX,Raw,MR-Jr,65.80,66,195.0,207.5,210.0,210.0,140.0,145.0,147.5,147.5,240.0,-247.5,-257.5,240.0,597.5,SBD
5,Collin Murillo,,M,2003,20,USA,CT,Raw,MR-Jr,65.70,66,200.0,210.0,-220.0,210.0,110.0,115.0,-117.5,115.0,245.0,260.0,-272.5,260.0,585.0,SBD
8,Samuel Zipp,,M,2005,19,USA,TX,Raw,MR-Jr,62.80,66,-157.5,-165.0,165.0,165.0,110.0,-117.5,-117.5,110.0,-187.5,195.0,-205.0,195.0,470.0,SBD
1,Tony Nguyen #1,,M,2001,23,USA,TX,Raw,MR-Jr,73.65,74,235.0,250.0,255.0,255.0,155.0,162.5,167.5,167.5,280.0,297.5,305.5,305.5,728.0,SBD
2,Matt Foddrill,,M,2002,21,USA,MI,Raw,MR-Jr,73.90,74,227.5,-242.5,250.0,250.0,162.5,-170.0,175.0,175.0,267.5,287.5,-300.0,287.5,712.5,SBD
3,Kane Madison,,M,2002,22,USA,MN,Raw,MR-Jr,72.20,74,215.0,227.5,235.0,235.0,157.5,162.5,170.0,170.0,277.5,287.5,-300.0,287.5,692.5,SBD
4,Michael Sysavan,,M,2004,19,USA,WI,Raw,MR-Jr,73.65,74,235.0,250.0,-260.0,250.0,152.5,162.5,167.5,167.5,252.5,270.0,-287.5,270.0,687.5,SBD
5,Noah Robinson,,M,2003,21,USA,UT,Raw,MR-Jr,73.65,74,225.0,237.5,-250.0,237.5,152.5,157.5,-160.0,157.5,260.0,275.0,-282.5,275.0,670.0,SBD
6,Jacob Dayan,,M,2001,22,USA,FL,Raw,MR-Jr,70.90,74,217.5,232.5,240.0,240.0,130.0,140.0,-145.0,140.0,242.5,260.0,-270.0,260.0,640.0,SBD
7,Jacob Park,,M,2004,20,USA,FL,Raw,MR-Jr,73.85,74,190.0,205.0,-210.0,205.0,132.5,140.0,-142.5,140.0,262.5,-275.0,275.0,275.0,620.0,SBD
8,Nabeel Rifai,,M,2005,19,USA,PA,Raw,MR-Jr,72.80,74,185.0,197.5,205.0,205.0,125.0,130.0,132.5,132.5,-262.5,262.5,-265.0,262.5,600.0,SBD
10,Adan Barajas,,M,2003,21,USA,CA,Raw,MR-Jr,73.65,74,190.0,205.0,215.0,215.0,137.5,145.0,150.0,150.0,200.0,220.0,-235.0,220.0,585.0,SBD
11,Sam Rosenberg #2,,M,2004,19,USA,CO,Raw,MR-Jr,72.80,74,182.5,195.0,-202.5,195.0,100.0,107.5,112.5,112.5,222.5,237.5,252.5,252.5,560.0,SBD
12,David Rivera #6,,M,2004,19,USA,IL,Raw,MR-Jr,70.20,74,180.0,187.5,-192.5,187.5,-107.5,-112.5,112.5,112.5,195.0,210.0,227.5,227.5,527.5,SBD
13,Jared Wacker,,M,2003,21,USA,UT,Raw,MR-Jr,73.10,74,170.0,185.0,192.5,192.5,110.0,120.0,-125.0,120.0,200.0,-215.0,-215.0,200.0,512.5,SBD
14,Cristopher Caceres,,M,2004,19,USA,LA,Raw,MR-Jr,73.10,74,175.0,190.0,-197.5,190.0,105.0,115.0,-120.0,115.0,180.0,-197.5,197.5,197.5,502.5,SBD
15,Kelson Long,,M,2003,20,USA,NV,Raw,MR-Jr,73.25,74,185.0,-190.0,190.0,190.0,102.5,-107.5,-107.5,102.5,202.5,207.5,-217.5,207.5,500.0,SBD
16,Cameron Quesea,,M,2002,21,USA,OH,Raw,MR-Jr,73.30,74,160.0,170.0,-175.0,170.0,92.5,97.5,102.5,102.5,182.5,190.0,195.0,195.0,467.5,SBD
17,Gabriel Dimonde,,M,2001,22,USA,LA,Raw,MR-Jr,72.45,74,25.0,-27.5,-27.5,25.0,115.0,122.5,-127.5,122.5,75.0,-77.5,-77.5,75.0,222.5,SBD
1,Tony Hinson,,M,2001,23,USA,GA,Raw,MR-Jr,81.1,83,250.0,265.0,275.0,275.0,140.0,147.5,155.0,155.0,285.0,305.0,316.0,316.0,746.0,SBD
2,Alex Sydor,,M,2002,21,USA,NY,Raw,MR-Jr,82.8,83,255.0,267.5,-275.0,267.5,152.5,160.0,162.5,162.5,285.0,300.0,-310.0,300.0,730.0,SBD
4,Nicolas Gaines,,M,2005,19,USA,FL,Raw,MR-Jr,80.1,83,227.5,237.5,245.0,245.0,140.0,147.5,-152.5,147.5,260.0,275.0,287.5,287.5,680.0,SBD
5,Kindley Dill,,M,2004,20,USA,SC,Raw,MR-Jr,82.1,83,255.0,265.0,275.0,275.0,142.5,-150.0,150.0,150.0,230.0,240.0,255.0,255.0,680.0,SBD
6,Pranav Sathiyajith,,M,2001,23,USA,TX,Raw,MR-Jr,82.8,83,232.5,247.5,-255.0,247.5,150.0,160.0,170.0,170.0,250.0,260.0,-267.5,260.0,677.5,SBD
7,Dean Ippolito,,M,2003,20,USA,NJ,Raw,MR-Jr,82.8,83,205.0,217.5,230.0,230.0,125.0,140.0,150.0,150.0,265.0,290.0,-305.0,290.0,670.0,SBD
8,Krsna Vigliotti,,M,2003,21,USA,OH,Raw,MR-Jr,82.2,83,227.5,245.0,-250.0,245.0,147.5,155.0,160.0,160.0,225.0,245.0,-260.0,245.0,650.0,SBD
9,Greg Jones #8,,M,2004,19,USA,NY,Raw,MR-Jr,81.8,83,215.0,222.5,-232.5,222.5,125.0,-130.0,130.0,130.0,215.0,227.5,-232.5,227.5,580.0,SBD
11,Joseph Borenstein,,M,2002,21,USA,FL,Raw,MR-Jr,82.2,83,267.5,-285.0,-295.0,267.5,192.5,203.0,-210.5,203.0,65.0,,,65.0,535.5,SBD
G,Ian Macena,,M,2001,22,USA,FL,Raw,MR-G,89.4,93,287.5,-290.0,,287.5,177.5,187.5,-195.0,187.5,290.0,312.5,325.0,325.0,800.0,SBD
1,Brandon Jones #17,,M,2002,22,USA,SC,Raw,MR-Jr,92.5,93,285.0,302.5,307.5,307.5,192.5,200.0,205.0,205.0,282.5,305.0,320.0,320.0,832.5,SBD
2,Aidan Roeder,,M,2001,22,USA,IL,Raw,MR-Jr,92.5,93,275.0,-295.0,315.0,315.0,160.0,170.0,175.0,175.0,300.0,325.0,-345.0,325.0,815.0,SBD
3,Dylan Turner #1,,M,2003,20,USA,FL,Raw,MR-Jr,92.2,93,285.0,297.5,306.0,306.0,170.0,182.5,190.0,190.0,285.0,295.0,-305.0,295.0,791.0,SBD
4,Ethan Marshall,,M,2003,20,USA,VA,Raw,MR-Jr,91.6,93,260.0,280.0,285.0,285.0,200.0,211.0,216.5,216.5,260.0,280.0,-290.0,280.0,781.5,SBD
5,Xavier Wiemken,,M,2002,21,USA,OH,Raw,MR-Jr,92.5,93,257.5,277.5,-290.0,277.5,167.5,180.0,-185.0,180.0,275.0,295.0,-320.0,295.0,752.5,SBD
6,Max Heller,,M,2003,21,USA,NJ,Raw,MR-Jr,91.0,93,260.0,275.0,280.0,280.0,160.0,170.0,175.0,175.0,265.0,282.5,-295.0,282.5,737.5,SBD
7,Cameron Klaudt,,M,2002,21,USA,AZ,Raw,MR-Jr,92.9,93,255.0,270.0,280.0,280.0,137.5,142.5,147.5,147.5,275.0,290.0,-300.0,290.0,717.5,SBD
8,Erick Severino,,M,2003,20,USA,GA,Raw,MR-Jr,92.7,93,-250.0,250.0,-262.5,250.0,140.0,150.0,-157.5,150.0,265.0,280.0,-290.0,280.0,680.0,SBD
9,Nahuel Peralta,,M,2004,19,USA,GA,Raw,MR-Jr,92.1,93,220.0,235.0,247.5,247.5,130.0,140.0,-142.5,140.0,245.0,270.0,-295.0,270.0,657.5,SBD
10,Anders Kalvenes,,M,2002,21,USA,IL,Raw,MR-Jr,88.0,93,235.0,-245.0,245.0,245.0,-112.5,112.5,125.0,125.0,240.0,260.0,275.0,275.0,645.0,SBD
12,Cole Ivarson,,M,2005,18,USA,WI,Raw,MR-Jr,92.5,93,207.5,220.0,225.0,225.0,130.0,137.5,142.5,142.5,222.5,235.0,242.5,242.5,610.0,SBD
14,Reese Conners,,M,2002,21,USA,NY,Raw,MR-Jr,92.1,93,205.0,217.5,225.0,225.0,120.0,127.5,132.5,132.5,227.5,240.0,-245.0,240.0,597.5,SBD
15,Riley Sumrall,,M,2002,22,USA,LA,Raw,MR-Jr,86.4,93,207.5,217.5,227.5,227.5,125.0,135.0,137.5,137.5,175.0,,,175.0,540.0,SBD
16,Luis Trujillo,,M,2002,21,USA,TX,Raw,MR-Jr,92.8,93,260.0,277.5,,277.5,147.5,167.5,175.0,175.0,70.0,,,70.0,522.5,SBD
1,Grant Ivarson,,M,2002,22,USA,WI,Raw,MR-Jr,103.5,105,-270.0,275.0,282.5,282.5,195.0,202.5,-205.0,202.5,290.0,307.5,315.0,315.0,800.0,SBD
2,Connor Parks,,M,2001,22,USA,MO,Raw,MR-Jr,104.5,105,270.0,-300.0,305.0,305.0,170.0,187.5,-197.5,187.5,275.0,300.0,-325.0,300.0,792.5,SBD
3,Josiah Richardson,,M,2002,22,USA,WI,Raw,MR-Jr,100.9,105,252.5,267.5,272.5,272.5,-172.5,177.5,182.5,182.5,310.0,327.5,-337.5,327.5,782.5,SBD
4,Malachi Beltran,,M,2002,22,USA,CA,Raw,MR-Jr,104.9,105,302.5,320.0,327.5,327.5,147.5,155.0,160.0,160.0,285.0,-292.5,-297.5,285.0,772.5,SBD
5,Cassius Ramirez,,M,2001,22,USA,WI,Raw,MR-Jr,101.6,105,245.0,262.5,275.0,275.0,165.0,172.5,-180.0,172.5,282.5,302.5,-325.0,302.5,750.0,SBD
6,Evan Gonsorcik,,M,2003,21,USA,MA,Raw,MR-Jr,93.1,105,232.5,247.5,-260.0,247.5,155.0,162.5,170.0,170.0,295.0,312.5,-327.5,312.5,730.0,SBD
7,Gilberto Villarreal Muñoz,,M,2003,20,USA,CA,Raw,MR-Jr,104.7,105,252.5,262.5,265.0,265.0,162.5,165.0,-167.5,165.0,260.0,270.0,275.0,275.0,705.0,SBD
8,Don Kline,,M,2005,19,USA,PA,Raw,MR-Jr,101.9,105,255.0,267.5,-275.0,267.5,125.0,-135.0,140.0,140.0,267.5,285.0,-295.0,285.0,692.5,SBD
9,Adam Overby,,M,2004,19,USA,SD,Raw,MR-Jr,104.0,105,240.0,257.5,262.5,262.5,152.5,160.0,165.0,165.0,237.5,255.0,262.5,262.5,690.0,SBD
10,Koleade Awoyele,,M,2001,23,USA,TX,Raw,MR-Jr,104.8,105,227.5,-240.0,245.0,245.0,140.0,150.0,-157.5,150.0,267.5,282.5,292.5,292.5,687.5,SBD
11,E.J. Chikando,,M,2004,19,USA,AZ,Raw,MR-Jr,96.0,105,215.0,235.0,-245.0,235.0,150.0,157.5,162.5,162.5,255.0,272.5,-277.5,272.5,670.0,SBD
12,Alex Lynch #2,,M,2003,21,USA,MI,Raw,MR-Jr,98.3,105,195.0,205.0,210.0,210.0,115.0,130.0,-135.0,130.0,210.0,220.0,225.0,225.0,565.0,SBD
13,Kane Kolar,,M,2003,20,USA,TX,Raw,MR-Jr,100.8,105,187.5,-197.5,200.0,200.0,140.0,150.0,-157.5,150.0,200.0,210.0,-227.5,210.0,560.0,SBD
DQ,Caleb Jones,,M,2003,21,USA,AZ,Raw,MR-Jr,103.7,105,310.0,320.0,-322.5,320.0,180.0,187.5,-195.0,187.5,-320.0,-320.0,-320.0,,,SBD
1,Jayden Edwards,,M,2001,22,USA,OH,Raw,MR-Jr,116.2,120,300.0,325.0,345.0,345.0,177.5,190.0,200.0,200.0,310.0,340.0,365.0,365.0,910.0,SBD
2,Dante DeLeon,,M,2004,20,USA,TX,Raw,MR-Jr,120.0,120,340.0,360.0,370.5,370.5,215.0,225.5,233.0,233.0,275.0,290.0,295.0,295.0,898.5,SBD
3,Sean Mills #1,,M,2001,22,USA,TX,Raw,MR-Jr,118.0,120,307.5,330.0,342.5,342.5,192.5,200.0,-202.5,200.0,310.0,340.0,-368.0,340.0,882.5,SBD
4,Timothy Whang,,M,2001,23,USA,CA,Raw,MR-Jr,119.0,120,295.0,307.5,-317.5,307.5,205.0,215.5,-220.0,215.5,290.0,305.0,320.0,320.0,843.0,SBD
5,Jacob Breckinridge,,M,2005,19,USA,PA,Raw,MR-Jr,118.9,120,300.0,320.0,330.0,330.0,-150.0,155.0,-162.5,155.0,295.0,315.0,322.5,322.5,807.5,SBD
6,RaQuan Lowery,,M,2001,23,USA,OH,Raw,MR-Jr,117.1,120,275.0,282.5,-290.0,282.5,182.5,192.5,-197.5,192.5,275.0,282.5,-290.0,282.5,757.5,SBD
7,Atticus Campbell,,M,2005,19,USA,LA,Raw,MR-Jr,114.9,120,237.5,257.5,272.5,272.5,140.0,150.0,155.0,155.0,-260.0,275.0,297.5,297.5,725.0,SBD
8,Raynard Raeburn,,M,2001,22,USA,NY,Raw,MR-Jr,106.9,120,202.5,220.0,242.5,242.5,177.5,182.5,205.0,205.0,235.0,260.0,-290.0,260.0,707.5,SBD
9,Bailey Mckenzie,,M,2001,22,USA,TX,Raw,MR-Jr,106.5,120,252.5,267.5,272.5,272.5,127.5,-137.5,-142.5,127.5,250.0,262.5,272.5,272.5,672.5,SBD
10,Vince Reodica,,M,2003,20,USA,TX,Raw,MR-Jr,114.3,120,225.0,-240.0,-240.0,225.0,125.0,135.0,-142.5,135.0,200.0,,,200.0,560.0,SBD
1,Trey Forrest,,M,2004,20,USA,OK,Raw,MR-Jr,169.0,120+,332.5,350.0,365.0,365.0,-172.5,180.0,187.5,187.5,255.0,265.0,282.5,282.5,835.0,SBD
2,Drew Carrithers,,M,2001,22,USA,KY,Raw,MR-Jr,165.3,120+,270.0,287.5,300.0,300.0,195.0,205.0,-212.5,205.0,255.0,272.5,282.5,282.5,787.5,SBD
3,Anthony Bryarly,,M,2003,21,USA,OH,Raw,MR-Jr,130.3,120+,265.0,280.0,290.0,290.0,170.0,180.0,-187.5,180.0,272.5,-290.0,-302.5,272.5,742.5,SBD
4,Ryan Newton-White,,M,2004,19,USA,NC,Raw,MR-Jr,140.6,120+,252.5,265.0,282.5,282.5,160.0,172.5,-185.0,172.5,250.0,260.0,-272.5,260.0,715.0,SBD
5,Gabriel Herschman,,M,2002,21,USA,PA,Raw,MR-Jr,130.4,120+,227.5,242.5,257.5,257.5,157.5,162.5,167.5,167.5,227.5,242.5,-267.5,242.5,667.5,SBD
1,Tuan Nguyen #1,,M,1981,42,USA,PA,Raw,MR-M1,65.5,66,177.5,187.5,195.0,195.0,110.0,115.0,117.5,117.5,207.5,217.5,227.5,227.5,540.0,SBD
2,Huaiyu Tan,,M,1977,47,USA,FL,Raw,MR-M1,65.7,66,160.0,170.0,-172.5,170.0,100.0,105.0,-107.5,105.0,210.0,222.5,225.0,225.0,500.0,SBD
3,Ron Brinker,,M,1975,49,USA,OH,Raw,MR-M1,64.7,66,167.5,177.5,182.5,182.5,100.0,107.5,110.0,110.0,190.0,205.0,-210.0,205.0,497.5,SBD
1,Michael Haran,,M,1982,41,USA,MD,Raw,MR-M1,73.4,74,-235.0,235.0,-250.0,235.0,140.0,147.5,150.0,150.0,230.0,245.0,-255.0,245.0,630.0,SBD
1,Ross Leppala,,M,1984,40,USA,GA,Raw,MR-M1,82.8,83,250.0,266.5,-271.5,266.5,172.5,182.5,187.5,187.5,265.0,280.0,293.0,293.0,747.0,SBD
2,Todd Straub,,M,1979,44,USA,OH,Raw,MR-M1,82.8,83,220.0,232.5,240.0,240.0,-170.0,170.0,177.5,177.5,267.5,-282.5,296.5,296.5,714.0,SBD
3,Jonathan Losa,,M,1982,42,USA,FL,Raw,MR-M1,82.4,83,230.0,242.5,252.5,252.5,182.5,192.5,201.0,201.0,230.0,245.0,260.0,260.0,713.5,SBD
5,Anthony Perkins #1,,M,1978,45,USA,TX,Raw,MR-M1,80.3,83,225.0,240.0,-245.0,240.0,140.0,142.5,-145.0,142.5,240.0,260.0,-267.5,260.0,642.5,SBD
6,Ben Chu #1,,M,1984,40,USA,GA,Raw,MR-M1,80.7,83,190.0,205.0,207.5,207.5,112.5,122.5,130.0,130.0,220.0,237.5,-245.0,237.5,575.0,SBD
7,Jonathan Hebreo,,M,1979,45,USA,CA,Raw,MR-M1,82.6,83,180.0,190.0,192.5,192.5,137.5,142.5,147.5,147.5,220.0,230.0,-232.5,230.0,570.0,SBD
1,Layne Norton,,M,1981,42,USA,FL,Raw,MR-M1,92.5,93,270.0,285.0,292.5,292.5,155.0,165.0,170.0,170.0,295.0,312.5,325.5,325.5,788.0,SBD
2,Michael Reed #4,,M,1982,42,USA,OH,Raw,MR-M1,91.4,93,245.0,-255.0,-255.0,245.0,157.5,160.0,162.5,162.5,250.0,257.5,262.5,262.5,670.0,SBD
3,Jeremiah Cruz,,M,1977,46,USA,MD,Raw,MR-M1,89.4,93,175.0,182.5,192.5,192.5,100.0,107.5,110.0,110.0,182.5,192.5,-202.5,192.5,495.0,SBD
4,Da Sul Kim,,M,1984,40,USA,GA,Raw,MR-M1,89.4,93,132.5,145.0,-150.0,145.0,107.5,115.0,120.0,120.0,162.5,170.0,175.0,175.0,440.0,SBD
1,Carlos Santoliquido,,M,1978,45,USA,NM,Raw,MR-M1,104.4,105,292.5,-300.0,307.5,307.5,170.0,177.5,182.5,182.5,302.5,327.5,335.0,335.0,825.0,SBD
2,Michael Garozzo,,M,1982,41,USA,NY,Raw,MR-M1,104.5,105,-290.0,290.0,305.0,305.0,162.5,170.0,172.5,172.5,300.0,325.0,-340.5,325.0,802.5,SBD
3,Eric Taylor #2,,M,1983,41,USA,TX,Raw,MR-M1,98.7,105,187.5,202.5,212.5,212.5,145.0,152.5,160.0,160.0,255.0,267.5,280.0,280.0,652.5,SBD
1,Nathan Gorham,,M,1977,47,USA,MD,Raw,MR-M1,118.7,120,300.0,320.0,-335.0,320.0,195.0,207.5,-227.5,207.5,275.0,-300.0,-300.0,275.0,802.5,SBD
2,Timothy Mercer,,M,1979,44,USA,WA,Raw,MR-M1,113.2,120,240.0,250.0,262.5,262.5,170.0,177.5,182.5,182.5,255.0,280.0,290.0,290.0,735.0,SBD
3,Ryan Donnelly,,M,1982,41,USA,NJ,Raw,MR-M1,113.4,120,200.0,225.0,245.0,245.0,177.5,190.0,200.0,200.0,245.0,267.5,-292.5,267.5,712.5,SBD
1,Rob Ward #1,,M,1980,44,USA,NY,Raw,MR-M1,149.9,120+,305.0,325.0,338.0,338.0,172.5,182.5,190.0,190.0,280.0,-300.0,300.0,300.0,828.0,SBD
2,James Farrior,,M,1983,40,USA,NY,Raw,MR-M1,155.3,120+,282.5,292.5,-300.0,292.5,205.0,215.0,222.5,222.5,282.5,295.0,302.5,302.5,817.5,SBD
3,Michael Jean Sr,,M,1979,45,USA,FL,Raw,MR-M1,165.0,120+,250.0,265.0,280.0,280.0,175.0,187.5,195.0,195.0,270.0,285.0,297.5,297.5,772.5,SBD
4,Michael Andrieu,,M,1981,43,USA,NJ,Raw,MR-M1,146.0,120+,270.0,285.0,-292.5,285.0,157.5,167.5,175.0,175.0,277.5,295.0,-312.5,295.0,755.0,SBD
5,Tim Brockett,,M,1984,40,USA,TN,Raw,MR-M1,132.6,120+,205.0,225.0,-240.0,225.0,155.0,-165.0,-170.0,155.0,240.0,255.0,265.0,265.0,645.0,SBD
6,Alex Crooks,,M,1980,43,USA,GA,Raw,MR-M1,135.9,120+,175.0,-185.0,-185.0,175.0,100.0,105.0,-110.0,105.0,190.0,205.0,-220.0,205.0,485.0,SBD
1,Charles Van Valkenburgh,,M,1974,49,USA,TN,Raw,MR-M2,118.3,120,242.5,262.5,272.5,272.5,175.0,-185.0,-185.0,175.0,255.0,275.0,282.5,282.5,730.0,SBD
1,Eric Kupperstein,,M,1966,58,USA,MA,Raw,MR-M2,58.5,59,-115.0,115.0,,115.0,40.0,45.0,50.0,50.0,145.0,,,145.0,310.0,SBD
1,Rick Brink,,M,1969,54,USA,CO,Raw,MR-M2,65.7,66,177.5,182.5,188.0,188.0,102.5,-107.5,-107.5,102.5,205.0,217.5,228.0,228.0,518.5,SBD
1,Robert Lane #1,,M,1971,52,USA,WA,Raw,MR-M2,73.6,74,187.5,200.0,205.0,205.0,127.5,135.0,137.5,137.5,247.5,260.0,-267.5,260.0,602.5,SBD
2,Thomas Ashbrook,,M,1964,59,USA,CA,Raw,MR-M3,73.9,74,162.5,170.0,175.0,175.0,110.0,115.0,117.5,117.5,180.0,192.5,-197.5,192.5,485.0,SBD
1,Thaddeus Say,,M,1972,51,USA,MD,Raw,MR-M2,81.6,83,175.0,185.0,192.5,192.5,122.5,127.5,-132.5,127.5,220.0,232.5,240.0,240.0,560.0,SBD
2,John Demchak,,M,1967,56,USA,SC,Raw,MR-M2,82.4,83,175.0,185.0,192.5,192.5,87.5,95.0,100.0,100.0,225.0,235.0,-242.5,235.0,527.5,SBD
3,Jensen Monterrey,,M,1973,51,USA,CA,Raw,MR-M2,82.9,83,100.0,135.0,-150.0,135.0,67.5,80.0,-105.0,80.0,135.0,150.0,-200.0,150.0,365.0,SBD
1,Edward Ruland,,M,1972,52,USA,FL,Raw,MR-M2,92.6,93,182.5,200.0,205.0,205.0,162.5,172.5,180.0,180.0,225.0,247.5,260.0,260.0,645.0,SBD
2,Marcos Sanchéz,,M,1974,50,USA,FL,Raw,MR-M2,91.2,93,230.0,240.0,245.0,245.0,127.5,135.0,140.0,140.0,240.0,250.0,257.5,257.5,642.5,SBD
3,Michael Slocumb,,M,1972,51,USA,CA,Raw,MR-M2,92.0,93,117.5,125.0,130.0,130.0,95.0,100.0,105.0,105.0,165.0,175.0,180.0,180.0,415.0,SBD
1,Michael McQueen,,M,1971,53,USA,TX,Raw,MR-M2,101.3,105,240.0,250.0,260.0,260.0,170.0,180.5,185.0,185.0,262.5,272.5,-282.5,272.5,717.5,SBD
2,David Koch #1,,M,1970,53,USA,MN,Raw,MR-M2,103.6,105,237.5,247.5,255.0,255.0,160.0,170.0,-175.0,170.0,260.0,275.0,-282.5,275.0,700.0,SBD
3,Jason Pearson #1,,M,1971,53,USA,FL,Raw,MR-M2,104.4,105,170.0,182.5,190.0,190.0,120.0,130.0,-132.5,130.0,207.5,227.5,237.5,237.5,557.5,SBD
2,Esteban Rubens,,M,1973,51,USA,NH,Raw,MR-M2,113.2,120,225.0,235.0,245.0,245.0,155.0,165.0,172.5,172.5,240.0,252.5,262.5,262.5,680.0,SBD
3,Nathan Burrell,,M,1972,51,USA,FL,Raw,MR-M2,113.8,120,227.5,240.0,250.0,250.0,137.5,-147.5,150.0,150.0,262.5,275.0,-282.5,275.0,675.0,SBD
4,Gregory Rawls,,M,1970,53,USA,FL,Raw,MR-M2,116.3,120,232.5,-242.5,242.5,242.5,150.0,160.0,165.0,165.0,250.0,265.0,-267.5,265.0,672.5,SBD
5,Chris Engebretson,,M,1969,55,USA,MA,Raw,MR-M2,115.8,120,225.0,240.0,245.0,245.0,157.5,165.0,167.5,167.5,242.5,257.5,-270.0,257.5,670.0,SBD
6,Leonard Brooks,,M,1974,50,USA,GA,Raw,MR-M2,118.9,120,200.0,212.5,217.5,217.5,152.5,160.0,162.5,162.5,225.0,237.5,247.5,247.5,627.5,SBD
7,Richard Acosta,,M,1967,57,USA,NJ,Raw,MR-M2,118.9,120,210.0,220.0,230.0,230.0,130.0,137.5,140.0,140.0,235.0,247.5,255.0,255.0,625.0,SBD
8,Devin St. Germain,,M,1966,57,USA,LA,Raw,MR-M2,114.8,120,157.5,170.0,-180.0,170.0,92.5,102.5,112.5,112.5,162.5,177.5,187.5,187.5,470.0,SBD
1,Carlos Lewis,,M,1958,65,USA,TX,Raw,MR-M3,73.5,74,177.5,192.5,-207.5,192.5,115.0,127.5,-132.5,127.5,180.0,205.0,215.0,215.0,535.0,SBD
3,Richard Carni,,M,1963,60,USA,CO,Raw,MR-M3,73.2,74,132.5,142.5,-147.5,142.5,97.5,100.0,102.5,102.5,145.0,160.0,-182.5,160.0,405.0,SBD
1,Larry Nash,,M,1960,64,USA,VA,Raw,MR-M3,79.8,83,185.0,195.0,200.0,200.0,130.0,135.0,-140.5,135.0,210.0,220.0,227.5,227.5,562.5,SBD
2,Willie Wong #1,,M,1961,62,USA,CA,Raw,MR-M3,83.0,83,200.0,210.0,-218.0,210.0,107.5,112.5,115.0,115.0,215.0,227.5,-240.0,227.5,552.5,SBD
1,Steven Carpenter #2,,M,1959,65,USA,FL,Raw,MR-M3,90.9,93,-167.5,167.5,172.5,172.5,-127.5,127.5,132.5,132.5,167.5,180.0,185.0,185.0,490.0,SBD
2,Todd Peterson,,M,1961,62,USA,NV,Raw,MR-M3,89.6,93,150.0,165.0,175.0,175.0,97.5,105.0,110.0,110.0,165.0,180.0,-205.0,180.0,465.0,SBD
1,Jim Kathios,,M,1961,63,USA,NH,Raw,MR-M3,102.7,105,200.0,210.0,215.0,215.0,-142.5,142.5,150.0,150.0,220.0,240.0,-255.0,240.0,605.0,SBD
2,Kenneth Bennett,,M,1959,64,USA,FL,Raw,MR-M3,102.3,105,172.5,182.5,192.5,192.5,130.0,140.0,145.0,145.0,215.0,227.5,237.5,237.5,575.0,SBD
1,Jeffrey Tryon,,M,1960,63,USA,FL,Raw,MR-M3,118.2,120,155.0,170.0,175.0,175.0,115.0,127.5,132.5,132.5,160.0,175.0,180.0,180.0,487.5,SBD
1,Manuel Rodriguez #1,,M,1949,74,USA,FL,Raw,MR-M4,64.2,66,142.5,150.0,152.5,152.5,85.0,90.0,-92.5,90.0,185.0,195.0,197.5,197.5,440.0,SBD
1,Dale Garlitz,,M,1950,74,USA,MT,Raw,MR-M4,72.0,74,155.0,162.5,170.0,170.0,95.0,102.5,105.0,105.0,175.0,182.5,-187.5,182.5,457.5,SBD
2,John LaFlamme,,M,1950,73,USA,FL,Raw,MR-M4,73.9,74,155.0,162.5,168.0,168.0,62.5,67.5,72.5,72.5,185.0,193.0,200.5,200.5,441.0,SBD
3,Louis Caruana,,M,1946,77,USA,FL,Raw,MR-M4,68.6,74,70.0,-75.0,80.0,80.0,55.0,60.0,62.5,62.5,110.0,117.5,125.0,125.0,267.5,SBD
1,Robert Moore #13,,M,1953,70,USA,MD,Raw,MR-M4,90.6,93,165.0,183.0,-185.0,183.0,117.5,127.5,130.0,130.0,145.0,160.0,-175.0,160.0,473.0,SBD
1,Gary Edwards,,M,1953,70,USA,FL,Raw,MR-M4,97.6,105,-140.0,-152.5,152.5,152.5,100.0,105.0,110.0,110.0,182.5,192.5,202.5,202.5,465.0,SBD
1,David Berube,,M,1991,32,USA,TX,Raw,MR-SA,54.9,59,75.0,80.0,90.0,90.0,57.5,62.5,-65.0,62.5,105.0,115.0,120.0,120.0,272.5,SBD
1,Joey Songco,,M,1991,32,USA,TX,Raw,MR-SA,63.6,66,82.5,90.0,100.0,100.0,82.5,87.5,97.5,97.5,140.0,152.5,165.0,165.0,362.5,SBD
4,Chad Schroeder #1,,M,1984,39,USA,WI,Raw,MR-M1,79.9,83,227.5,240.0,-247.5,240.0,137.5,142.5,145.0,145.0,267.5,280.0,287.5,287.5,672.5,SBD
8,Bart Kwan,,M,1984,39,USA,NV,Raw,MR-M1,82.9,83,172.5,182.5,192.5,192.5,140.0,145.0,147.5,147.5,185.0,200.0,215.0,215.0,555.0,SBD
3,Leonardo Alcantar,,M,2005,18,USA,IL,Raw,MR-Jr,52.0,53,117.5,130.0,137.5,137.5,70.0,75.0,80.0,80.0,-145.0,150.0,155.0,155.0,372.5,SBD
G,Derrick Le,,M,2006,17,USA,CA,Raw,MR-G,53.3,59,120.0,130.0,-140.0,130.0,85.0,92.5,95.0,95.0,145.0,157.5,165.0,165.0,390.0,SBD
1,Angel Voigt,,M,2006,18,USA,CA,Raw,MR-Sj,57.6,59,155.0,165.0,170.0,170.0,90.0,95.0,97.5,97.5,195.0,205.0,222.5,222.5,490.0,SBD
2,Noah Ossi,,M,2006,17,USA,FL,Raw,MR-Sj,58.6,59,170.0,177.5,-182.5,177.5,85.0,90.0,-92.5,90.0,190.0,210.0,-230.5,210.0,477.5,SBD
3,Nick Lowery,,M,2009,15,USA,TX,Raw,MR-Sj,58.5,59,172.5,-177.5,-182.5,172.5,-90.0,95.0,-100.0,95.0,182.5,195.0,-202.5,195.0,462.5,SBD
4,Aidan Roche,,M,2006,18,USA,IN,Raw,MR-Sj,58.2,59,135.0,150.0,160.0,160.0,100.0,105.0,107.5,107.5,155.0,170.0,180.0,180.0,447.5,SBD
5,Charles Dupuis,,M,2006,17,USA,MA,Raw,MR-Sj,57.6,59,147.5,155.0,-160.0,155.0,75.0,-82.5,82.5,82.5,182.5,190.0,195.0,195.0,432.5,SBD
6,Masato Gentle,,M,2008,15,USA,NV,Raw,MR-Sj,58.0,59,130.0,135.0,145.0,145.0,82.5,87.5,92.5,92.5,155.0,-167.5,-185.0,155.0,392.5,SBD
6,Max Gleason,,M,2005,18,USA,AL,Raw,MR-Jr,65.8,66,175.0,185.0,190.0,190.0,110.0,120.0,127.5,127.5,205.0,217.5,225.0,225.0,542.5,SBD
7,Mason Eardley,,M,2005,18,USA,NV,Raw,MR-Jr,65.4,66,170.0,182.5,-190.0,182.5,100.0,105.0,110.0,110.0,200.0,217.5,-227.5,217.5,510.0,SBD
1,Tyler Dehoff,,M,2006,18,USA,PA,Raw,MR-Sj,64.4,66,160.0,170.0,177.5,177.5,115.0,117.5,120.0,120.0,212.5,220.0,225.0,225.0,522.5,SBD
2,Carter Sanchez #2,,M,2006,17,USA,AZ,Raw,MR-Sj,65.3,66,162.5,170.0,-175.0,170.0,100.0,105.0,-107.5,105.0,-185.0,190.0,-202.5,190.0,465.0,SBD
3,Dan Iacob,,M,2006,17,USA,CA,Raw,MR-Sj,65.2,66,142.5,152.5,-160.0,152.5,90.0,97.5,105.0,105.0,177.5,190.0,-197.5,190.0,447.5,SBD
4,Colin Fahey,,M,2008,16,USA,AZ,Raw,MR-Sj,60.5,66,115.0,122.5,-135.0,122.5,80.0,85.0,-90.0,85.0,165.0,177.5,-180.0,177.5,385.0,SBD
9,Jonathan Twaddell,,M,2005,18,USA,NY,Raw,MR-Jr,71.7,74,202.5,212.5,220.0,220.0,102.5,110.0,117.5,117.5,245.0,260.0,-272.5,260.0,597.5,SBD
1,Arzad Afzaal,,M,2006,18,USA,MN,Raw,MR-Sj,72.9,74,195.0,212.5,225.0,225.0,100.0,105.0,107.5,107.5,210.0,227.5,235.0,235.0,567.5,SBD
2,Noah Raulston,,M,2007,17,USA,TX,Raw,MR-Sj,73.1,74,205.0,-217.5,-217.5,205.0,117.5,122.5,127.5,127.5,210.0,220.0,232.5,232.5,565.0,SBD
3,Marcus Canova,,M,2007,17,USA,NV,Raw,MR-Sj,73.1,74,185.0,195.0,-200.0,195.0,122.5,127.5,135.0,135.0,200.0,215.0,-237.5,215.0,545.0,SBD
4,David Gutierrez II,,M,2006,17,USA,FL,Raw,MR-Sj,73.9,74,175.0,185.0,190.0,190.0,95.0,102.5,-110.0,102.5,235.0,-250.0,250.0,250.0,542.5,SBD
5,Weston Lisemby,,M,2008,15,USA,TX,Raw,MR-Sj,70.0,74,195.0,217.5,-222.5,217.5,102.5,115.0,-120.0,115.0,192.5,-210.0,-210.0,192.5,525.0,SBD
6,Adam Olsen,,M,2006,18,USA,MA,Raw,MR-Sj,73.1,74,170.0,177.5,180.0,180.0,-120.0,120.0,127.5,127.5,210.0,217.5,-222.5,217.5,525.0,SBD
7,J. Banks Hawkins,,M,2008,15,USA,TX,Raw,MR-Sj,72.7,74,160.0,172.5,182.5,182.5,92.5,100.0,102.5,102.5,205.0,217.5,227.5,227.5,512.5,SBD
8,Oliver Pulman,,M,2008,16,USA,NV,Raw,MR-Sj,69.2,74,182.5,195.0,-202.5,195.0,100.0,110.0,115.0,115.0,-200.0,200.0,-210.0,200.0,510.0,SBD
9,Tristan Stolp,,M,2006,18,USA,SD,Raw,MR-Sj,73.4,74,142.5,155.0,160.0,160.0,87.5,95.0,97.5,97.5,177.5,190.0,-197.5,190.0,447.5,SBD
10,Kyler Ramsey #1,,M,2006,17,USA,TX,Raw,MR-Sj,71.9,74,150.0,157.5,165.0,165.0,80.0,87.5,-92.5,87.5,165.0,175.0,180.0,180.0,432.5,SBD
DQ,Warren Lee #1,,M,2007,17,USA,TX,Raw,MR-Sj,70.0,74,-142.5,-147.5,-147.5,,60.0,67.5,-70.0,67.5,-152.5,-152.5,-152.5,,,SBD
3,Wyatt Douda,,M,2005,18,USA,CA,Raw,MR-Jr,82.6,83,240.0,255.0,265.0,265.0,172.5,180.0,-182.5,180.0,255.0,270.0,-280.0,270.0,715.0,SBD
10,Adam Leahigh,,M,2005,18,USA,FL,Raw,MR-Jr,81.1,83,180.0,195.0,205.0,205.0,105.0,112.5,-122.5,112.5,215.0,227.5,237.5,237.5,555.0,SBD
1,Jack Reynolds,,M,2007,17,USA,MA,Raw,MR-Sj,81.4,83,252.5,268.0,275.5,275.5,168.0,175.0,180.5,180.5,-275.0,275.0,285.0,285.0,741.0,SBD
2,Dillon Johnson,,M,2007,16,USA,OK,Raw,MR-Sj,82.8,83,262.5,275.0,-285.0,275.0,170.0,-175.0,175.0,175.0,265.0,-275.0,-282.5,265.0,715.0,SBD
3,Daniel Russo #2,,M,2006,18,USA,NJ,Raw,MR-Sj,81.9,83,217.5,230.0,-235.0,230.0,157.5,167.5,-172.5,167.5,230.0,255.0,262.5,262.5,660.0,SBD
4,John Gabriel #3,,M,2007,16,USA,FL,Raw,MR-Sj,79.4,83,175.0,-185.0,185.0,185.0,97.5,105.0,110.0,110.0,187.5,197.5,207.5,207.5,502.5,SBD
5,Micah Crone,,M,2007,16,USA,OH,Raw,MR-Sj,81.3,83,152.5,160.0,-170.0,160.0,100.0,110.0,-112.5,110.0,185.0,192.5,-200.0,192.5,462.5,SBD
DQ,Joshua Miranda,,M,2006,17,USA,TX,Raw,MR-Sj,79.1,83,205.0,220.0,235.0,235.0,100.0,-112.5,112.5,112.5,-250.0,-257.5,-257.5,,,SBD
11,Rocky Dufort,,M,2005,18,USA,LA,Raw,MR-Jr,92.0,93,202.5,222.5,232.5,232.5,145.0,160.0,167.5,167.5,205.0,227.5,-237.5,227.5,627.5,SBD
13,Milo McQuade,,M,2005,18,USA,LA,Raw,MR-Jr,88.6,93,202.5,217.5,-227.5,217.5,135.0,145.0,152.5,152.5,195.0,212.5,227.5,227.5,597.5,SBD
1,William Ball #2,,M,2006,18,USA,NC,Raw,MR-Sj,90.8,93,265.0,282.5,295.5,295.5,175.0,183.0,188.0,188.0,280.0,300.0,310.5,310.5,794.0,SBD
2,David Syrotchen,,M,2008,16,USA,TX,Raw,MR-Sj,89.6,93,232.5,-242.5,245.0,245.0,140.0,147.5,-150.0,147.5,232.5,245.0,260.0,260.0,652.5,SBD
3,Jacob Mayne,,M,2006,18,USA,PA,Raw,MR-Sj,90.0,93,207.5,-215.0,-217.5,207.5,125.0,130.0,-135.0,130.0,275.0,290.0,-302.5,290.0,627.5,SBD
4,Colyn Baldwin,,M,2006,17,USA,AZ,Raw,MR-Sj,92.2,93,220.0,-225.0,-225.0,220.0,120.0,-122.5,-122.5,120.0,250.0,-260.0,-260.0,250.0,590.0,SBD
1,Mason Ross #2,,M,2007,17,USA,CA,Raw,MR-Sj,103.2,105,232.5,247.5,252.5,252.5,150.0,157.5,160.0,160.0,245.0,262.5,270.0,270.0,682.5,SBD
2,Stephen Newman,,M,2006,17,USA,NY,Raw,MR-Sj,102.0,105,212.5,225.0,232.5,232.5,145.0,155.0,162.5,162.5,245.0,262.5,280.0,280.0,675.0,SBD
3,Angelo Carpino,,M,2007,16,USA,FL,Raw,MR-Sj,103.5,105,225.0,237.5,-242.5,237.5,137.5,150.0,160.0,160.0,207.5,222.5,232.5,232.5,630.0,SBD
4,Rowland Hoskins III,,M,2006,18,USA,FL,Raw,MR-Sj,104.0,105,190.0,200.0,207.5,207.5,112.5,117.5,122.5,122.5,220.0,242.5,247.5,247.5,577.5,SBD
5,Adam Bregman,,M,2006,17,USA,MD,Raw,MR-Sj,104.2,105,215.0,225.0,232.5,232.5,115.0,-122.5,-127.5,115.0,215.0,230.0,-235.0,230.0,577.5,SBD
DQ,Uriel Perez,,M,2005,18,USA,AZ,Raw,MR-Jr,129.3,120+,-240.0,240.0,-270.0,240.0,170.0,-180.0,-180.0,170.0,,,,,,SBD
1,Trevor Klein,,M,2006,18,USA,VA,Raw,MR-Sj,119.0,120,267.5,285.0,295.0,295.0,212.5,223.0,-228.5,223.0,240.0,255.0,262.5,262.5,780.5,SBD
2,Ryan Musto,,M,2006,17,USA,MA,Raw,MR-Sj,118.0,120,280.0,-287.5,287.5,287.5,175.0,182.5,185.0,185.0,295.0,307.5,-310.0,307.5,780.0,SBD
3,John Engebretson,,M,2007,16,USA,MA,Raw,MR-Sj,106.4,120,180.0,192.5,197.5,197.5,107.5,112.5,115.0,115.0,177.5,187.5,195.0,195.0,507.5,SBD
1,Atreyu Vest,,M,2009,14,USA,GA,Raw,MR-Sj,133.3,120+,225.0,235.0,242.5,242.5,135.0,145.0,150.0,150.0,222.5,232.5,237.5,237.5,630.0,SBD