Division,WeightClassKg,Place,Name,Team,BodyweightKg,Best3SquatKg,Best3BenchKg,Best3DeadliftKg,TotalKg,Equipment,Event,Sex,BirthDate
Girls,44.23,1,Jaci Garcia,Giddings,42.09,77.11,40.82,81.65,199.58,Unlimited,SBD,F,
Girls,44.23,2,Blythe Edwards,Smithville,43.64,77.11,36.29,61.23,174.63,Unlimited,SBD,F,
Girls,44.23,3,Eleyana Romero,Smithville,39.37,56.7,31.75,72.57,161.03,Unlimited,SBD,F,
Girls,44.23,4,Andrea Sambrano,Smithville,42.73,56.7,24.95,63.5,145.15,Unlimited,SBD,F,
Girls,44.23,5,Amariah Mendoza,Manor,37.56,58.97,27.22,56.7,142.88,Unlimited,SBD,F,
Girls,44.23,6,Brooklynn Clark,Pflugerville Hendrickson,44.18,45.36,24.95,68.04,138.35,Unlimited,SBD,F,
Girls,47.85,1,Beth Stracener,College Station,47.81,111.13,61.23,108.86,281.23,Unlimited,SBD,F,
Girls,47.85,2,Zoey Smith,Elgin,46.45,106.59,54.43,106.59,267.62,Unlimited,SBD,F,
Girls,47.85,3,Kensey Kalstad,Pflugerville Hendrickson,47.81,95.25,61.23,97.52,254.01,Unlimited,SBD,F,
Girls,47.85,4,Lori Vasquez,Del Valle,47.45,117.93,45.36,86.18,249.48,Unlimited,SBD,F,
Girls,47.85,5,Vivi Valenzuela,Kyle Lehman,47.81,99.79,52.16,86.18,238.14,Unlimited,SBD,F,
Girls,47.85,6,Guadelupe Anguiano-Garcia,Bastrop Cedar Creek,45.27,90.72,38.56,90.72,219.99,Unlimited,SBD,F,
Girls,47.85,7,Marlie Hawkins,Lago Vista,46.72,86.18,38.56,92.99,217.72,Unlimited,SBD,F,
Girls,47.85,8,Jessica Mendoza,Pflugerville Weiss,44.54,79.38,45.36,70.31,195.04,Unlimited,SBD,F,
Girls,47.85,9,Katie Baker,Killeen Harker Heights,45.99,47.63,24.95,49.9,122.47,Unlimited,SBD,F,
Girls,47.85,DQ,Ashley Rodriguez,Austin Anderson,47.63,,,,,Unlimited,SBD,F,
Girls,51.94,1,Elizabeth Nunez,Elgin,50.98,165.56,88.45,127.01,381.02,Unlimited,SBD,F,
Girls,51.94,2,Rylie Dlouhy,Taylor,50.8,133.81,83.91,133.81,351.53,Unlimited,SBD,F,
Girls,51.94,3,Julia Crowder,Luling,49.9,115.67,63.5,145.15,324.32,Unlimited,SBD,F,
Girls,51.94,4,Kaya Shellhammer,Buda Hays,48.76,124.74,52.16,142.88,319.78,Unlimited,SBD,F,
Girls,51.94,5,Laura Rife,College Station,50.62,113.4,58.97,106.59,278.96,Unlimited,SBD,F,
Girls,51.94,6,Shantel Harlow,Smithville,50.71,108.86,63.5,106.59,278.96,Unlimited,SBD,F,
Girls,51.94,7,Zoe Moore,Taylor,51.62,97.52,65.77,113.4,276.69,Unlimited,SBD,F,
Girls,51.94,8,Madeline Boicelli,Austin Lake Travis,50.89,106.59,65.77,102.06,274.42,Unlimited,SBD,F,
Girls,51.94,9,Marie Donahue,Kyle Lehman,51.17,104.33,47.63,113.4,265.35,Unlimited,SBD,F,
Girls,51.94,10,Joselyn Reyna,Luling,48.99,102.06,52.16,104.33,258.55,Unlimited,SBD,F,
Girls,51.94,11,Mikayla DeLuna,Pflugerville Weiss,49.99,106.59,43.09,102.06,251.74,Unlimited,SBD,F,
Girls,51.94,12,Audrey Nicks,Giddings,51.17,108.86,43.09,99.79,251.74,Unlimited,SBD,F,
Girls,51.94,13,Emma Elizondo,Pflugerville Hendrickson,51.62,97.52,43.09,106.59,247.21,Unlimited,SBD,F,
Girls,51.94,14,Kenzi Jarrett,Killeen Harker Heights,50.8,77.11,65.77,90.72,233.6,Unlimited,SBD,F,
Girls,51.94,15,Yarelin Tavera,Bastrop,51.17,83.91,38.56,99.79,222.26,Unlimited,SBD,F,
Girls,51.94,16,April Landruilt,Del Valle,51.26,90.72,43.09,81.65,215.46,Unlimited,SBD,F,
Girls,51.94,17,Lonna Miller,Lago Vista,49.9,88.45,38.56,86.18,213.19,Unlimited,SBD,F,
Girls,51.94,18,Katelyn Anderson,Elgin,51.17,74.84,38.56,99.79,213.19,Unlimited,SBD,F,
Girls,51.94,19,Cassandra Vasquez,Del Valle,51.26,56.7,31.75,81.65,170.1,Unlimited,SBD,F,
Girls,51.94,20,Jada Raymond,Del Valle,50.89,99.79,49.9,99.79,249.48,Unlimited,SBD,F,
Girls,51.94,21,Ella Crowe,Austin Anderson,51.35,52.16,29.48,81.65,163.29,Unlimited,SBD,F,
Girls,51.94,DQ,Kim De Lara,Manor,51.71,,,,,Unlimited,SBD,F,
Girls,51.94,DQ,Valayla Reveles,Pflugerville Weiss,51.71,,,,,Unlimited,SBD,F,
Girls,56.02,1,Maria Yanez,Elgin,54.25,192.78,86.18,140.61,419.57,Unlimited,SBD,F,
Girls,56.02,2,Alexia Smith,Buda Hays,55.16,124.74,63.5,142.88,331.12,Unlimited,SBD,F,
Girls,56.02,3,Camden Lechler,College Station,54.88,117.93,56.7,127.01,301.64,Unlimited,SBD,F,
Girls,56.02,4,Raya Powell,Smithville,54.61,115.67,58.97,122.47,297.1,Unlimited,SBD,F,
Girls,56.02,5,Mirabella Dietz,Buda Hays,55.52,113.4,49.9,129.27,292.57,Unlimited,SBD,F,
Girls,56.02,6,Ruth Kearley,Buda Hays,52.98,111.13,61.23,117.93,290.3,Unlimited,SBD,F,
Girls,56.02,7,Rosie Driscoll,Del Valle,55.84,92.99,65.77,122.47,281.23,Unlimited,SBD,F,
Girls,56.02,8,Vanessa Diaz,Taylor,55.16,102.06,56.7,97.52,256.28,Unlimited,SBD,F,
Girls,56.02,9,Ava Taylor,Killeen Harker Heights,55.43,97.52,49.9,102.06,249.48,Unlimited,SBD,F,
Girls,56.02,10,Kaylee McKinley,Pflugerville Hendrickson,55.25,86.18,38.56,113.4,238.14,Unlimited,SBD,F,
Girls,56.02,11,Camryn Bush,Pflugerville Weiss,53.8,74.84,47.63,97.52,219.99,Unlimited,SBD,F,
Girls,56.02,12,Rae Tapia,Pflugerville Hendrickson,53.89,74.84,40.82,104.33,219.99,Unlimited,SBD,F,
Girls,56.02,13,Nastasja Ladden,Buda Johnson,52.34,79.38,56.7,81.65,217.72,Unlimited,SBD,F,
Girls,56.02,14,Rozette Silvas,Buda Johnson,53.8,83.91,38.56,90.72,213.19,Unlimited,SBD,F,
Girls,56.02,15,Janell Hernandez,Bastrop Cedar Creek,54.16,81.65,36.29,81.65,199.58,Unlimited,SBD,F,
Girls,56.02,16,Amanda Kromer,Austin Anderson,54.25,83.91,36.29,79.38,199.58,Unlimited,SBD,F,
Girls,56.02,17,Angie Loredo,Buda Johnson,52.34,79.38,34.02,81.65,195.04,Unlimited,SBD,F,
Girls,56.02,18,Jada Delgado,Buda Johnson,53.8,65.77,40.82,68.04,174.63,Unlimited,SBD,F,
Girls,56.02,DQ,Nhi Nguyen,Pflugerville Connally,52.53,83.91,38.56,,,Unlimited,SBD,F,
Girls,56.02,DQ,Kim Ibarra,Bastrop Cedar Creek,55.25,54.43,,,,Unlimited,SBD,F,
Girls,56.02,DQ,Destiny Bautista,Kyle Lehman,55.79,,,,,Unlimited,SBD,F,
Girls,60.1,1,Keileigh Bowie,College Station,59.96,170.1,92.99,138.35,401.43,Unlimited,SBD,F,
Girls,60.1,2,Jessica Dominguez Lackey,Elgin,57.33,117.93,77.11,115.67,310.71,Unlimited,SBD,F,
Girls,60.1,3,Hailey Ruiz,Buda Hays,56.34,122.47,58.97,124.74,306.17,Unlimited,SBD,F,
Girls,60.1,4,Emily Estrada,Manor,59.33,106.59,61.23,127.01,294.84,Unlimited,SBD,F,
Girls,60.1,5,Jordynn Booe,Pflugerville Weiss,59.24,113.4,49.9,129.27,292.57,Unlimited,SBD,F,
Girls,60.1,6,Emery Bayer,Smithville,57.06,120.2,63.5,106.59,290.3,Unlimited,SBD,F,
Girls,60.1,7,Joanna Ngim,Smithville,58.6,115.67,63.5,108.86,288.03,Unlimited,SBD,F,
Girls,60.1,8,Payton Ely,Buda Hays,59.06,113.4,61.23,106.59,281.23,Unlimited,SBD,F,
Girls,60.1,9,Andrea Villanueva,Pflugerville Hendrickson,58.15,111.13,52.16,113.4,276.69,Unlimited,SBD,F,
Girls,60.1,10,Way Paw,Manor,58.88,108.86,61.23,102.06,272.16,Unlimited,SBD,F,
Girls,60.1,11,Sofia Farelas,Pflugerville Connally,59.6,117.93,56.7,92.99,267.62,Unlimited,SBD,F,
Girls,60.1,12,Anaya Bynum,Buda Johnson,59.78,104.33,52.16,111.13,267.62,Unlimited,SBD,F,
Girls,60.1,13,Taylor Coggin,Austin Anderson,59.15,111.13,45.36,108.86,265.35,Unlimited,SBD,F,
Girls,60.1,14,Bella Navejas,Elgin,59.69,95.25,49.9,120.2,265.35,Unlimited,SBD,F,
Girls,60.1,15,Alice Woolery,Buda Hays,57.97,104.33,49.9,102.06,256.28,Unlimited,SBD,F,
Girls,60.1,16,Esther Gutierrez,Kyle Lehman,58.6,115.67,45.36,90.72,251.74,Unlimited,SBD,F,
Girls,60.1,17,Amalia Lopez,Taylor,57.61,95.25,49.9,102.06,247.21,Unlimited,SBD,F,
Girls,60.1,18,Ellie Sierra,Pflugerville Connally,57.06,77.11,65.77,97.52,240.4,Unlimited,SBD,F,
Girls,60.1,19,Jovi Flanagan,Buda Hays,57.79,92.99,45.36,102.06,240.4,Unlimited,SBD,F,
Girls,60.1,20,Paisley Talley,Lago Vista,56.61,79.38,45.36,102.06,226.8,Unlimited,SBD,F,
Girls,60.1,21,Kionna Brown,Manor,57.61,81.65,40.82,99.79,222.26,Unlimited,SBD,F,
Girls,60.1,22,Lilly Wisdom,Lago Vista,56.25,86.18,47.63,86.18,219.99,Unlimited,SBD,F,
Girls,60.1,23,Marabel Meid,Austin Lake Travis,58.06,83.91,38.56,95.25,217.72,Unlimited,SBD,F,
Girls,60.1,24,Samantha Zapata,Pflugerville Connally,59.24,79.38,43.09,90.72,213.19,Unlimited,SBD,F,
Girls,60.1,25,Carsyn Lynch,Austin Anderson,58.15,81.65,36.29,90.72,208.65,Unlimited,SBD,F,
Girls,60.1,26,Bre Rosa,Bastrop,58.97,79.38,31.75,83.91,195.04,Unlimited,SBD,F,
Girls,60.1,27,Hollis Pinczehelyi,Austin Lake Travis,59.51,61.23,40.82,83.91,185.97,Unlimited,SBD,F,
Girls,60.1,DQ,Madelyn Teshler,Austin Lake Travis,59.87,,,,,Unlimited,SBD,F,
Girls,60.1,DQ,Zoey Morales,Manor,59.87,,,,,Unlimited,SBD,F,
Girls,60.1,DQ,Arisbeth Segundo,Giddings,59.87,,,,,Unlimited,SBD,F,
Girls,60.1,DQ,Kimberly Orantes,Luling,60.06,117.93,,,,Unlimited,SBD,F,
Girls,60.1,DQ,Jayden Lade,Lago Vista,60.06,102.06,,,,Unlimited,SBD,F,
Girls,67.36,1,Jordin Seeger,Elgin,64.59,161.03,102.06,167.83,430.91,Unlimited,SBD,F,
Girls,67.36,2,Giovanna Castellani,College Station,66.04,170.1,81.65,149.69,401.43,Unlimited,SBD,F,
Girls,67.36,3,Ri'Queleigh Holmes-Grant,Taylor,65.95,149.69,90.72,147.42,387.82,Unlimited,SBD,F,
Girls,67.36,4,Danielle King,Elgin,64.59,142.88,108.86,129.27,381.02,Unlimited,SBD,F,
Girls,67.36,5,Madison Barber,College Station,65.77,165.56,70.31,138.35,374.21,Unlimited,SBD,F,
Girls,67.36,6,Yinnie Cosme,Killeen Ellison,66.41,136.08,74.84,127.01,337.93,Unlimited,SBD,F,
Girls,67.36,7,Eliana Aleman,Taylor,61.96,131.54,72.57,113.4,317.51,Unlimited,SBD,F,
Girls,67.36,8,Jesslynn Rodriguez,Luling,66.59,133.81,52.16,129.27,315.25,Unlimited,SBD,F,
Girls,67.36,9,Maylin Caldera,Giddings,66.13,127.01,65.77,120.2,312.98,Unlimited,SBD,F,
Girls,67.36,10,Chloe Diaz,Buda Hays,66.77,111.13,56.7,142.88,310.71,Unlimited,SBD,F,
Girls,67.36,11,Emily Wilson,Lago Vista,60.78,122.47,52.16,122.47,297.1,Unlimited,SBD,F,
Girls,67.36,12,Christina Beard,Giddings,60.15,117.93,58.97,117.93,294.84,Unlimited,SBD,F,
Girls,67.36,13,Lizbeth Lopez,Del Valle,66.13,127.01,52.16,113.4,292.57,Unlimited,SBD,F,
Girls,67.36,14,Nyla Kelly,Del Valle,66.81,117.93,65.77,108.86,292.57,Unlimited,SBD,F,
Girls,67.36,15,Lauren Riojas,Pflugerville Hendrickson,64.41,111.13,45.36,131.54,288.03,Unlimited,SBD,F,
Girls,67.36,16,Kayden Wilde,Smithville,63.87,108.86,54.43,120.2,283.5,Unlimited,SBD,F,
Girls,67.36,17,Rebecca Burkhard,Pflugerville Hendrickson,65.95,99.79,63.5,120.2,283.5,Unlimited,SBD,F,
Girls,67.36,18,Karina Hall-Albavera,Taylor,64.32,102.06,72.57,104.33,278.96,Unlimited,SBD,F,
Girls,67.36,19,Nayeli Rodriguez,Pflugerville Weiss,64.5,108.86,54.43,111.13,274.42,Unlimited,SBD,F,
Girls,67.36,20,Claire Natal,Bastrop Cedar Creek,65.77,90.72,63.5,104.33,258.55,Unlimited,SBD,F,
Girls,67.36,21,Kenna McKinley,Pflugerville Hendrickson,60.51,90.72,40.82,115.67,247.21,Unlimited,SBD,F,
Girls,67.36,22,Evie Parrish,Pflugerville Hendrickson,66.22,92.99,45.36,99.79,238.14,Unlimited,SBD,F,
Girls,67.36,23,Lauren Natal,Bastrop Cedar Creek,66.41,77.11,47.63,77.11,201.85,Unlimited,SBD,F,
Girls,67.36,24,Libby Helge,Austin Anderson,63.87,74.84,34.02,90.72,199.58,Unlimited,SBD,F,
Girls,67.36,25,Gabriella Sicat,Austin Lake Travis,60.51,65.77,34.02,88.45,188.24,Unlimited,SBD,F,
Girls,67.36,26,Phoenix Garcia,Bastrop,64.68,72.57,31.75,81.65,185.97,Unlimited,SBD,F,
Girls,67.36,27,Aubrey Santos,Pflugerville Weiss,67.13,102.06,,,102.06,Unlimited,S,F,
Girls,67.36,DQ,Nataly Rosado,Buda Hays,66.77,,,,,Unlimited,SBD,F,
Girls,67.36,DQ,Olivia Alvarado,Austin Anderson,66.77,102.06,56.7,,,Unlimited,SBD,F,
Girls,67.36,DQ,Leila Gomez,Kyle Lehman,60.96,195.04,,,,Unlimited,SBD,F,
Girls,67.36,DQ,Madeline Coats,Buda Johnson,67.13,,,,,Unlimited,SBD,F,
Girls,67.36,DQ,Audrey Armatta,Buda Johnson,67.13,,,,,Unlimited,SBD,F,
Girls,67.36,DQ,Danielle Shabtai,Bastrop,67.13,,,,,Unlimited,SBD,F,
Girls,67.36,DQ,Andrea Contreras,Bastrop,67.13,,,,,Unlimited,SBD,F,
Girls,67.36,DQ,Bianca Ugarte,Pflugerville Connally,67.13,,,,,Unlimited,SBD,F,
Girls,67.36,DQ,Jacee Oehlert,College Station,67.13,,,,,Unlimited,SBD,F,
Girls,67.36,DQ,Harper Cole,Comfort,64.86,104.33,47.63,,,Unlimited,SBD,F,
Girls,75.07,1,Jessica Kolodziejczyk,College Station,74.84,197.31,90.72,147.42,435.45,Unlimited,SBD,F,
Girls,75.07,2,Kyia Miller,Kyle Lehman,67.49,156.49,79.38,142.88,378.75,Unlimited,SBD,F,
Girls,75.07,3,Ashley Harris,College Station,70.13,158.76,70.31,142.88,371.95,Unlimited,SBD,F,
Girls,75.07,4,Colleen Gulde,College Station,71.12,149.69,72.57,142.88,365.14,Unlimited,SBD,F,
Girls,75.07,5,Isel Rodriguez,Pflugerville Weiss,72.39,131.54,70.31,140.61,342.46,Unlimited,SBD,F,
Girls,75.07,6,Misha Brownlee,Killeen Harker Heights,74.93,108.86,65.77,149.69,324.32,Unlimited,SBD,F,
Girls,75.07,7,Brooke Lonsdale,Austin Anderson,72.57,115.67,58.97,138.35,312.98,Unlimited,SBD,F,
Girls,75.07,8,Camryn Hall,Bastrop Cedar Creek,69.04,111.13,77.11,120.2,308.44,Unlimited,SBD,F,
Girls,75.07,9,Emily Dolin,Buda Hays,72.67,113.4,52.16,142.88,308.44,Unlimited,SBD,F,
Girls,75.07,10,Liliana Perez,Del Valle,71.49,115.67,56.7,115.67,288.03,Unlimited,SBD,F,
Girls,75.07,11,Rosemary Jamison,Buda Johnson,71.94,111.13,54.43,115.67,281.23,Unlimited,SBD,F,
Girls,75.07,12,Ivy Skipper,Lago Vista,72.03,111.13,56.7,113.4,281.23,Unlimited,SBD,F,
Girls,75.07,13,Emily Nieves,Manor,70.85,99.79,43.09,111.13,254.01,Unlimited,SBD,F,
Girls,75.07,14,Sophia Ugarte,Pflugerville Connally,73.94,92.99,54.43,102.06,249.48,Unlimited,SBD,F,
Girls,75.07,15,Sarah Holland,Comfort,74.84,92.99,45.36,106.59,244.94,Unlimited,SBD,F,
Girls,75.07,16,Christy Natal,Bastrop Cedar Creek,69.85,90.72,47.63,97.52,235.87,Unlimited,SBD,F,
Girls,75.07,17,Takira McKinney,Pflugerville Connally,74.03,79.38,49.9,79.38,208.65,Unlimited,SBD,F,
Girls,75.07,18,Samantha Fidler,Bastrop Cedar Creek,68.49,68.04,47.63,70.31,185.97,Unlimited,SBD,F,
Girls,75.07,19,Mandi Mendoza,Luling,69.85,74.84,29.48,77.11,181.44,Unlimited,SBD,F,
Girls,75.07,DQ,Elagah Brandyburg,Smithville,71.85,97.52,47.63,,,Unlimited,SBD,F,
Girls,75.07,DQ,Elena Schock,Austin Anderson,74.84,,,,,Unlimited,SBD,F,
Girls,75.07,DQ,Grace Benigni,Austin Lake Travis,74.84,,,,,Unlimited,SBD,F,
Girls,75.07,DQ,Ariana Concha,Taylor,74.84,,,,,Unlimited,SBD,F,
Girls,75.07,DQ,Emmalee Vallejo,Pflugerville Weiss,74.84,,,,,Unlimited,SBD,F,
Girls,82.33,1,Avery Mueller,Giddings,75.66,167.83,97.52,133.81,399.16,Unlimited,SBD,F,
Girls,82.33,2,Grace Hagen,Elgin,79.92,145.15,72.57,149.69,367.41,Unlimited,SBD,F,
Girls,82.33,3,Alannah Solorio,Bartlett,80.92,142.88,61.23,136.08,340.19,Unlimited,SBD,F,
Girls,82.33,4,Alexia Perez,Elgin,77.2,122.47,83.91,127.01,333.39,Unlimited,SBD,F,
Girls,82.33,5,Mia Ndika,Pflugerville Hendrickson,78.65,120.2,68.04,136.08,324.32,Unlimited,SBD,F,
Girls,82.33,6,Hannah Sagebiel,Bastrop,75.11,124.74,63.5,131.54,319.78,Unlimited,SBD,F,
Girls,82.33,7,Kiley Kyser,Elgin,79.56,117.93,68.04,113.4,299.37,Unlimited,SBD,F,
Girls,82.33,8,Marisela Natal,Bastrop Cedar Creek,79.11,115.67,56.7,124.74,297.1,Unlimited,SBD,F,
Girls,82.33,9,Citlalli Jiminez,Elgin,79.65,120.2,72.57,104.33,297.1,Unlimited,SBD,F,
Girls,82.33,10,Cynthia Leos,Comfort,77.2,136.08,49.9,106.59,292.57,Unlimited,SBD,F,
Girls,82.33,11,Khilanni Scarver,Manor,77.29,99.79,65.77,122.47,288.03,Unlimited,SBD,F,
Girls,82.33,12,Madeline Saavedra,Buda Hays,78.29,117.93,49.9,113.4,281.23,Unlimited,SBD,F,
Girls,82.33,13,Nicolette Villarreal,Taylor,80.38,111.13,52.16,115.67,278.96,Unlimited,SBD,F,
Girls,82.33,14,Rebeckah Kornacki,Del Valle,81.47,92.99,52.16,108.86,254.01,Unlimited,SBD,F,
Girls,82.33,15,Payton Alamillo,Smithville,75.75,83.91,54.43,106.59,244.94,Unlimited,SBD,F,
Girls,82.33,16,Chassity Navarette,Smithville,81.65,92.99,43.09,97.52,233.6,Unlimited,SBD,F,
Girls,82.33,17,Natalie Reyes,Luling,76.66,83.91,47.63,97.52,229.06,Unlimited,SBD,F,
Girls,82.33,18,Marabella Woodford,Lago Vista,76.66,83.91,38.56,86.18,208.65,Unlimited,SBD,F,
Girls,82.33,DQ,Mayte Jimenez,Taylor,77.66,,,,,Unlimited,SBD,F,
Girls,82.33,DQ,Zoe Moreno,Bastrop,77.56,77.11,,,,Unlimited,SBD,F,
Girls,82.33,DQ,Wendaly Martinez,Comfort,82.1,,,,,Unlimited,SBD,F,
Girls,82.33,DQ,Ashley Vipond,Pflugerville Weiss,82.1,,,,,Unlimited,SBD,F,
Girls,90.04,1,Stephanie Mendoza,Del Valle,89.09,165.56,81.65,156.49,403.7,Unlimited,SBD,F,
Girls,90.04,2,Aniya Taylor,College Station,83.01,163.29,74.84,147.42,385.55,Unlimited,SBD,F,
Girls,90.04,3,Elena Guevara,Kyle Lehman,86.91,136.08,79.38,147.42,362.87,Unlimited,SBD,F,
Girls,90.04,4,Elise Rhodes,Elgin,87.36,124.74,68.04,133.81,326.59,Unlimited,SBD,F,
Girls,90.04,5,Leezett Rodriguez,Manor,83.19,131.54,54.43,111.13,297.1,Unlimited,SBD,F,
Girls,90.04,6,Stephanie Obregon,Del Valle,83.91,120.2,52.16,117.93,290.3,Unlimited,SBD,F,
Girls,90.04,7,Mercedes Anderson,Killeen Harker Heights,84.1,102.06,65.77,117.93,285.76,Unlimited,SBD,F,
Girls,90.04,8,Mayra Garcia,Elgin,87.72,97.52,83.91,95.25,276.69,Unlimited,SBD,F,
Girls,90.04,9,Emma Godfrey,Killeen Harker Heights,86.36,88.45,43.09,99.79,231.33,Unlimited,SBD,F,
Girls,90.04,10,Samantha Dillon-Raygor,Lago Vista,85.37,79.38,49.9,90.72,219.99,Unlimited,SBD,F,
Girls,90.04,11,Zehcora Rochez,Taylor,83.73,77.11,34.02,106.59,217.72,Unlimited,SBD,F,
Girls,90.04,12,Natalia Vazquez,Pflugerville Hendrickson,83.37,72.57,40.82,102.06,215.46,Unlimited,SBD,F,
Girls,90.04,DQ,Alyna Monreal-Cancino,Bastrop Cedar Creek,86.91,142.88,52.16,,,Unlimited,SBD,F,
Girls,90.04,DQ,Jaiden Saucedo,Giddings,89.81,,,,,Unlimited,SBD,F,
Girls,90.04,DQ,Valeria Mondragon,Manor,89.81,,,,,Unlimited,SBD,F,
Girls,90.04,DQ,Madison Young #2,Bastrop,89.81,,,,,Unlimited,SBD,F,
Girls,100.02,1,JaLiyah Price,Elgin,98.07,149.69,106.59,154.22,410.5,Unlimited,SBD,F,
Girls,100.02,2,Eunice Ramos,Bastrop Cedar Creek,93.35,165.56,74.84,142.88,383.29,Unlimited,SBD,F,
Girls,100.02,3,Maya Moctezuma,Pflugerville Connally,91.44,147.42,70.31,120.2,337.93,Unlimited,SBD,F,
Girls,100.02,4,Nataly Aviles-Cordova,Pflugerville Connally,91.08,129.27,74.84,129.27,333.39,Unlimited,SBD,F,
Girls,100.02,5,Madalynn Coston,Pflugerville Weiss,99.16,131.54,70.31,120.2,322.05,Unlimited,SBD,F,
Girls,100.02,6,Alondra Gutierrez,Del Valle,99.52,124.74,72.57,124.74,322.05,Unlimited,SBD,F,
Girls,100.02,7,Reagan Phariss,Lago Vista,90.72,113.4,58.97,136.08,308.44,Unlimited,SBD,F,
Girls,100.02,8,Ava Thomann,Buda Johnson,93.71,120.2,68.04,115.67,303.91,Unlimited,SBD,F,
Girls,100.02,9,Joanna Barar,Pflugerville Connally,95.62,111.13,79.38,97.52,288.03,Unlimited,SBD,F,
Girls,100.02,10,Mia Valenzuela,Comfort,96.07,111.13,52.16,124.74,288.03,Unlimited,SBD,F,
Girls,100.02,11,Alexis Rojas #2,Comfort,95.07,122.47,45.36,115.67,283.5,Unlimited,SBD,F,
Girls,100.02,12,Natalie Vaquera,Lago Vista,94.8,136.08,61.23,83.91,281.23,Unlimited,SBD,F,
Girls,100.02,13,Koi Alford,Giddings,95.44,99.79,54.43,95.25,249.48,Unlimited,SBD,F,
Girls,100.02,14,Keily Orozco,Del Valle,91.17,77.11,29.48,111.13,217.72,Unlimited,SBD,F,
Girls,100.02,DQ,Angela Caldera,Bastrop,99.79,,,,,Unlimited,SBD,F,
Girls,100.02,DQ,Aubrey Hernandez,Comfort,99.79,,,,,Unlimited,SBD,F,
Girls,100.02,DQ,Ayleen Hernadez,Lago Vista,99.79,,,,,Unlimited,SBD,F,
Girls,100.02,DQ,Katya Veazey,Austin Anderson,99.79,,,,,Unlimited,SBD,F,
Girls,110,1,Krista Randig,Taylor,103.42,167.83,111.13,158.76,437.72,Unlimited,SBD,F,
Girls,110,2,J Miracle Sandle,College Station,100.06,158.76,97.52,136.08,392.36,Unlimited,SBD,F,
Girls,110,3,Iliana Soliz,Austin Lake Travis,102.24,129.27,58.97,142.88,331.12,Unlimited,SBD,F,
Girls,110,4,Michelle Villa,Comfort,106.14,124.74,58.97,122.47,306.17,Unlimited,SBD,F,
Girls,110,5,Kyra Moseley,Killeen Ellison,104.33,127.01,65.77,108.86,301.64,Unlimited,SBD,F,
Girls,110,6,Chloe Adams,Bastrop Cedar Creek,101.97,122.47,61.23,111.13,294.84,Unlimited,SBD,F,
Girls,110,7,Jazlynn Sifuentes,Buda Johnson,106.5,108.86,56.7,129.27,294.84,Unlimited,SBD,F,
Girls,110,8,Joanna Mata,Buda Johnson,108.23,129.27,56.7,95.25,281.23,Unlimited,SBD,F,
Girls,110,9,Janette Gomez,Del Valle,109.32,88.45,45.36,97.52,231.33,Unlimited,SBD,F,
Girls,110,10,Ayla Ramos,Smithville,101.7,61.23,43.09,90.72,195.04,Unlimited,SBD,F,
Girls,110,DQ,Anya Gordon,Pflugerville Connally,109.77,,,,,Unlimited,SBD,F,
Girls,110+,1,Nya Kirk Jones,Elgin,111.95,238.14,158.76,206.38,603.28,Unlimited,SBD,F,
Girls,110+,2,Ariana Ramirez,Giddings,111.86,197.31,115.67,149.69,462.66,Unlimited,SBD,F,
Girls,110+,3,Addison Davis,Giddings,139.71,185.97,113.4,124.74,424.11,Unlimited,SBD,F,
Girls,110+,4,Rihanna Murry,Luling,148.32,181.44,88.45,151.95,421.84,Unlimited,SBD,F,
Girls,110+,5,Keira Blue,Giddings,113.13,161.03,104.33,151.95,417.3,Unlimited,SBD,F,
Girls,110+,6,Breanna Ihrig,College Station,116.48,156.49,86.18,140.61,383.29,Unlimited,SBD,F,
Girls,110+,7,Adamaris Matamoros,Luling,152.86,156.49,65.77,161.03,383.29,Unlimited,SBD,F,
Girls,110+,8,Jaclyn Taft,Killeen Harker Heights,119.93,145.15,83.91,151.95,381.02,Unlimited,SBD,F,
Girls,110+,9,Ashley Mucino,Manor,133.36,154.22,81.65,142.88,378.75,Unlimited,SBD,F,
Girls,110+,10,Angela Garcia,Giddings,119.11,147.42,88.45,129.27,365.14,Unlimited,SBD,F,
Girls,110+,11,Trezser Anderson-Lovings,Smithville,135.44,111.13,72.57,176.9,360.61,Unlimited,SBD,F,
Girls,110+,12,Camiesha Moore,Smithville,119.29,127.01,68.04,140.61,335.66,Unlimited,SBD,F,
Girls,110+,13,Betsy Herrera,Bastrop,120.56,115.67,54.43,111.13,281.23,Unlimited,SBD,F,
Girls,110+,14,Katelyn Flores,Killeen Harker Heights,126.55,61.23,36.29,72.57,170.1,Unlimited,SBD,F,
Girls,110+,NS,Jada Navarro,Austin Anderson,,,,,,Unlimited,SBD,F,
