Place,Name,Sex,Event,Division,WeightClassKg,Equipment,BirthYear,Team,BodyweightKg,Squat1Kg,Squat2Kg,Squat3Kg,Best3SquatKg,Bench1Kg,Bench2Kg,Bench3Kg,Best3BenchKg,Deadlift1Kg,Deadlift2Kg,Deadlift3Kg,Best3DeadliftKg,TotalKg,Age,BirthDate
1,Alexandra Trevino,F,SBD,F-Jr,52,Single-ply,,,51.8,-115,-117.5,117.5,117.5,55,57.5,60,60,115,125,-132.5,125,302.5,,
1,Jennylyn Carrasco,F,SBD,F-Jr,57,Single-ply,1991,,56.6,-142.5,-142.5,150,150,-80,80,85,85,142.5,152.5,160,160,395,,
1,Giovanna Ortega,F,SBD,F-Jr,63,Single-ply,1994,,61.4,180,187.5,192.5,192.5,-85,85,-102.5,85,160,170,-175,170,447.5,,
1,Beverly Crawford,F,SBD,F-Jr,72,Single-ply,1992,,72,205,217.5,222.5,222.5,105,110,112.5,112.5,190,202.5,-210,202.5,537.5,,
2,Cierra Bernard,F,SBD,F-Jr,72,Single-ply,1994,,70.1,-155,155,167.5,167.5,-90,90,-100,90,152.5,165,175,175,432.5,,
DQ,Stacie Pomrening,F,SBD,F-Jr,72,Single-ply,1992,,71.2,-177.5,-177.5,-177.5,,105,115,120,120,160,-167.5,-167.5,160,,,
1,Tammy Cutrona,F,SBD,F-M1,52,Single-ply,1966,,51.4,102.5,-110,110,110,62.5,67.5,-72.5,67.5,107.5,115,120,120,297.5,,
1,Janel Brown,F,SBD,F-M1,57,Single-ply,1973,Brown's Gym,56.1,130,145,155,155,60,65,70,70,130,140,147.5,147.5,372.5,,
1,Lara Sturm,F,SBD,F-M1,63,Single-ply,1968,Team Rohr,62.5,165,-177.5,177.5,177.5,87.5,95,-100,95,-145,152.5,177.5,177.5,450,,
1,Priscilla Ribic,F,SBD,F-M1,72,Single-ply,1972,Titan,72,215,230,-240,230,132.5,142.5,150,150,220,-235,237.5,237.5,617.5,,
2,Rachele Killian,F,SBD,F-M1,72,Single-ply,1969,,71.7,137.5,142.5,-152.5,142.5,92.5,-97.5,-97.5,92.5,142.5,152.5,157.5,157.5,392.5,,
DQ,Colleen Hansford,F,SBD,F-M1,72,Single-ply,1968,Phoinix,71.8,-150,-160,-160,,85,90,-100,90,150,160,-165,160,,,
1,Liane Blyn,F,SBD,F-M1,84,Single-ply,1972,Titan,81.9,222.5,232.5,240,240,167.5,175,183,183,205,212.5,-222.5,212.5,635.5,,
2,Sarah Bohlen,F,SBD,F-M1,84,Single-ply,1969,,78.8,-155,155,162.5,162.5,85,-87.5,87.5,87.5,160,-167.5,-167.5,160,410,,
1,Lakshmi Meadows,F,SBD,F-M1,84+,Single-ply,1975,,111,-215,215,232.5,232.5,117.5,122.5,127.5,127.5,190,200,-205,200,560,,
1,Kimberly Price,F,SBD,F-M2,47,Single-ply,1962,,45.8,95,102.5,-107.5,102.5,50,55,57.5,57.5,125,132.5,-142.5,132.5,292.5,,
1,Antoinette Kemper,F,SBD,F-M2,57,Single-ply,1964,,56.1,137.5,145,150,150,-85,-85,85,85,145,155,-165,155,390,,
2,Lynne Homan,F,SBD,F-M2,57,Single-ply,1962,,56.7,127.5,-137.5,137.5,137.5,90,92.5,95,95,145,155,-162.5,155,387.5,,
3,Monica Sobotka,F,SBD,F-M2,57,Single-ply,1958,,56.7,-102.5,102.5,-107.5,102.5,70,75,-77.5,75,132.5,142.5,-150,142.5,320,,
4,Karen Blessington,F,SBD,F-M2,57,Single-ply,1960,,56,97.5,112.5,120,120,65,-72.5,-72.5,65,122.5,-137.5,-142.5,122.5,307.5,,
1,Tina Crawford,F,SBD,F-M2,63,Single-ply,1965,,62.6,137.5,145,-147.5,145,65,-70,-70,65,140,147.5,160,160,370,,
2,Joni Mach,F,SBD,F-M2,63,Single-ply,1965,Necedah,61.8,112.5,122.5,-132.5,122.5,57.5,65,67.5,67.5,125,135,137.5,137.5,327.5,,
3,Caryn Daniel,F,SBD,F-M2,63,Single-ply,1963,,61.9,112.5,122.5,-127.5,122.5,57.5,62.5,65,65,117.5,127.5,130,130,317.5,,
1,Donna Marts,F,SBD,F-M2,72,Single-ply,1960,,68.9,152.5,160,-167.5,160,102.5,105,-110,105,160,172.5,-182.5,172.5,437.5,,
1,Rhonda Clark,F,SBD,F-M2,84,Single-ply,1965,,76,155,167.5,180,180,77.5,85,90,90,190,202.5,210,210,480,,
2,Laura Styrlund,F,SBD,F-M2,84,Single-ply,1964,,81.4,155,162.5,-170,162.5,110,-120,122.5,122.5,170,182.5,-190,182.5,467.5,,
3,Brenda Hermann,F,SBD,F-M2,84,Single-ply,1965,PRFTNS,80.1,142.5,-150,-160,142.5,115,122.5,-127.5,122.5,157.5,-167.5,-167.5,157.5,422.5,,
4,Chandra Armstead,F,SBD,F-M2,84,Single-ply,1961,,75,70,75,82.5,82.5,60,65,67.5,67.5,92.5,105,120,120,270,,
1,Jill Arnow,F,SBD,F-M2,84+,Single-ply,1959,,90.1,25,-125,-125,25,25,-75,-75,25,75,-125,-125,75,125,,
1,Susan Elwyn,F,SBD,F-M3,47,Single-ply,1947,,46.1,75,97.5,102.5,102.5,45,50,-55,50,102.5,120,,120,272.5,,
1,Denise Johnson,F,SBD,F-M3,52,Single-ply,1947,,50.8,42.5,-47.5,47.5,47.5,32.5,37.5,-40,37.5,75,82.5,90,90,175,,
1,Gail Moore,F,SBD,F-M3,72,Single-ply,1947,,71.2,130,137.5,142.5,142.5,80,85,90,90,135,-142.5,-147.5,135,367.5,,
2,Alma Kimura,F,SBD,F-M3,72,Single-ply,1954,,70.2,-125,-125,130,130,67.5,72.5,-80,72.5,135,142.5,-147.5,142.5,345,,
1,Bebe Burns,F,SBD,F-M4,57,Single-ply,1942,Seattle Strength,52.4,-60,60,65,65,40,42.5,-47.5,42.5,70,82.5,-90.5,82.5,190,,
2,Marie Laurence,F,SBD,F-M4,57,Single-ply,1942,,55.9,45,-52.5,-57.5,45,27.5,30,32.5,32.5,70,75,82.5,82.5,160,,
1,Regina Hackney,F,SBD,F-M4,84,Single-ply,1939,Team Phoenix,82.1,92.5,97.5,-102.5,97.5,65,-70.5,-70.5,65,115,-123,,115,277.5,,
1,Molly Zunker,F,SBD,F-O,47,Single-ply,1991,,46.6,155,160,165,165,72.5,77.5,-82.5,77.5,150,160,-165,160,402.5,,
2,Kimberly Price,F,SBD,F-O,47,Single-ply,1962,,45.8,95,102.5,-107.5,102.5,50,55,57.5,57.5,125,132.5,-142.5,132.5,292.5,,
3,Kimberly Price,F,SBD,F-O,47,Single-ply,1962,,45.8,95,102.5,-107.5,102.5,50,55,57.5,57.5,125,132.5,-142.5,132.5,292.5,,
4,Susan Elwyn,F,SBD,F-O,47,Single-ply,1947,,46.1,75,97.5,102.5,102.5,45,50,-55,50,102.5,120,,120,272.5,,
1,Juanita Najera,F,SBD,F-O,52,Single-ply,1981,,51.5,145,155,162.5,162.5,90,95,-100,95,162.5,165,-172.5,165,422.5,,
2,Ren Yamashita,F,SBD,F-O,52,Single-ply,1989,,51.6,157.5,-165,-165,157.5,95,102.5,-107.5,102.5,160,162.5,-170,162.5,422.5,,
3,Ash-Lee Sikes,F,SBD,F-O,52,Single-ply,1988,,51.4,125,-137.5,-137.5,125,75,80,-85,80,137.5,-145,-145,137.5,342.5,,
1,Rowena Lopez,F,SBD,F-O,57,Single-ply,1977,Titan,56,172.5,180,185,185,112.5,-120,-120,112.5,177.5,185,193,193,490.5,,
2,Katherine Kasabuske,F,SBD,F-O,57,Single-ply,1980,,55.5,170,180,187.5,187.5,95,100,-102.5,100,180,-187.5,-203,180,467.5,,
3,Danielle Bennett,F,SBD,F-O,57,Single-ply,1986,,56.5,160,170,180,180,-82.5,82.5,-95,82.5,132.5,-140,-140,132.5,395,,
4,Alyssa Gaitan,F,SBD,F-O,57,Single-ply,1995,,56.7,152.5,-160,-160,152.5,72.5,-82.5,-82.5,72.5,157.5,-167.5,167.5,167.5,392.5,,
5,Antoinette Kemper,F,SBD,F-O,57,Single-ply,1964,,56.1,137.5,145,150,150,-85,-85,85,85,145,155,-165,155,390,,
6,Lynne Homan,F,SBD,F-O,57,Single-ply,1962,,56.7,127.5,-137.5,137.5,137.5,90,92.5,95,95,145,155,-162.5,155,387.5,,
7,Maura Shuttleworth,F,SBD,F-O,57,Single-ply,1976,,55.7,130,-135,135,135,105,110,-117.5,110,125,132.5,-135,132.5,377.5,,
8,Jessica Stewart,F,SBD,F-O,57,Single-ply,1985,,56.9,105,115,-120,115,65,70,-72.5,70,115,122.5,127.5,127.5,312.5,,
1,Lara Sturm,F,SBD,F-O,63,Single-ply,1968,Team Rohr,62.5,165,-177.5,177.5,177.5,87.5,95,-100,95,-145,152.5,177.5,177.5,450,,
2,Giovanna Ortega,F,SBD,F-O,63,Single-ply,1994,,61.4,180,187.5,192.5,192.5,-85,85,-102.5,85,160,170,-175,170,447.5,,
3,Alexandra Ziepke,F,SBD,F-O,63,Single-ply,1996,,61.3,-140,140,147.5,147.5,65,70,75,75,130,135,137.5,137.5,360,,
DQ,Patricia Southerland,F,SBD,F-O,63,Single-ply,1988,Revfit,62.8,-165,-165,-165,,,,,,,,,,,,
1,Priscilla Ribic,F,SBD,F-O,72,Single-ply,1972,Titan,72,215,230,-240,230,132.5,142.5,150,150,220,-235,237.5,237.5,617.5,,
2,Shaina Vickery,F,SBD,F-O,72,Single-ply,1989,Titan,69.5,200,207.5,-212.5,207.5,122.5,130,135,135,200,210,-217.5,210,552.5,,
3,Beverly Crawford,F,SBD,F-O,72,Single-ply,1992,,72,205,217.5,222.5,222.5,105,110,112.5,112.5,190,202.5,-210,202.5,537.5,,
4,Dakota Young,F,SBD,F-O,72,Single-ply,1996,,71.8,200,210,215,215,102.5,-107.5,-107.5,102.5,197.5,202.5,-205,202.5,520,,
5,Vanessa Resler,F,SBD,F-O,72,Single-ply,1983,,69.2,152.5,157.5,162.5,162.5,82.5,-87.5,87.5,87.5,165,172.5,-182.5,172.5,422.5,,
DQ,Stacie Pomrening,F,SBD,F-O,72,Single-ply,1992,,71.2,-177.5,-177.5,-177.5,,105,115,120,120,160,-167.5,-167.5,160,,,
1,Liane Blyn,F,SBD,F-O,84,Single-ply,1972,Titan,81.9,222.5,232.5,240,240,167.5,175,183,183,205,212.5,-222.5,212.5,635.5,,
2,Natalie Hanson,F,SBD,F-O,84,Single-ply,1990,,81.6,220,230,242.5,242.5,145,150,-157.5,150,202.5,212.5,-215,212.5,605,,
3,Jessica O'Donnell,F,SBD,F-O,84,Single-ply,1980,,82.8,217.5,-232.5,235,235,140,145,150,150,210,-222.5,-222.5,210,595,,
4,Monet Bland,F,SBD,F-O,84,Single-ply,1991,,82.4,215,222.5,227.5,227.5,92.5,-97.5,100,100,200,-212.5,-212.5,200,527.5,,
5,Sandra Olisa,F,SBD,F-O,84,Single-ply,1986,,76.2,-175,175,-185,175,55,-60,60,60,175,182.5,190,190,425,,
6,Brenda Hermann,F,SBD,F-O,84,Single-ply,1965,PRFTNS,80.1,142.5,-150,-160,142.5,115,122.5,-127.5,122.5,157.5,-167.5,-167.5,157.5,422.5,,
1,Lakshmi Meadows,F,SBD,F-O,84+,Single-ply,1975,,111,-215,215,232.5,232.5,117.5,122.5,127.5,127.5,190,200,-205,200,560,,
2,Andrea Page,F,SBD,F-O,84+,Single-ply,1977,Team Phoinix,115.2,210,-227.5,227.5,227.5,-120,120,130,130,190,200,-207.5,200,557.5,,
DQ,Sara Rodock,F,SBD,F-O,84+,Single-ply,1981,,93.5,-180,-185,-192.5,,112.5,-117.5,120,120,140,-152.5,-152.5,140,,,
DQ,Katey Dodge,F,SBD,F-O,84+,Single-ply,1981,,97.4,-182.5,-187.5,-187.5,,102.5,107.5,-115,107.5,-162.5,162.5,-182.5,162.5,,,
DQ,Tiffany McKinney,F,SBD,F-O,84+,Single-ply,1989,,102.3,-210,-210,-210,,190,200,207.5,207.5,182.5,197.5,-205,197.5,,,
DQ,Kaitlyn Pelitire,F,SBD,F-T1,47,Single-ply,2000,Beeville,46.4,-125,-125,-125,,,,,,,,,,,,
1,Karina Garay,F,SBD,F-T1,52,Single-ply,1999,,50.6,100,110,-115,110,57.5,65,67.5,67.5,102.5,110,-115,110,287.5,,
2,Tammy Idrogo,F,SBD,F-T1,52,Single-ply,1999,,49.9,97.5,105,110,110,-45,45,-50,45,112.5,125,-132.5,125,280,,
1,Shayenne Naquin,F,SBD,F-T1,57,Single-ply,,Lutcher,56.7,115,125,-132.5,125,60,70,75,75,112.5,125,132.5,132.5,332.5,,
2,Sarah Gautreaux,F,SBD,F-T1,57,Single-ply,2000,,55.6,130,-137.5,137.5,137.5,62.5,67.5,75,75,105,112.5,117.5,117.5,330,,
3,Brianna Diaz,F,SBD,F-T1,57,Single-ply,1998,,55.7,62.5,-75,75,75,37.5,-47.5,-47.5,37.5,85,97.5,102.5,102.5,215,,
1,Alyssa Kuss,F,SBD,F-T1,63,Single-ply,1999,,61.8,-152.5,-155,155,155,57.5,62.5,-65,62.5,157.5,-172.5,-185,157.5,375,,
2,Remington Trewyn,F,SBD,F-T1,63,Single-ply,2000,Necedah,62.3,-122.5,122.5,130,130,57.5,-60,60,60,120,127.5,137.5,137.5,327.5,,
3,Abigail Saunders,F,SBD,F-T1,63,Single-ply,2000,Necedah,59,110,115,120,120,42.5,45,-47.5,45,135,-142.5,-145,135,300,,
1,Nallely Gutierrez,F,SBD,F-T1,72,Single-ply,2000,,65.3,75,82.5,-97.5,82.5,50,57.5,-62.5,57.5,105,117.5,122.5,122.5,262.5,,
2,Nallely Gutierrez,F,SBD,F-T1,72,Single-ply,2000,Brooks Academy,65.3,75,,,75,52.5,,,52.5,105,,,105,232.5,,
1,Samantha Heimer,F,SBD,F-T1,84+,Single-ply,2000,Brooks Academy,98.8,102.5,117.5,-125,117.5,67.5,72.5,80,80,92.5,102.5,112.5,112.5,310,,
1,Ashley Mitchell,F,SBD,F-T2,43,Single-ply,1997,,42.2,102.5,-112.5,115,115,55,60,-65,60,125,-137.5,142.5,142.5,317.5,,
2,Stephanie Rattunde,F,SBD,F-T2,43,Single-ply,1997,Necedah,42.7,120,122.5,125,125,57.5,62.5,-65,62.5,125,130,-132.5,130,317.5,,
1,Katherine Rodriguez,F,SBD,F-T2,47,Single-ply,1998,,46.2,-57.5,57.5,-70,57.5,27.5,32.5,-35,32.5,90,-95,-95,90,180,,
1,Julissa Ortiz,F,SBD,F-T2,52,Single-ply,1997,,51.4,132.5,137.5,140,140,60,-65,-67.5,60,137.5,-147.5,147.5,147.5,347.5,,
2,Devyn Turner,F,SBD,F-T2,52,Single-ply,1998,,49.8,107.5,-110,-112.5,107.5,60,62.5,67.5,67.5,110,115,-122.5,115,290,,
3,Betzaidalis Rosado-mijica,F,SBD,F-T2,52,Single-ply,,Brooks Academy,49.9,82.5,100,102.5,102.5,60,67.5,-70,67.5,107.5,112.5,-120,112.5,282.5,,
4,Amira Baloney,F,SBD,F-T2,52,Single-ply,1997,Lutcher,48.2,75,80,-85,80,40,45,52.5,52.5,80,90,102.5,102.5,235,,
1,Alana Montes,F,SBD,F-T2,57,Single-ply,1998,,56.1,140,-150,-150,140,65,72.5,77.5,77.5,150,157.5,162.5,162.5,380,,
2,Rhiannon Mach,F,SBD,F-T2,57,Single-ply,1998,Necedah,56.6,127.5,132.5,137.5,137.5,52.5,57.5,62.5,62.5,115,120,122.5,122.5,322.5,,
3,Jodel Patino,F,SBD,F-T2,57,Single-ply,1997,Brooks Academy,55.2,85,-100,110,110,67.5,-75,-75,67.5,127.5,142.5,-147.5,142.5,320,,
4,Hannah Poche,F,SBD,F-T2,57,Single-ply,1998,Lutcher,55.8,120,-130,-130,120,62.5,72.5,-77.5,72.5,115,-127.5,-135,115,307.5,,
5,Koeller Tristan,F,SBD,F-T2,57,Single-ply,1998,Necedah,56.5,102.5,-112.5,112.5,112.5,-45,45,50,50,102.5,112.5,120,120,282.5,,
1,Sam Kroll,F,SBD,F-T2,63,Single-ply,1997,EC North,60.2,152.5,-160,162.5,162.5,90,95,-97.5,95,135,142.5,147.5,147.5,405,,
2,Morgan DeGuire,F,SBD,F-T2,63,Single-ply,,Necedah,60.7,140,-152.5,155,155,-57.5,57.5,62.5,62.5,140,142.5,160,160,377.5,,
3,Delanie Hamilton,F,SBD,F-T2,63,Single-ply,1998,Lutcher,62.3,120,-132.5,135,135,65,72.5,80,80,120,135,147.5,147.5,362.5,,
4,Emily Palomaki,F,SBD,F-T2,63,Single-ply,1996,,61.8,125,137.5,140,140,60,65,-70,65,115,-125,-125,115,320,,
1,Zena Esquivel,F,SBD,F-T2,72,Single-ply,1997,,71.4,150,160,-172.5,160,87.5,92.5,-95,92.5,160,-170,170,170,422.5,,
2,Mia Casas,F,SBD,F-T2,72,Single-ply,1997,,67.6,135,147.5,160,160,67.5,77.5,80,80,140,-155,155,155,395,,
3,Bella Johnson,F,SBD,F-T2,72,Single-ply,,,68.5,115,125,-132.5,125,77.5,-82.5,82.5,82.5,120,-127.5,127.5,127.5,335,,
4,Natalie Picou,F,SBD,F-T2,72,Single-ply,1997,,68,95,105,127.5,127.5,47.5,52.5,60,60,102.5,112.5,-125,112.5,300,,
5,Kelsie Zeller,F,SBD,F-T2,72,Single-ply,1999,Lutcher,65.5,85,95,102.5,102.5,42.5,47.5,52.5,52.5,102.5,115,125,125,280,,
DQ,Samantha Sherwood,F,SBD,F-T2,72,Single-ply,1999,,69.8,-165,-165,-165,,-67.5,,,,,,,,,,
1,Amyri Davis,F,SBD,F-T2,84,Single-ply,1997,Lutcher,83.2,-175,175,195,195,102.5,-112.5,-112.5,102.5,140,157.5,-187.5,157.5,455,,
2,Tamera Lusk,F,SBD,F-T2,84,Single-ply,1997,,80.5,167.5,185,195,195,77.5,82.5,-90,82.5,175,-195,-210,175,452.5,,
3,Alexis Ortiz #1,F,SBD,F-T2,84,Single-ply,1998,,77.4,162.5,177.5,182.5,182.5,82.5,-92.5,95,95,130,145,147.5,147.5,425,,
4,Liz Blankenship,F,SBD,F-T2,84,Single-ply,,,77.5,137.5,152.5,-160,152.5,65,72.5,-77.5,72.5,142.5,160,170,170,395,,
5,Melissa Reyes,F,SBD,F-T2,84,Single-ply,1998,,82.6,-150,-150,160,160,70,75,-80,75,147.5,152.5,160,160,395,,
6,Krystal Ortiz,F,SBD,F-T2,84,Single-ply,1999,,81.7,132.5,142.5,-155,142.5,-92.5,92.5,-102.5,92.5,142.5,-157.5,-157.5,142.5,377.5,,
7,Hailee Ruskowsky,F,SBD,F-T2,84,Single-ply,1998,Necedah,75.1,150,162.5,170,170,52.5,57.5,62.5,62.5,130,135,137.5,137.5,370,,
8,Megan Martinez,F,SBD,F-T2,84,Single-ply,1997,Brooks Academy,76.1,137.5,152.5,-157.5,152.5,67.5,75,77.5,77.5,110,117.5,140,140,370,,
9,Alexis Davis,F,SBD,F-T2,84,Single-ply,1998,,81.4,145,155,-167.5,155,67.5,70,72.5,72.5,137.5,-155,-155,137.5,365,,
1,China Storks,F,SBD,F-T2,84+,Single-ply,1997,Lutcher,112.8,180,195,210,210,100,112.5,120,120,165,180,-192.5,180,510,,
2,Cassie Guidry,F,SBD,F-T2,84+,Single-ply,1998,,137,180,195,205,205,75,80,92.5,92.5,130,142.5,152.5,152.5,450,,
3,Elizabeth Neitch,F,SBD,F-T2,84+,Single-ply,1998,,90.3,172.5,177.5,180,180,85,90,95,95,155,162.5,-177.5,162.5,437.5,,
4,Jacie Milton,F,SBD,F-T2,84+,Single-ply,,,100.6,142.5,152.5,162.5,162.5,70,77.5,85,85,130,142.5,-152.5,142.5,390,,
5,Alexzandria Garcia,F,SBD,F-T2,84+,Single-ply,1998,,86.1,160,165,-172.5,165,52.5,60,65,65,140,150,157.5,157.5,387.5,,
1,Kaitlin Reyes,F,SBD,F-T3,47,Single-ply,1997,,45.7,-117.5,117.5,125,125,65,70,75,75,115,125,130,130,330,,
2,Alena Trinidad,F,SBD,F-T3,47,Single-ply,1996,Necedah,46.6,112.5,125,-127.5,125,47.5,52.5,55,55,115,-125,-127.5,115,295,,
3,Zyra Warfield,F,SBD,F-T3,47,Single-ply,1997,,46.9,-90,92.5,-100,92.5,37.5,42.5,-47.5,42.5,100,115,120,120,255,,
1,Alyssa Gaitan,F,SBD,F-T3,57,Single-ply,1995,,56.7,152.5,-160,-160,152.5,72.5,-82.5,-82.5,72.5,157.5,-167.5,167.5,167.5,392.5,,
2,Selina Velasquez,F,SBD,F-T3,57,Single-ply,1997,,55.4,-135,145,-152.5,145,52.5,57.5,-60,57.5,152.5,160,170,170,372.5,,
3,Sabrina Albury,F,SBD,F-T3,57,Single-ply,1997,Brooks Academy,56.9,70,92.5,102.5,102.5,65,75,80,80,65,95,107.5,107.5,290,,
DQ,Tristyn Hutchins,F,SBD,F-T3,57,Single-ply,1997,Necedah,55.1,-155,155,-170,155,-92.5,-100,-100,,-147.5,,,,,,
1,Autumn Herried,F,SBD,F-T3,63,Single-ply,1995,Necedah,61.5,145,152.5,160,160,77.5,85,-87.5,85,132.5,140,145,145,390,,
2,Amanda Zielinski,F,SBD,F-T3,63,Single-ply,1997,Necedah,62.1,140,152.5,-162.5,152.5,75,-82.5,82.5,82.5,142.5,152.5,-155,152.5,387.5,,
3,Alexandra Ziepke,F,SBD,F-T3,63,Single-ply,1996,,61.3,-140,140,147.5,147.5,65,70,75,75,130,135,137.5,137.5,360,,
4,Jasmine Ruiz,F,SBD,F-T3,63,Single-ply,1997,Brooks Academy,59.4,117.5,130,132.5,132.5,72.5,77.5,85,85,105,112.5,120,120,337.5,,
1,Dakota Young,F,SBD,F-T3,72,Single-ply,1996,,71.8,200,210,215,215,102.5,-107.5,-107.5,102.5,197.5,202.5,-205,202.5,520,,
2,Natalie Barrera,F,SBD,F-T3,72,Single-ply,1997,Titan,71.8,175,180,185,185,90,100,107.5,107.5,140,-160,160,160,452.5,,
3,Jade Dardar,F,SBD,F-T3,72,Single-ply,1996,,68.8,60,70,-80,70,45,52.5,60.5,60.5,110,-130,-130,110,240.5,,
DQ,Talia Ramirez,F,SBD,F-T3,72,Single-ply,1995,,70.7,-177.5,-177.5,-177.5,,-62.5,,,,,,,,,,
1,Delicia Garza,F,SBD,F-T3,84,Single-ply,1996,,83.7,177.5,190,195,195,-105,-105,105,105,185,195,200,200,500,,
2,McKenzie Curtis,F,SBD,F-T3,84,Single-ply,1997,PRFTNS,82.2,182.5,-192.5,192.5,192.5,90,95,97.5,97.5,182.5,192.5,195,195,485,,
3,Lacey Winters,F,SBD,F-T3,84,Single-ply,1997,Necedah,83.5,172.5,-177.5,182.5,182.5,75,-82.5,-82.5,75,192.5,202.5,-212.5,202.5,460,,
4,Danielle Kent,F,SBD,F-T3,84,Single-ply,1996,,76.8,-140,-142.5,150,150,72.5,77.5,-82.5,77.5,142.5,150,-160,150,377.5,,
5,Brynna Shepard,F,SBD,F-T3,84,Single-ply,1997,,81.6,110,125,-132.5,125,40,65,75,75,125,145,-152.5,145,345,,
1,Jaelynn Mcbride,F,SBD,F-T3,84+,Single-ply,1996,,118.3,240,252.5,-260,252.5,135,142.5,-147.5,142.5,207.5,215,-217.5,215,610,,
1,Heather Callejas,F,SBD,F-T3,84+,Single-ply,1997,,98.3,182.5,195,-207.5,195,100,107.5,-117.5,107.5,170,182.5,-207.5,182.5,485,,
2,Jasmine Davis #3,F,SBD,F-T3,84+,Single-ply,1996,Lutcher,122.3,170,185,-197.5,185,-85,90,-107.5,90,130,142.5,152.5,152.5,427.5,,
DQ,Ashley Olivarez,F,SBD,F-T3,84+,Single-ply,1996,,113.5,-172.5,-175,-182.5,,-110,,,,-137.5,,,,,,
DQ,Vivianna Flores,F,SBD,F-T3,84+,Single-ply,,,123.7,-257.5,-257.5,-257.5,,-120,120,130,130,165,-175,-175,165,,,
1,Kristal Rodriguez,F,SBD,F-Y,47,Single-ply,2002,,43.6,20,45,52.5,52.5,20,27.5,37.5,37.5,57.5,70,77.5,77.5,167.5,,
1,Liszette Ortiz-Rosado,F,SBD,F-Y,52,Single-ply,2001,Brooks Academy,50.6,30,-60,-62.5,30,30,45,-53,45,67.5,82.5,-90,82.5,157.5,,
1,DeAnna Wood,F,SBD,F-Y,84,Single-ply,2002,Brooks Academy,78.2,25,40,45,45,27.5,32.5,35,35,60,80,85,85,165,,
1,Kaylie Rodriguez,F,SBD,F-Y,84+,Single-ply,2003,,99.7,-25,25,42.5,42.5,25,32.5,37.5,37.5,52.5,72.5,80,80,160,,
1,Mario Leos,M,SBD,M-Jr,59,Single-ply,1992,,58.2,182.5,-192.5,197.5,197.5,140,147.5,153,153,207.5,222.5,-227.5,222.5,573,,
2,Shawn Womack,M,SBD,M-Jr,59,Single-ply,1994,,54.8,120,130,137.5,137.5,77.5,-82.5,-85,77.5,132.5,152.5,-160,152.5,367.5,,
1,James Vang,M,SBD,M-Jr,66,Single-ply,1992,Quest,65.8,247.5,-262.5,262.5,262.5,162.5,170,177.5,177.5,235,250,-262.5,250,690,,
2,Jerry Alaniz,M,SBD,M-Jr,66,Single-ply,1995,Titan,65.1,230,242.5,255,255,160,172.5,-180,172.5,217.5,232.5,-240,232.5,660,,
3,Jerrell Howell,M,SBD,M-Jr,66,Single-ply,1994,MISS,65.1,200,215,-222.5,215,97.5,105,112.5,112.5,190,202.5,-215,202.5,530,,
1,Aaron Pomerantz,M,SBD,M-Jr,74,Single-ply,1995,,73.3,245,255,265,265,217.5,235,-247.5,235,227.5,240,-257.5,240,740,,
2,Michael Elizondo,M,SBD,M-Jr,74,Single-ply,1993,,73.1,185,-207.5,-207.5,185,-165,165,-172.5,165,230,237.5,-250,237.5,587.5,,
3,Tyler Washington,M,SBD,M-Jr,74,Single-ply,1995,,73.1,185,-200,-200,185,117.5,122.5,-130,122.5,230,245,-255,245,552.5,,
1,Mauricio Valdez,M,SBD,M-Jr,83,Single-ply,1994,,82.5,267.5,280,290,290,-190,190,-197.5,190,267.5,280,287.5,287.5,767.5,,
2,Christopher Lapniewski,M,SBD,M-Jr,83,Single-ply,1993,,82.1,222.5,235,-242.5,235,-150,-150,150,150,215,225,232.5,232.5,617.5,,
3,Adam Tuppen,M,SBD,M-Jr,83,Single-ply,1994,,82.2,220,230,240,240,150,-160,-167.5,150,215,227.5,-232.5,227.5,617.5,,
1,Ian Bell,M,SBD,M-Jr,93,Single-ply,1992,Titan,92.2,350,365,375,375,-215,215,,215,347.5,370,377.5,377.5,967.5,,
2,Sam Nemir,M,SBD,M-Jr,93,Single-ply,1993,,92.6,265,270,-275,270,180,-185,-187.5,180,260,265,-272.5,265,715,,
3,Luis Munoz #6,M,SBD,M-Jr,93,Single-ply,1987,,88.7,270,285,295,295,157.5,165,172.5,172.5,227.5,-242.5,-265,227.5,695,,
DQ,Curtis Gaines,M,SBD,M-Jr,93,Single-ply,1992,,90.7,-292.5,-292.5,-292.5,,-195,,,,,,,,,,
1,Quintin Meyer,M,SBD,M-Jr,105,Single-ply,1991,PRFTNS,103.8,320,340,355,355,-225,-225,225,225,320,327.5,-337.5,327.5,907.5,,
2,AJ Alvarez,M,SBD,M-Jr,105,Single-ply,1994,Titan,102.6,312.5,322.5,337.5,337.5,230,235,240,240,287.5,-312.5,-312.5,287.5,865,,
3,Tery Powell,M,SBD,M-Jr,105,Single-ply,1993,,103.7,290,310,325,325,190,197.5,-207.5,197.5,282.5,292.5,297.5,297.5,820,,
1,James Meador,M,SBD,M-Jr,120,Single-ply,,,109.4,325,345,365,365,-200,200,-210,200,275,287.5,290,290,855,,
2,Brian Bowman,M,SBD,M-Jr,120,Single-ply,1994,,116.3,235,-277.5,280,280,-205,220,-240,220,200,222.5,235,235,735,,
3,Matt Frolik,M,SBD,M-Jr,120,Single-ply,,UHD,112.1,250,272.5,-282.5,272.5,175,182.5,-187.5,182.5,227.5,250,-280,250,705,,
1,Eric Cordeiro,M,SBD,M-M1a,83,Single-ply,1975,,82.5,245,250,-257.5,250,145,150,-152.5,150,220,227.5,-235,227.5,627.5,,
2,Chris Clark,M,SBD,M-M1a,83,Single-ply,1972,,81.7,-227.5,227.5,-237.5,227.5,165,175,-180,175,205,220,-225,220,622.5,,
1,Pete Grohoski,M,SBD,M-M1a,93,Single-ply,1970,Titan,92.6,-252.5,252.5,262.5,262.5,252.5,-265,-265,252.5,230,247.5,-257.5,247.5,762.5,,
2,Alfonso Alarez,M,SBD,M-M1a,93,Single-ply,,,90.1,-235,235,250,250,160,170,-187.5,170,235,240,-247.5,240,660,,
1,Vasil Gushterov,M,SBD,M-M1a,105,Single-ply,1975,,104.9,285,305,320,320,240,-250,-250,240,320,330,-345,330,890,,
2,Marcus Warren,M,SBD,M-M1a,105,Single-ply,1974,,101.4,-280,-282.5,282.5,282.5,235,237.5,-242.5,237.5,272.5,-282.5,-282.5,272.5,792.5,,
3,Jason Johnson #1,M,SBD,M-M1a,105,Single-ply,1971,PRFTNS,104.7,265,277.5,285,285,215,227.5,-237.5,227.5,255,270,-282.5,270,782.5,,
1,Steve Mann #1,M,SBD,M-M1a,120,Single-ply,1975,,119.8,385,402.5,412.5,412.5,280,290,297.5,297.5,285,-305,-315,285,995,,
2,Andre Gholson,M,SBD,M-M1a,120,Single-ply,1971,,111.6,317.5,330,,330,227.5,237.5,-242.5,237.5,262.5,,,262.5,830,,
3,Robert Mullener,M,SBD,M-M1a,120,Single-ply,1974,,118.3,215,-230,230,230,165,170,-177.5,170,215,230,-235,230,630,,
1,Patrick Anderson,M,SBD,M-M1a,120+,Single-ply,1971,Titan,133.7,300,320,332.5,332.5,235,250,257.5,257.5,250,275,-290,275,865,,
DQ,James Chantler,M,SBD,M-M1a,120+,Single-ply,1971,,147,-302.5,-312.5,-317.5,,-225,,,,,,,,,,
1,Eric Kupperstein,M,SBD,M-M1b,59,Single-ply,1966,,58.8,217.5,232.5,240,240,90,97.5,102.5,102.5,227.5,-247.5,-252.5,227.5,570,,
DQ,Michael Macri,M,SBD,M-M1b,74,Single-ply,1969,,73.8,-210,-210,-210,,82.5,,,82.5,205,227.5,-242.5,227.5,,,
1,Daniel Thurman,M,SBD,M-M1b,83,Single-ply,1968,,82.8,215,227.5,240,240,215,-240,240,240,192.5,205,-227.5,205,685,,
2,Ken Bray,M,SBD,M-M1b,83,Single-ply,1969,,78.6,170,182.5,-192.5,182.5,115,120,-125,120,230,247.5,-270,247.5,550,,
3,Kurt Sokolski,M,SBD,M-M1b,83,Single-ply,1969,,81,180,-195,-195,180,105,-147.5,-147.5,105,192.5,215,-227.5,215,500,,
1,Jeff Blindauer,M,SBD,M-M1b,93,Single-ply,1969,,87.2,207.5,215,220,220,175,180,-185,180,242.5,257.5,262.5,262.5,662.5,,
1,Kenneth Gack,M,SBD,M-M1b,105,Single-ply,1970,,103.9,285,-300,-300,285,215,-232.5,232.5,232.5,260,277.5,287.5,287.5,805,,
2,Alan Krockover,M,SBD,M-M1b,105,Single-ply,1968,,103.7,250,265,275,275,170,185,-190,185,245,-252.5,252.5,252.5,712.5,,
1,Greg Simmons #2,M,SBD,M-M2a,66,Single-ply,,,65.6,190,202.5,210,210,135,142.5,-147.5,142.5,190,200,205,205,557.5,,
2,Tim Smith #1,M,SBD,M-M2a,66,Single-ply,1963,,64.8,185,-192.5,192.5,192.5,112.5,117.5,120,120,215,-227.5,-235,215,527.5,,
1,Darren Matsumoto,M,SBD,M-M2a,83,Single-ply,1964,,80.5,-265,265,-277.5,265,197.5,207.5,212.5,212.5,230,-240,-240,230,707.5,,
1,Jim Brown,M,SBD,M-M2a,93,Single-ply,1965,,91.7,290,307.5,320,320,200,217.5,225,225,235,255,262.5,262.5,807.5,,
2,Russell Clark,M,SBD,M-M2a,93,Single-ply,1961,Virtus,91.7,272.5,282.5,292.5,292.5,182.5,190,197.5,197.5,262.5,280,-290,280,770,,
3,Mark Daniel,M,SBD,M-M2a,93,Single-ply,1962,,90,207.5,217.5,220,220,157.5,165,170,170,210,222.5,227.5,227.5,617.5,,
4,Ron Falcone,M,SBD,M-M2a,93,Single-ply,,,92.6,210,225,235,235,130,145,150,150,185,205,212.5,212.5,597.5,,
5,Rick Johnson,M,SBD,M-M2a,93,Single-ply,1963,,92.7,-215,215,227.5,227.5,112.5,-122.5,-122.5,112.5,232.5,252.5,-280,252.5,592.5,,
1,Wilson Martinez,M,SBD,M-M2a,120,Single-ply,1965,,107.8,265,-282.5,282.5,282.5,172.5,177.5,182.5,182.5,262.5,272.5,280,280,745,,
2,Tim Womack,M,SBD,M-M2a,120,Single-ply,1961,,110.6,237.5,255,267.5,267.5,182.5,192.5,197.5,197.5,230,245,250,250,715,,
1,Steve Johnson #1,M,SBD,M-M2a,120+,Single-ply,1961,,126.9,-210,210,,210,125,182.5,-187.5,182.5,207.5,227.5,-230,227.5,620,,
DQ,Daniel Gaudreau,M,SBD,M-M2a,120+,Single-ply,1960,,141.3,-320,-320,-320,,,,,,,,,,,,
DQ,Randy Earle,M,SBD,M-M2a,120+,Single-ply,1962,,151.8,-305,-305,-307.5,,225,237.5,-245,237.5,272.5,287.5,300,300,,,
1,Carlos Lewis,M,SBD,M-M2b,74,Single-ply,1958,PHANTOM,73.1,205,215,-227.5,215,120,130,-135,130,140,170,200,200,545,,
1,Daniel Austin #1,M,SBD,M-M2b,83,Single-ply,1958,,81.5,275,297.5,305,305,137.5,145,150,150,255,-275,-275,255,710,,
2,Thomas Cencich,M,SBD,M-M2b,83,Single-ply,1960,,82.6,170,200,-210,200,192.5,-205.5,-205.5,192.5,190,202.5,207.5,207.5,600,,
3,David Wiley #1,M,SBD,M-M2b,83,Single-ply,1955,,82.1,200,215,227.5,227.5,120,132.5,-142.5,132.5,192.5,217.5,222.5,222.5,582.5,,
1,Chuck Akers,M,SBD,M-M2b,93,Single-ply,1959,,91.5,195,207.5,212.5,212.5,145,150,155,155,202.5,212.5,,212.5,580,,
2,Jeff Pagan,M,SBD,M-M2b,93,Single-ply,1957,,92.3,190,202.5,-207.5,202.5,-155,-155,155,155,200,210,-215,210,567.5,,
1,Gary Pamplin,M,SBD,M-M2b,105,Single-ply,1957,,104.6,282.5,305,317.5,317.5,232.5,237.5,242.5,242.5,227.5,237.5,240,240,800,,
2,Ray Baxter-Vonna,M,SBD,M-M2b,105,Single-ply,1958,,97.5,255,272.5,282.5,282.5,177.5,182.5,190,190,242.5,255,262.5,262.5,735,,
1,Jason Julian,M,SBD,M-M2b,120,Single-ply,1960,PRFTNS,113.4,-227.5,227.5,235,235,202.5,212.5,-220,212.5,-220,220,-232.5,220,667.5,,
1,Robert Keyes,M,SBD,M-M2b,120+,Single-ply,1960,,141.6,267.5,280,292.5,292.5,125,215,227.5,227.5,227.5,275,295,295,815,,
1,Paul Mears #1,M,SBD,M-M3a,66,Single-ply,1953,,65.7,145,155,157.5,157.5,72.5,82.5,87.5,87.5,177.5,-190,-190,177.5,422.5,,
1,Leslie Newton,M,SBD,M-M3a,83,Single-ply,1955,,80.8,182.5,192.5,-200,192.5,137.5,142.5,145,145,192.5,200,207.5,207.5,545,,
2,Bill Clayton,M,SBD,M-M3a,83,Single-ply,1953,,82.2,182.5,192.5,-200,192.5,125,132.5,137.5,137.5,185,197.5,-210,197.5,527.5,,
1,Charles Gilmore,M,SBD,M-M3a,93,Single-ply,1952,,90.4,152.5,165,-177.5,165,102.5,-112.5,112.5,112.5,207.5,220,227.5,227.5,505,,
2,Duane Bartolet,M,SBD,M-M3a,93,Single-ply,1953,,88.5,-182.5,182.5,-200,182.5,105,110,112.5,112.5,182.5,197.5,205,205,500,,
1,Bill Sindelar,M,SBD,M-M3a,120,Single-ply,1951,,116.7,212.5,227.5,237.5,237.5,160,170,182.5,182.5,215,227.5,237.5,237.5,657.5,,
1,Robert Crawford #1,M,SBD,M-M3a,120+,Single-ply,1951,,146.1,165,195,205,205,175,-205,-205,175,150,-175,,150,530,,
1,Alex Galant,M,SBD,M-M3b,59,Single-ply,1947,Titan,58.8,67.5,-70,72.5,72.5,32.5,,37.5,37.5,80,82.5,85,85,195,,
1,Mike Rosenwald,M,SBD,M-M3b,74,Single-ply,1948,,73.1,125,135,142.5,142.5,77.5,82.5,-87.5,82.5,-137.5,137.5,147.5,147.5,372.5,,
1,Jack Rankin,M,SBD,M-M3b,83,Single-ply,1947,,81.4,-177.5,177.5,187.5,187.5,87.5,-92.5,-92.5,87.5,187.5,-195,-195,187.5,462.5,,
2,Jim Klostergaard,M,SBD,M-M3b,83,Single-ply,1948,,82.6,125,,,125,115,125,,125,165,185,-200,185,435,,
1,Robert Trujillo #1,M,SBD,M-M4a,59,Single-ply,1944,,57.8,130,-142.5,142.5,142.5,-85,90,92.5,92.5,162.5,172.5,177.5,177.5,412.5,,
1,Alan R. Tepper,M,SBD,M-M4a,83,Single-ply,,,81.2,185,195,-200,195,-132.5,132.5,-135,132.5,212.5,222.5,227.5,227.5,555,,
1,Fred Rice,M,SBD,M-M4a,93,Single-ply,,,92,185,200,-210,200,92.5,100,105,105,227.5,-240,240,240,545,,
1,Bill Helmich,M,SBD,M-M4a,105,Single-ply,1942,,104.5,155,165,,165,142.5,152.5,-165,152.5,182.5,205,215,215,532.5,,
1,Michael Nichols #1,M,SBD,M-M4a,120,Single-ply,1945,,110.1,142.5,155,165,165,112.5,117.5,122.5,122.5,175,187.5,197.5,197.5,485,,
1,Harry Heyman,M,SBD,M-M4a,120+,Single-ply,1942,,121.8,65,,,65,60,-62.5,,60,100,,,100,225,,
1,Tom O'Keefe,M,SBD,M-M5a,93,Single-ply,1935,,90.2,137.5,147.5,-157.5,147.5,-97.5,97.5,-103,97.5,162.5,172.5,-182.5,172.5,417.5,,
2,Raymond Curtis,M,SBD,M-M5a,93,Single-ply,1932,,90.1,97.5,-110,-110,97.5,85,-105,-110,85,137.5,-147.5,147.5,147.5,330,,
1,Christopher Tran #1,M,SBD,M-O,59,Single-ply,1988,Titan,58.6,230,245.5,250,250,132.5,140,145,145,227.5,242.5,-247.5,242.5,637.5,,
2,Eric Kupperstein,M,SBD,M-O,59,Single-ply,1966,,58.8,217.5,232.5,240,240,90,97.5,102.5,102.5,227.5,-247.5,-252.5,227.5,570,,
3,Kenneth Johnson,M,SBD,M-O,59,Single-ply,1997,PFTNS,52.6,160,172.5,-180,172.5,80,-87.5,-87.5,80,177.5,-200,-200,177.5,430,,
4,Cordarius Harris,M,SBD,M-O,59,Single-ply,2000,,51.6,110,-137.5,140,140,80,90,-95,90,140,165,177.5,177.5,407.5,,
5,Charlie Rosa,M,SBD,M-O,59,Single-ply,1997,,52.8,125,132.5,-142.5,132.5,72.5,77.5,80,80,152.5,162.5,170,170,382.5,,
6,Shawn Womack,M,SBD,M-O,59,Single-ply,1994,,54.8,120,130,137.5,137.5,77.5,-82.5,-85,77.5,132.5,152.5,-160,152.5,367.5,,
1,Damarrio Holloway,M,SBD,M-O,66,Single-ply,1980,Quest,65.8,250,257.5,262.5,262.5,170,182.5,-185,182.5,260,-272.5,-285,260,705,,
2,Damarrio Holloway,M,SBD,M-O,66,Single-ply,1980,Quest,65.8,250,257.5,262.5,262.5,170,182.5,-185,182.5,260,-272.5,-285,260,705,,
3,James Vang,M,SBD,M-O,66,Single-ply,1992,Quest,65.8,247.5,-262.5,262.5,262.5,162.5,170,177.5,177.5,235,250,-262.5,250,690,,
4,James Vang,M,SBD,M-O,66,Single-ply,1992,Quest,65.8,247.5,-262.5,262.5,262.5,162.5,170,177.5,177.5,235,250,-262.5,250,690,,
5,Jerry Alaniz,M,SBD,M-O,66,Single-ply,1995,Titan,65.1,230,242.5,255,255,160,172.5,-180,172.5,217.5,232.5,-240,232.5,660,,
6,Michael Hafenbrack,M,SBD,M-O,66,Single-ply,1984,Titan,65.1,245,-255,-255,245,152.5,160,-165,160,240,-260,-260,240,645,,
7,Alexander Kang,M,SBD,M-O,66,Single-ply,1984,,65.1,-227.5,-227.5,227.5,227.5,135,140,142.5,142.5,-222.5,237.5,-257.5,237.5,607.5,,
8,Greg Simmons #2,M,SBD,M-O,66,Single-ply,,,65.6,190,202.5,210,210,135,142.5,-147.5,142.5,190,200,205,205,557.5,,
9,Tim Smith #1,M,SBD,M-O,66,Single-ply,1963,,64.8,185,-192.5,192.5,192.5,112.5,117.5,120,120,215,-227.5,-235,215,527.5,,
10,Estevan Galvan,M,SBD,M-O,66,Single-ply,1997,,62.9,170,-182.5,182.5,182.5,-107.5,110,122.5,122.5,200,212.5,-227.5,212.5,517.5,,
11,Paul Mears #1,M,SBD,M-O,66,Single-ply,1953,,65.7,145,155,157.5,157.5,72.5,82.5,87.5,87.5,177.5,-190,-190,177.5,422.5,,
1,Aaron Phillips #2,M,SBD,M-O,74,Single-ply,1985,PFTNS,74,272.5,285,-295,285,195,202.5,210,210,225,242.5,-252.5,242.5,737.5,,
DQ,Nathan Walton,M,SBD,M-O,74,Single-ply,1976,Quest,74,260,272.5,280,280,-180,-180,-182.5,,-290,,,,,,
DQ,Tristan Pelitire,M,SBD,M-O,74,Single-ply,1996,Titan,74,260,272.5,-282.5,272.5,-197.5,-197.5,-197.5,,,,,,,,
1,Knute Douglas,M,SBD,M-O,83,Single-ply,1989,Titan,82.5,335,350,357.5,357.5,200,210,215,215,305,317.5,-325,317.5,890,,
2,Alex Smith #1,M,SBD,M-O,83,Single-ply,1990,,82.2,265,277.5,287.5,287.5,205,215,220,220,245,260,-272.5,260,767.5,,
3,Ashton Rouska,M,SBD,M-O,83,Single-ply,1997,,82.9,280,292.5,-310,292.5,187.5,-200,-200,187.5,-287.5,-287.5,287.5,287.5,767.5,,
4,Benjamin Rowe,M,SBD,M-O,83,Single-ply,1976,,82.1,-275,-280,280,280,-175,-180,182.5,182.5,265,277.5,-282.5,277.5,740,,
5,Raynard Taylor,M,SBD,M-O,83,Single-ply,1997,,81.9,257.5,277.5,-292.5,277.5,170,177.5,180,180,252.5,-267.5,-267.5,252.5,710,,
6,Darren Matsumoto,M,SBD,M-O,83,Single-ply,1964,,80.5,-265,265,-277.5,265,197.5,207.5,212.5,212.5,230,-240,-240,230,707.5,,
7,Brendan Brown,M,SBD,M-O,83,Single-ply,1998,,81.9,-262.5,262.5,-275,262.5,157.5,172.5,-182.5,172.5,227.5,-242.5,-242.5,227.5,662.5,,
8,Eric Cordeiro,M,SBD,M-O,83,Single-ply,1975,,82.5,245,250,-257.5,250,145,150,-152.5,150,220,227.5,-235,227.5,627.5,,
9,Ken Bray,M,SBD,M-O,83,Single-ply,1969,,78.6,170,182.5,-192.5,182.5,115,120,-125,120,230,247.5,-270,247.5,550,,
1,Ian Bell,M,SBD,M-O,93,Single-ply,1992,Titan,92.2,350,365,375,375,-215,215,,215,347.5,370,377.5,377.5,967.5,,
2,Jim Brown,M,SBD,M-O,93,Single-ply,1965,,91.7,290,307.5,320,320,200,217.5,225,225,235,255,262.5,262.5,807.5,,
3,Dale McLaren,M,SBD,M-O,93,Single-ply,1976,,92.9,290,302.5,-310,302.5,210,-220,-222.5,210,275,290,-297.5,290,802.5,,
4,Matt Rodock,M,SBD,M-O,93,Single-ply,1980,PRFTNS,92.7,300,315,-327.5,315,190,195,-200,195,272.5,290,-300,290,800,,
5,Pete Grohoski,M,SBD,M-O,93,Single-ply,1970,Titan,92.6,-252.5,252.5,262.5,262.5,252.5,-265,-265,252.5,230,247.5,-257.5,247.5,762.5,,
6,Antwan Byrd,M,SBD,M-O,93,Single-ply,1985,,88.2,262.5,277.5,-292.5,277.5,142.5,155,-165,155,270,285,-295,285,717.5,,
1,Charlie Conner,M,SBD,M-O,105,Single-ply,1989,Quest,101.1,337.5,352.5,357.5,357.5,275,290,300,300,265,280,285,285,942.5,,
2,Gregory Johnson,M,SBD,M-O,105,Single-ply,1990,,103.1,330,342.5,355,355,200,210,-215,210,-350,-350,350,350,915,,
3,Quintin Meyer,M,SBD,M-O,105,Single-ply,1991,PRFTNS,103.8,320,340,355,355,-225,-225,225,225,320,327.5,-337.5,327.5,907.5,,
4,Vasil Gushterov,M,SBD,M-O,105,Single-ply,1975,,104.9,285,305,320,320,240,-250,-250,240,320,330,-345,330,890,,
5,Erik Kasabuske,M,SBD,M-O,105,Single-ply,1983,Titan,98.4,330,345,-360,345,207.5,212.5,217.5,217.5,295,307.5,-310,307.5,870,,
6,Jeffery Thompson,M,SBD,M-O,105,Single-ply,,,103.4,285,300,307.5,307.5,210,-220,220,220,290,305,317.5,317.5,845,,
7,Matthew Christie,M,SBD,M-O,105,Single-ply,1982,,102.7,307.5,322.5,-335,322.5,237.5,-250,-250,237.5,270,-287.5,-287.5,270,830,,
8,David Young,M,SBD,M-O,105,Single-ply,1989,,102.5,315,325,332.5,332.5,215,225,235,235,235,250,-262.5,250,817.5,,
9,Rene Maldonado,M,SBD,M-O,105,Single-ply,1978,,104.3,275,285,-295,285,215,222.5,230,230,250,260,-272.5,260,775,,
DQ,Anthony Stavenski,M,SBD,M-O,105,Single-ply,1979,Garage Ink,103.3,265,-275,-275,265,-265,-265,-265,,240,242.5,257.5,257.5,,,
1,Steve Mann #1,M,SBD,M-O,120,Single-ply,1975,,119.8,385,402.5,412.5,412.5,280,290,297.5,297.5,285,-305,-315,285,995,,
2,Michael Rodriguez #1,M,SBD,M-O,120,Single-ply,,,119.9,-362.5,362.5,-370,362.5,270,-282.5,282.5,282.5,275,290,-305,290,935,,
3,James Meador,M,SBD,M-O,120,Single-ply,,,109.4,325,345,365,365,-200,200,-210,200,275,287.5,290,290,855,,
4,Pete Nees,M,SBD,M-O,120,Single-ply,1984,PRFTNS,106.9,287.5,-302.5,302.5,302.5,202.5,215,225,225,267.5,280,287.5,287.5,815,,
5,Glenn May,M,SBD,M-O,120,Single-ply,1981,,115.4,307.5,320,327.5,327.5,205,-215,-215,205,262.5,-275,-282.5,262.5,795,,
6,Wilson Martinez,M,SBD,M-O,120,Single-ply,1965,,107.8,265,-282.5,282.5,282.5,172.5,177.5,182.5,182.5,262.5,272.5,280,280,745,,
DQ,Cody Giampa,M,SBD,M-O,120,Single-ply,1991,,115.7,325,-350,-365,325,-255,-255,-255,,275,-305,322.5,322.5,,,
1,Blaine Sumner,M,SBD,M-O,120+,Single-ply,1987,Titan,165.9,445,465,485,485,355,365,375,375,-325,325,345,345,1205,,
2,Joseph Cappellino,M,SBD,M-O,120+,Single-ply,1988,Quest,165.8,415,437.5,447.5,447.5,330,-345,-345,330,335,357.5,-367.5,357.5,1135,,
3,Cooper Wage,M,SBD,M-O,120+,Single-ply,1987,Wisconsin Team,149.3,375,397.5,410,410,-295,295,320,320,272.5,312.5,320,320,1050,,
4,Dustin Meaux,M,SBD,M-O,120+,Single-ply,1984,Titan,151.5,357.5,367.5,375,375,292.5,-302.5,302.5,302.5,292.5,305,-315,305,982.5,,
5,Jason Christus,M,SBD,M-O,120+,Single-ply,1979,,152,295,320,330,330,247.5,255,-260,255,287.5,320,350,350,935,,
DQ,Daniel Gaudreau,M,SBD,M-O,120+,Single-ply,1960,,141.3,-320,-320,-320,,,,,,,,,,,,
DQ,Randy Earle,M,SBD,M-O,120+,Single-ply,1962,,151.8,-305,-305,-307.5,,225,237.5,-245,237.5,272.5,287.5,300,300,,,
1,Cordarius Harris,M,SBD,M-T1,53,Single-ply,2000,,51.6,110,-137.5,140,140,80,90,-95,90,140,165,177.5,177.5,407.5,,
1,Luis Perales,M,SBD,M-T1,66,Single-ply,1999,,65.5,-175,175,-177.5,175,-105,105,110,110,190,-195,-195,190,475,,
1,Nickolas Galvan,M,SBD,M-T1,74,Single-ply,,,73,165,-180,182.5,182.5,-102.5,105,110,110,170,182.5,187.5,187.5,480,,
2,Shane Kierstyn,M,SBD,M-T1,74,Single-ply,2001,,71.7,150,160,170,170,90,-95,-95,90,170,182.5,195,195,455,,
1,Mitchell Rees,M,SBD,M-T1,83,Single-ply,1999,,80.3,192.5,-215,215,215,105,117.5,120,120,180,195,-210,195,530,,
2,Marcus Ortega,M,SBD,M-T1,83,Single-ply,1999,,76.2,160,175,182.5,182.5,77.5,90,-100,90,170,182.5,187.5,187.5,460,,
1,Franco Arce,M,SBD,M-T1,105,Single-ply,1999,,98.5,177.5,210,-227.5,210,82.5,-97.5,-97.5,82.5,182.5,197.5,-210,197.5,490,,
1,Charlie Rosa,M,SBD,M-T2,53,Single-ply,1997,,52.8,125,132.5,-142.5,132.5,72.5,77.5,80,80,152.5,162.5,170,170,382.5,,
3,Kyle Bailey,M,SBD,M-T2,53,Single-ply,1998,,52.3,-127.5,127.5,-140,127.5,72.5,77.5,80,80,127.5,132.5,-140,132.5,340,,
2,Kyle Bailey,M,SBD,M-T2,53,Single-ply,1998,,52.3,-127.5,127.5,-140,127.5,72.5,77.5,80,80,127.5,132.5,-140,132.5,340,,
1,Randy Soliz,M,SBD,M-T2,59,Single-ply,,,59,162.5,175,-185,175,97.5,102.5,-110,102.5,182.5,200,-205,200,477.5,,
2,Rodney Garcia,M,SBD,M-T2,59,Single-ply,1997,,58.3,-157.5,157.5,-170,157.5,85,92.5,100,100,170,177.5,-190,177.5,435,,
1,Estevan Galvan,M,SBD,M-T2,66,Single-ply,1997,,62.9,170,-182.5,182.5,182.5,-107.5,110,122.5,122.5,200,212.5,-227.5,212.5,517.5,,
1,Artemio Garcia,M,SBD,M-T2,74,Single-ply,1978,,71.5,195,212.5,215,215,130,-142.5,142.5,142.5,-197.5,197.5,220,220,577.5,,
2,Tanner Hutchins,M,SBD,M-T2,74,Single-ply,1999,NCDH,74,177.5,190,-200,190,97.5,102.5,105,105,177.5,192.5,205,205,500,,
3,Derrick Carroll,M,SBD,M-T2,74,Single-ply,1998,,72.1,162.5,175,182.5,182.5,87.5,95,-97.5,95,165,172.5,182.5,182.5,460,,
1,Raynard Taylor,M,SBD,M-T2,83,Single-ply,1997,,81.9,257.5,277.5,-292.5,277.5,170,177.5,180,180,252.5,-267.5,-267.5,252.5,710,,
2,Tate Richards,M,SBD,M-T2,83,Single-ply,1998,,82.4,225,227.5,-240,227.5,160,-165,-165,160,227.5,-237.5,-240,227.5,615,,
3,Anthony McGuill,M,SBD,M-T2,83,Single-ply,1998,,80.6,192.5,200,207.5,207.5,-105,-105,105,105,207.5,215,225,225,537.5,,
4,Hunter Dollery,M,SBD,M-T2,83,Single-ply,1998,,78.8,185,-192.5,195,195,117.5,-120,120,120,200,210,220,220,535,,
5,Dalton Staller,M,SBD,M-T2,83,Single-ply,1998,Necedah,81.8,170,177.5,-190,177.5,95,100,110,110,182.5,190,-195,190,477.5,,
1,Nicholas Taylor,M,SBD,M-T2,93,Single-ply,1998,,89.4,225,235,242.5,242.5,132.5,142.5,145,145,215,222.5,227.5,227.5,615,,
1,Benny Benson,M,SBD,M-T2,105,Single-ply,1997,,100.5,250,272.5,-285,272.5,152.5,172.5,,172.5,242.5,-272.5,-272.5,242.5,687.5,,
1,Stephen Springfield,M,SBD,M-T2,120,Single-ply,1998,,113.7,-275,275,-295,275,132.5,142.5,-150,142.5,265,285,-295,285,702.5,,
1,Joseph Peña #1,M,SBD,M-T2,120+,Single-ply,1998,,141.8,310,322.5,332.5,332.5,150,185,197.5,197.5,235,257.5,-267.5,257.5,787.5,,
2,Marcus Sandoval,M,SBD,M-T2,120+,Single-ply,1997,,131.1,-260,260,280,280,190,-195,200,200,-215,-215,215,215,695,,
3,Mario Chavez,M,SBD,M-T2,120+,Single-ply,1997,,186.7,205,222.5,-230,222.5,165,-182.5,-182.5,165,210,227.5,240,240,627.5,,
1,Kenneth Johnson,M,SBD,M-T3,53,Single-ply,1997,PFTNS,52.6,160,172.5,-180,172.5,80,-87.5,-87.5,80,177.5,-200,-200,177.5,430,,
1,Cody Villa,M,SBD,M-T3,59,Single-ply,1997,,58.9,160,-167.5,170,170,115,120,125,125,217.5,-227.5,-227.5,217.5,512.5,,
DQ,Jarrett Burford,M,SBD,M-T3,59,Single-ply,1997,,58.7,-182.5,-182.5,-182.5,,-115,-115,-115,,-182.5,,,,,,
1,Jacob Keesee,M,SBD,M-T3,66,Single-ply,1995,,64.6,-182.5,182.5,192.5,192.5,105,117.5,122.5,122.5,182.5,192.5,197.5,197.5,512.5,,
2,Eddie Martinez,M,SBD,M-T3,66,Single-ply,1995,,65.1,157.5,-165,170,170,115,120,130,130,182.5,197.5,207.5,207.5,507.5,,
3,Bobby Teel,M,SBD,M-T3,66,Single-ply,1996,PRFTNS,63.9,175,185,-192.5,185,75,-82.5,-82.5,75,175,187.5,-197.5,187.5,447.5,,
DQ,Jonathon Pena,M,SBD,M-T3,66,Single-ply,1996,,65.9,-230,-230,-230,,142.5,152.5,157.5,157.5,217.5,-230,-232.5,217.5,,,
1,Angel Moreno,M,SBD,M-T3,74,Single-ply,1996,,72.8,245,260,267.5,267.5,-180,-180,180,180,232.5,-240,-240,232.5,680,,
2,Alex Maher,M,SBD,M-T3,74,Single-ply,1995,,71,-220,220,-232.5,220,132.5,145,147.5,147.5,265,287.5,-295,287.5,655,,
3,Romellow Dawson,M,SBD,M-T3,74,Single-ply,1996,,70.1,-250,250,-262.5,250,132.5,-137.5,-137.5,132.5,250,270,-280,270,652.5,,
4,Jerry Alaniz,M,SBD,M-T3,74,Single-ply,1995,,73.9,-182.5,202.5,225,225,147.5,155,-160,155,-245,250,-255,250,630,,
DQ,Cody Green,M,SBD,M-T3,74,Single-ply,1997,,73.3,-202.5,-202.5,-202.5,,-165,,,,,,,,,,
DQ,Tristan Pelitire,M,SBD,M-T3,74,Single-ply,1996,Titan,74,260,272.5,-282.5,272.5,-197.5,-197.5,-197.5,,,,,,,,
1,Ashton Rouska,M,SBD,M-T3,83,Single-ply,1997,,82.9,280,292.5,-310,292.5,187.5,-200,-200,187.5,-287.5,-287.5,287.5,287.5,767.5,,
2,Brendan Brown,M,SBD,M-T3,83,Single-ply,1998,,81.9,-262.5,262.5,-275,262.5,157.5,172.5,-182.5,172.5,227.5,-242.5,-242.5,227.5,662.5,,
1,Benjamin Nevares,M,SBD,M-T3,93,Single-ply,1996,,92.1,285,-292.5,300,300,220,225,232.5,232.5,295,312.5,-322.5,312.5,845,,
2,Andrew Garza,M,SBD,M-T3,93,Single-ply,1996,,89.9,-252.5,-252.5,252.5,252.5,145,-155,-155,145,-257.5,257.5,267.5,267.5,665,,
1,Matt Garcia,M,SBD,M-T3,105,Single-ply,1995,,97.3,292.5,307.5,332.5,332.5,207.5,217.5,-222.5,217.5,277.5,-290,-290,277.5,827.5,,
2,Mark Bocanegra,M,SBD,M-T3,105,Single-ply,1996,,104.1,302.5,-320,-320,302.5,202.5,210,-215,210,225,-237.5,237.5,237.5,750,,
3,Aaron Rodriguez,M,SBD,M-T3,105,Single-ply,1995,,100.8,272.5,295,-305,295,152.5,167.5,182.5,182.5,215,227.5,-242.5,227.5,705,,
4,Samuel Downey,M,SBD,M-T3,105,Single-ply,,,102.1,215,240,-255,240,137.5,155,-160,155,182.5,205,230,230,625,,
1,Enrique Lugo,M,SBD,M-T3,120,Single-ply,1996,,119.1,350,365.5,-380,365.5,255,265,280,280,290,305,-313,305,950.5,,
2,Michael Rodriguez #1,M,SBD,M-T3,120,Single-ply,,,119.9,-362.5,362.5,-370,362.5,270,-282.5,282.5,282.5,275,290,-305,290,935,,
3,Alex Stoll,M,SBD,M-T3,120,Single-ply,1997,,111.3,-295,295,-317.5,295,165,175,185,185,257.5,280,-297.5,280,760,,
4,Robert Cervantez,M,SBD,M-T3,120,Single-ply,,,119.1,292.5,302.5,310,310,165,172.5,182.5,182.5,220,-230,230,230,722.5,,
1,Rudy Flores,M,SBD,M-T3,120+,Single-ply,,,144.3,357.5,-370,372.5,372.5,250,262.5,-275,262.5,295,310,-317.5,310,945,,
2,Bobby Gonzales,M,SBD,M-T3,120+,Single-ply,1996,,125.3,350,360,-370,360,-237.5,237.5,-262.5,237.5,-272.5,-272.5,272.5,272.5,870,,
1,Jaidyn Birts,M,SBD,M-Y,93,Single-ply,2004,Brooks Academy,86.8,27.5,35,40,40,30,35,42.5,42.5,65,82.5,92.5,92.5,175,,
DD,Alyssa Hitchcock,F,SBD,F-O,72,Single-ply,1984,Titan,68.4,,,,,,,,,,,,,,,
