<svg xmlns:dc="http://purl.org/dc/elements/1.1/" xmlns:cc="http://creativecommons.org/ns#" xmlns:rdf="http://www.w3.org/1999/02/22-rdf-syntax-ns#" xmlns:svg="http://www.w3.org/2000/svg" xmlns="http://www.w3.org/2000/svg" id="svg8" version="1.1" viewBox="0 0 210 297" height="297mm" width="210mm">
  <defs id="defs2"/>
  <metadata id="metadata5">
    <rdf:RDF>
      <cc:Work rdf:about="">
        <dc:format>image/svg+xml</dc:format>
        <dc:type rdf:resource="http://purl.org/dc/dcmitype/StillImage"/>
        <dc:title/>
      </cc:Work>
    </rdf:RDF>
  </metadata>
  <g id="layer1">
    <path id="dashme2" d="M 39.8172 184.347 L 39.8172 184.347 M 42.4754 181.358 L 42.4754 181.358 M 45.1336 178.369 L 45.1336 178.369 M 47.7918 175.38 L 47.7918 175.38 M 50.4499 172.391 L 50.4499 172.391 M 53.1081 169.402 L 53.1081 169.402 M 55.7663 166.413 L 55.7663 166.413 M 58.4245 163.424 L 58.4245 163.424 M 61.0826 160.435 L 61.0826 160.435 M 63.7408 157.446 L 63.7408 157.446 M 66.399 154.457 L 66.399 154.457 M 69.0571 151.468 L 69.0571 151.468 M 71.7153 148.479 L 71.7153 148.479 M 74.3735 145.49 L 74.3735 145.49 M 77.0317 142.501 L 77.0317 142.501 M 79.6898 139.512 L 79.6898 139.512 M 82.348 136.523 L 82.348 136.523 M 85.0062 133.534 L 85.0062 133.534 M 87.6644 130.545 L 87.6644 130.545 M 90.3225 127.556 L 90.3225 127.556 M 92.9807 124.567 L 92.9807 124.567 M 95.6389 121.578 L 95.6389 121.578 M 98.2971 118.589 L 98.2971 118.589 M 100.955 115.6 L 100.955 115.6 M 103.613 112.611 L 103.613 112.611 M 106.272 109.622 L 106.272 109.622 M 108.93 106.633 L 108.93 106.633 M 111.588 103.644 L 111.588 103.644 M 114.246 100.655 L 114.246 100.655 M 116.904 97.6656 L 116.904 97.6656 M 119.562 94.6766 L 119.562 94.6766 M 122.221 91.6876 L 122.221 91.6876 M 124.879 88.6986 L 124.879 88.6986 M 127.537 85.7096 L 127.537 85.7096 M 130.195 82.7206 L 130.195 82.7206 M 132.853 79.7316 L 132.853 79.7316 M 135.511 76.7426 L 135.511 76.7426 M 138.17 73.7536 L 138.17 73.7536 M 140.828 70.7646 L 140.828 70.7646 M 143.486 67.7756 L 143.486 67.7756 M 145.927 65.0303" style="stroke:#000000;stroke-linecap:round;stroke-linejoin:miter;stroke-opacity:1;stroke-miterlimit:4;stroke-dashoffset:0"/>
  </g>
</svg>