999
"DXF R12 Output" (www.mydxf.blogspot.com)
 0 
SECTION
 2 
HEADER
 9 
$ACADVER
 1 
AC1009
 9 
$EXTMIN
 10 
 0 
 20 
 0 
 9 
$EXTMAX
 10 
 8.5 
 20 
 11 
 0 
ENDSEC
 0 
SECTION
 2 
ENTITIES
0
LINE
8
Layer 1
10
0.000000
20
297.000000
11
210.000000
21
297.000000
0
LINE
8
Layer 1
10
210.000000
20
297.000000
11
210.000000
21
0.000000
0
LINE
8
Layer 1
10
210.000000
20
0.000000
11
0.000000
21
0.000000
0
LINE
8
Layer 1
10
0.000000
20
0.000000
11
0.000000
21
297.000000
0
LINE
8
Layer 1
10
66.542718
20
221.696388
11
100.869066
21
221.696388
0
LINE
8
Layer 1
10
100.869066
20
221.696388
11
100.869066
21
195.428500
0
LINE
8
Layer 1
10
100.869066
20
195.428500
11
66.542718
21
195.428500
0
LINE
8
Layer 1
10
66.542718
20
195.428500
11
66.542718
21
221.696388
0
LINE
8
Layer 1
10
106.203218
20
191.696390
11
140.529566
21
191.696390
0
LINE
8
Layer 1
10
140.529566
20
191.696390
11
140.529566
21
165.428500
0
LINE
8
Layer 1
10
140.529566
20
165.428500
11
106.203218
21
165.428500
0
LINE
8
Layer 1
10
106.203218
20
165.428500
11
106.203218
21
191.696390
0
LINE
8
Layer 1
10
185.881282
20
135.428610
11
151.554934
21
135.428610
0
LINE
8
Layer 1
10
151.554934
20
135.428610
11
151.554934
21
161.696500
0
LINE
8
Layer 1
10
151.554934
20
161.696500
11
185.881282
21
161.696500
0
LINE
8
Layer 1
10
185.881282
20
161.696500
11
185.881282
21
135.428610
 0 
ENDSEC
 0 
EOF