  _  __         _       _ _ _         
 | |/ /___   __| | __ _| (_) |_ _   _ 
 | ' // _ \ / _` |/ _` | | | __| | | |
 | . \ (_) | (_| | (_| | | | |_| |_| |
 |_|\_\___/ \__,_|\__,_|_|_|\__|\__, |
                                |___/ 
======================================
Tech Talk about Docker ARM Containers 
======================================
