{
  "consumes": [
    "application/json",
    "multipart/form-data"
  ],
  "produces": [
    "application/json"
  ],
  "swagger": "2.0",
  "info": {
    "description": "Documentation of your project API.\n\nSchemes:\nhttp\nhttps",
    "title": "infoblog.",
    "version": "1.0.0"
  },
  "basePath": "/",
  "paths": {},
  "securityDefinitions": {
    "Bearer": {
      "type": "apiKey",
      "name": "Authorization",
      "in": "header"
    }
  }
}