{
  "swagger": "2.0",
  "info": {},
  "paths": {
    "/delete": {
      "delete": {
        "description": "Get vacancy by ID",
        "tags": [
          "vacancy"
        ],
        "operationId": "vacancyDeleteRequest",
        "parameters": [
          {
            "type": "string",
            "x-go-name": "ID",
            "description": "ID of vacancy to delete",
            "name": "id",
            "in": "query"
          }
        ],
        "responses": {
          "200": {
            "$ref": "#/responses/vacancyDeleteResponse"
          },
          "400": {
            "description": " Bad Request"
          },
          "404": {
            "description": " Not Found"
          }
        }
      }
    },
    "/get": {
      "get": {
        "description": "Get vacancy by ID",
        "tags": [
          "vacancy"
        ],
        "operationId": "vacancyGetRequest",
        "parameters": [
          {
            "type": "string",
            "x-go-name": "ID",
            "description": "ID of vacancy to get",
            "name": "id",
            "in": "query"
          }
        ],
        "responses": {
          "200": {
            "$ref": "#/responses/vacancyGetResponse"
          },
          "400": {
            "description": " Bad Request"
          },
          "404": {
            "description": " Not Found"
          },
          "500": {
            "description": " Internal Server Error"
          }
        }
      }
    },
    "/list": {
      "get": {
        "description": "Display all stored vacancy",
        "tags": [
          "vacancy"
        ],
        "operationId": "vacancyListRequest",
        "responses": {
          "200": {
            "description": " vacancyListResponse"
          },
          "404": {
            "description": " List is empty"
          },
          "500": {
            "description": " Internal Server Error"
          }
        }
      }
    },
    "/search": {
      "post": {
        "description": "Search and write into db info about vacancy by query",
        "tags": [
          "vacancy"
        ],
        "operationId": "vacancySearchRequest",
        "parameters": [
          {
            "type": "string",
            "x-go-name": "Query",
            "name": "query",
            "in": "query"
          }
        ],
        "responses": {
          "200": {
            "$ref": "#/responses/vacancySearchResponse"
          },
          "400": {
            "description": " Bad Request"
          },
          "500": {
            "description": " Internal Server Error"
          }
        }
      }
    }
  },
  "definitions": {
    "Vacancy": {
      "description": "Vacancy store info about vacancy",
      "type": "object",
      "properties": {
        "company": {
          "type": "string",
          "x-go-name": "Company"
        },
        "datePost": {
          "type": "string",
          "x-go-name": "DatePost"
        },
        "description": {
          "type": "string",
          "x-go-name": "Description"
        },
        "id": {
          "type": "integer",
          "format": "int64",
          "x-go-name": "ID"
        },
        "identifier": {
          "type": "integer",
          "format": "int64",
          "x-go-name": "Identifier"
        },
        "link": {
          "type": "string",
          "x-go-name": "Link"
        },
        "site": {
          "type": "string",
          "x-go-name": "Site"
        },
        "title": {
          "type": "string",
          "x-go-name": "Title"
        }
      },
      "x-go-package": "gitlab.com/timofeev.pavel.art/vacancy-app/models"
    }
  },
  "responses": {
    "vacancyDeleteResponse": {
      "description": ""
    },
    "vacancyGetResponse": {
      "description": "",
      "schema": {
        "$ref": "#/definitions/Vacancy"
      }
    },
    "vacancyListResponse": {
      "description": "",
      "schema": {
        "type": "array",
        "items": {
          "$ref": "#/definitions/Vacancy"
        }
      }
    },
    "vacancySearchResponse": {
      "description": "",
      "schema": {
        "type": "object",
        "additionalProperties": {
          "type": "integer",
          "format": "int64"
        }
      }
    }
  }
}