// Jest Snapshot v1, https://goo.gl/fbAQLP

exports[`ToDo should render the todo component correctly 1`] = `
<div>
  <article
    class="to-do"
  >
    <div
      class="container"
    >
      <h1>
        Jouw To-do Lijst
      </h1>
      <div
        class="to-do__cards"
      >
        <div
          class="card to-do-card"
        >
          <div
            class="card-content"
          >
            <h2>
              hoge prioriteit
            </h2>
            <ul
              class="to-do-card__list"
            >
              <div
                class="spinner"
                data-testid="spinner"
              />
            </ul>
            <button
              class="button button--tertiary"
              type="button"
            >
              +
            </button>
          </div>
        </div>
        <div
          class="card to-do-card"
        >
          <div
            class="card-content"
          >
            <h2>
              middel prioriteit
            </h2>
            <ul
              class="to-do-card__list"
            >
              <div
                class="spinner"
                data-testid="spinner"
              />
            </ul>
            <button
              class="button button--tertiary"
              type="button"
            >
              +
            </button>
          </div>
        </div>
        <div
          class="card to-do-card"
        >
          <div
            class="card-content"
          >
            <h2>
              lage prioriteit
            </h2>
            <ul
              class="to-do-card__list"
            >
              <div
                class="spinner"
                data-testid="spinner"
              />
            </ul>
            <button
              class="button button--tertiary"
              type="button"
            >
              +
            </button>
          </div>
        </div>
      </div>
      <div
        class="modal false"
        role="none"
      >
        <div
          class="card to-do__modal-card"
        >
          <div
            class="card-content"
          >
            <h2
              class="to-do__modal-title"
            />
            <label
              for="new-to-do"
            >
              Voeg een nieuw to-do item toe
              <input
                class="text-field to-do__text-field"
                id="new-to-do"
                value=""
              />
            </label>
            <div
              class="to-do__modal-buttons"
            >
              <button
                class="button button--secondary"
                type="button"
              >
                x
              </button>
              <button
                class="button button--tertiary"
                type="button"
              >
                Aanmaken
              </button>
            </div>
          </div>
        </div>
      </div>
    </div>
    <div
      class="error-pop-up__wrapper"
    >
      <div
        class="error-pop-up false"
      />
    </div>
  </article>
</div>
`;
