// Jest Snapshot v1, https://goo.gl/fbAQLP

exports[`Account should render the component as loading 1`] = `
<div>
  <div
    class="account account--loading"
  >
    <div
      class="spinner"
      data-testid="spinner"
    />
  </div>
</div>
`;
