// Jest Snapshot v1, https://goo.gl/fbAQLP

exports[`header should render the header 1`] = `
<div>
  <div
    class="header"
  >
    <div
      class="container"
    >
      <header>
        <nav
          class="header__nav"
        >
          <a
            class="header__logo-link"
            href="/to-do"
          >
            <div
              class="header__logo"
            >
              To-do app
            </div>
          </a>
          <div
            class="header__auth"
          >
            mockedAuthhenticationComponent
          </div>
        </nav>
      </header>
    </div>
  </div>
</div>
`;
