/Users/pedrorsilva/projects/backend-challenge-simplified/src/main/java/pt/timestamp/backend/challenge/post/PostService.java
/Users/pedrorsilva/projects/backend-challenge-simplified/src/main/java/pt/timestamp/backend/challenge/user/UserService.java
/Users/pedrorsilva/projects/backend-challenge-simplified/src/main/java/pt/timestamp/backend/challenge/emoji/EmojiService.java
