<?xml version="1.0" encoding="utf-8"?>
<!-- Generator: Adobe Illustrator 16.0.0, SVG Export Plug-In . SVG Version: 6.00 Build 0)  -->
<!DOCTYPE svg PUBLIC "-//W3C//DTD SVG 1.1//EN" "http://www.w3.org/Graphics/SVG/1.1/DTD/svg11.dtd">
<svg version="1.1" id="Layer_1" xmlns="http://www.w3.org/2000/svg" xmlns:xlink="http://www.w3.org/1999/xlink" x="0px" y="0px"
	 width="36px" height="36px" viewBox="0 0 36 36" enable-background="new 0 0 36 36" xml:space="preserve">
<g>
	<g>
		<rect y="-0.65" fill="#FB397D" fill-opacity="0" width="36" height="36"/>
		<path fill="#FB397D" d="M7.065,4.285c-0.588-0.588-1.542-0.588-2.13,0s-0.588,1.542,0,2.13l8.445,8.445
			c-1.373,2.555-0.416,5.737,2.139,7.11c1.552,0.835,3.419,0.835,4.972,0l8.445,8.444c0.583,0.589,1.533,0.593,2.121,0.01
			c0.002-0.004,0.006-0.006,0.008-0.01c0.589-0.583,0.593-1.533,0.01-2.121c-0.004-0.002-0.006-0.006-0.01-0.008L7.065,4.285z
			 M18,19.6c-1.243,0-2.25-1.008-2.25-2.25v-0.105l2.34,2.34L18,19.6z"/>
		<path fill="#FB397D" d="M18.33,24.85c-6.45,0.15-10.68-5.385-12-7.5c0.939-1.499,2.069-2.87,3.36-4.08L7.5,11.155
			c-1.693,1.595-3.144,3.43-4.305,5.445c-0.268,0.464-0.268,1.036,0,1.5c0.945,1.635,6,9.75,14.835,9.75h0.375
			c1.662-0.049,3.301-0.39,4.845-1.005l-2.37-2.37C20.047,24.693,19.191,24.82,18.33,24.85z"/>
		<path fill="#FB397D" d="M32.805,16.6c-0.959-1.665-6.255-10.02-15.209-9.75c-1.662,0.049-3.301,0.39-4.845,1.005l2.37,2.37
			c0.833-0.219,1.688-0.345,2.55-0.375c6.436-0.165,10.665,5.385,12,7.5c-0.963,1.504-2.117,2.875-3.436,4.08l2.266,2.115
			c1.715-1.592,3.186-3.426,4.365-5.445C33.115,17.625,33.092,17.053,32.805,16.6z"/>
	</g>
</g>
</svg>
