[
    {
        "title": "Agujas de hueso",
        "year": -20000
    },
    {
        "title": "Pinceles",
        "year": -18000
    },
    {
        "title": "Casas de hueso de Mamut",
        "year": -18000
    },
    {
        "title": "Arpónes",
        "year": -13000
    },
    {
        "title": "Cestería en mimbre",
        "year": -12000
    },
    {
        "title": "Vasijas de arcilla",
        "year": -10500
    },
    {
        "title": "Red de pesca",
        "year": -10000
    },
    {
        "title": "Peine",
        "year": -8000
    },
    {
        "title": "Canoas",
        "year": -7500
    },
    {
        "title": "Ladrillo",
        "year": -6000
    },
    {
        "title": "Rueda",
        "year": -5500
    },
    {
        "title": "Balanza",
        "year": -5000
    },
    {
        "title": "Embarcaciones de vela",
        "year": -3800
    },
    {
        "title": "Arado",
        "year": -3300
    },
    {
        "title": "Escritura cuneiforme",
        "year": -3000
    },
    {
        "title": "Ábaco",
        "year": -1746
    },
    {
        "title": "Calendario",
        "year": -1500
    },
    {
        "title": "Balanza hidrostática",
        "year": 150
    },
    {
        "title": "Espejos ustorios",
        "year": 150
    },
    {
        "title": "Herradura",
        "year": 50
    },
    {
        "title": "Papel",
        "year": 105
    },
    {
        "title": "Cúpula",
        "year": 124
    },
    {
        "title": "Carro de ruedas",
        "year": 250
    },
    {
        "title": "Estribo",
        "year": 350
    },
    {
        "title": "astrolabio",
        "year": 400
    },
    {
        "title": "Papel moneda (billete)",
        "year": 800
    },
    {
        "title": "Impresión de libro",
        "year": 868
    },
    {
        "title": "arado de ruedas",
        "year": 950
    },
    {
        "title": "Cristales coloreados",
        "year": 999
    },
    {
        "title": "Partituras",
        "year": 150
    },
    {
        "title": "Lente simple",
        "year": 1000
    },
    {
        "title": "Brújula magnética",
        "year": 1100
    },
    {
        "title": "Cañón",
        "year": 1118
    },
    {
        "title": "Clavecín",
        "year": 1121
    },
    {
        "title": "Timón de popa",
        "year": 1200
    },
    {
        "title": "globo de aire caliente",
        "year": 1232
    },
    {
        "title": "Espejo cóncavo",
        "year": 1257
    },
    {
        "title": "Anteojos",
        "year": 1268
    },
    {
        "title": "Máquina de bobina",
        "year": 1272
    },
    {
        "title": "Reloj mecánico",
        "year": 1280
    },
    {
        "title": "Rueda de hilar",
        "year": 1298
    },
    {
        "title": "pintura de oleo",
        "year": 1400
    },
    {
        "title": "Velocípedo",
        "year": 1420
    },
    {
        "title": "Imprenta móvil",
        "year": 1450
    },
    {
        "title": "Lápiz",
        "year": 1565
    },
    {
        "title": "Péndulo",
        "year": 1581
    },
    {
        "title": "Mapa de proyección",
        "year": 1569
    },
    {
        "title": "Telar",
        "year": 1589
    },
    {
        "title": "Inodoro",
        "year": 1590
    },
    {
        "title": "Microscopio compuesto",
        "year": 1590
    },
    {
        "title": "Termómetro de agua",
        "year": 1593
    },
    {
        "title": "Telescopio refractor",
        "year": 1609
    },
    {
        "title": "Diligencia",
        "year": 1620
    },
    {
        "title": "Submarino",
        "year": 1620
    },
    {
        "title": "Bayoneta",
        "year": 1640
    },
    {
        "title": "Calculadora de Pascal",
        "year": 1642
    },
    {
        "title": "Reloj de péndulo",
        "year": 1657
    },
    {
        "title": "Telescopio reflector",
        "year": 1668
    },
    {
        "title": "Bomba neumática",
        "year": 1672
    },
    {
        "title": "Higrómetro",
        "year": 1687
    },
    {
        "title": "Piano",
        "year": 1709
    },
    {
        "title": "Termómetro de alcohol",
        "year": 1710
    },
    {
        "title": "Máquina de vapor",
        "year": 1712
    },
    {
        "title": "Termómetro de mercurio",
        "year": 1714
    },
    {
        "title": "Octante",
        "year": 1731
    },
    {
        "title": "Lanzadera automática",
        "year": 1733
    },
    {
        "title": "Estufa de Franklin",
        "year": 1740
    },
    {
        "title": "Imprenta a color",
        "year": 1740
    },
    {
        "title": "Escala de Grados Celsius",
        "year": 1742
    },
    {
        "title": "Condensador eléctrico",
        "year": 1745
    },
    {
        "title": "Pararrayos",
        "year": 1752
    },
    {
        "title": "Sextante",
        "year": 1757
    },
    {
        "title": "Cronómetro",
        "year": 1761
    },
    {
        "title": "Reflector parabólico",
        "year": 1763
    },
    {
        "title": "Volante",
        "year": 1776
    },
    {
        "title": "Máquina de vapor de Watt",
        "year": 1782
    },
    {
        "title": "Globo aerostático",
        "year": 1783
    },
    {
        "title": "Lámpara de aceite",
        "year": 1784
    },
    {
        "title": "Hélice",
        "year": 1785
    },
    {
        "title": "Sistema métrico",
        "year": 1790
    },
    {
        "title": "Vacuna",
        "year": 1795
    },
    {
        "title": "Litografía",
        "year": 1796
    },
    {
        "title": "Martillo de Pilon",
        "year": 1800
    },
    {
        "title": "Pila eléctrica",
        "year": 1801
    },
    {
        "title": "Electróforo",
        "year": 1801
    },
    {
        "title": "Endiómetro",
        "year": 1801
    },
    {
        "title": "Locomotora de vapor",
        "year": 1802
    },
    {
        "title": "Acumulador eléctrico",
        "year": 1803
    },
    {
        "title": "Telar Jacquard",
        "year": 1805
    },
    {
        "title": "Termoelectricidad",
        "year": 1816
    },
    {
        "title": "Fósforos",
        "year": 1821
    },
    {
        "title": "Cortadora de césped",
        "year": 1827
    },
    {
        "title": "Dínamo eléctrico",
        "year": 1830
    },
    {
        "title": "Cosechadora",
        "year": 1831
    },
    {
        "title": "Telégrafo eléctrico",
        "year": 1834
    },
    {
        "title": "Código Morse",
        "year": 1837
    },
    {
        "title": "Estereoscopio",
        "year": 1837
    },
    {
        "title": "Bicicleta",
        "year": 1838
    },
    {
        "title": "Estampilla de Correos",
        "year": 1839
    },
    {
        "title": "Buques con casco de hierro",
        "year": 1840
    },
    {
        "title": "Reloj eléctrónico",
        "year": 1840
    },
    {
        "title": "Anestésico",
        "year": 1842
    },
    {
        "title": "Saxofón",
        "year": 1846
    },
    {
        "title": "Prensa rotativa",
        "year": 1846
    },
    {
        "title": "Cerradura de seguridad",
        "year": 1846
    },
    {
        "title": "Cámara de placas",
        "year": 1851
    },
    {
        "title": "Linóleo",
        "year": 1860
    },
    {
        "title": "Esquiladora",
        "year": 1860
    },
    {
        "title": "Máquina de escribir",
        "year": 1870
    },
    {
        "title": "Teléfono",
        "year": 1876
    },
    {
        "title": "Frigorífico",
        "year": 1876
    },
    {
        "title": "Motor de cuatro tiempos",
        "year": 1877
    },
    {
        "title": "Bombilla eléctrica",
        "year": 1880
    },
    {
        "title": "Automóvil",
        "year": 1885
    },
    {
        "title": "Bicicleta de pedales",
        "year": 1885
    },
    {
        "title": "Gramófono",
        "year": 1888
    },
    {
        "title": "Ascensor",
        "year": 1889
    },
    {
        "title": "Rayos X",
        "year": 1890
    },
    {
        "title": "Tubo de Crookes",
        "year": 1890
    },
    {
        "title": "Radio",
        "year": 1894
    },
    {
        "title": "Periscopio",
        "year": 1894
    },
    {
        "title": "Motor Diesel",
        "year": 1897
    },
    {
        "title": "Motor eléctrico compacto",
        "year": 1897
    },
    {
        "title": "Dirigible rígido",
        "year": 1900
    },
    {
        "title": "Mecano",
        "year": 1901
    },
    {
        "title": "Aspiradora",
        "year": 1901
    },
    {
        "title": "Lavadora",
        "year": 1901
    },
    {
        "title": "Frenos de disco",
        "year": 1902
    },
    {
        "title": "Cuchilla",
        "year": 1903
    },
    {
        "title": "Máquina de botellas",
        "year": 1903
    },
    {
        "title": "Electrocardiograma",
        "year": 1903
    },
    {
        "title": "Cinturón de seguridad",
        "year": 1903
    },
    {
        "title": "Oso de peluche",
        "year": 1903
    },
    {
        "title": "Lámpara termoiónica",
        "year": 1906
    },
    {
        "title": "Caja registradora",
        "year": 1906
    },
    {
        "title": "Tractor",
        "year": 1907
    },
    {
        "title": "Modelo atómico",
        "year": 1910
    },
    {
        "title": "Acero inoxidable",
        "year": 1911
    },
    {
        "title": "Cadena de montaje",
        "year": 1913
    },
    {
        "title": "Heladera Eléctrica",
        "year": 1913
    },
    {
        "title": "Cremallera",
        "year": 1913
    },
    {
        "title": "Semáforo luminoso",
        "year": 1914
    },
    {
        "title": "Limpiaparabrisas",
        "year": 1914
    },
    {
        "title": "Secador de pelo",
        "year": 1920
    },
    {
        "title": "Camión blindado",
        "year": 1920
    },
    {
        "title": "Autopista",
        "year": 1921
    },
    {
        "title": "Televisor",
        "year": 1925
    },
    {
        "title": "Tostador",
        "year": 1926
    },
    {
        "title": "Caucho sintético",
        "year": 1927
    },
    {
        "title": "Antibiótico",
        "year": 1927
    },
    {
        "title": "Ciclotrón",
        "year": 1928
    },
    {
        "title": "Paraguas plegable",
        "year": 1929
    },
    {
        "title": "Microscopio electrónico",
        "year": 1931
    },
    {
        "title": "Guitarra eléctrica",
        "year": 1932
    },
    {
        "title": "Grabación estéreo",
        "year": 1933
    },
    {
        "title": "Polietileno",
        "year": 1933
    },
    {
        "title": "Nylon",
        "year": 1934
    },
    {
        "title": "Radar",
        "year": 1935
    },
    {
        "title": "Café instantáneo",
        "year": 1938
    },
    {
        "title": "Fotocopiadora",
        "year": 1938
    },
    {
        "title": "Cajero automático",
        "year": 1939
    },
    {
        "title": "Bolígrafo",
        "year": 1940
    },
    {
        "title": "Reactor nuclear",
        "year": 1942
    },
    {
        "title": "Turbina de avión",
        "year": 1943
    },
    {
        "title": "Horno de microondas",
        "year": 1943
    },
    {
        "title": "Calculadora electrónica",
        "year": 1946
    },
    {
        "title": "Computadora",
        "year": 1946
    },
    {
        "title": "Transistor",
        "year": 1946
    },
    {
        "title": "Disco de larga duración",
        "year": 1947
    },
    {
        "title": "Neumáticos radiales",
        "year": 1948
    },
    {
        "title": "Tarjeta de crédito",
        "year": 1950
    },
    {
        "title": "Central Nuclear",
        "year": 1954
    },
    {
        "title": "Plancha de vapor",
        "year": 1955
    },
    {
        "title": "Velcro",
        "year": 1956
    },
    {
        "title": "Cámara de vídeo",
        "year": 1956
    },
    {
        "title": "Satélite artificial",
        "year": 1957
    },
    {
        "title": "Aerodeslizador",
        "year": 1958
    },
    {
        "title": "Chip de silicio",
        "year": 1959
    },
    {
        "title": "Teflón",
        "year": 1960
    },
    {
        "title": "Láser",
        "year": 1961
    },
    {
        "title": "Satélite de comunicaciones",
        "year": 1962
    },
    {
        "title": "Videocasetera",
        "year": 1963
    },
    {
        "title": "Procesador de texto",
        "year": 1964
    },
    {
        "title": "Avión Jumbo",
        "year": 1969
    },
    {
        "title": "reloj digital",
        "year": 1971
    },
    {
        "title": "Bolsa de aire",
        "year": 1971
    },
    {
        "title": "Escáner de Rayos X",
        "year": 1972
    },
    {
        "title": "Videojuegos domésticos",
        "year": 1972
    },
    {
        "title": "IP",
        "year": 1973
    },
    {
        "title": "TCP",
        "year": 1973
    },
    {
        "title": "Código de barras",
        "year": 1973
    },
    {
        "title": "Patineta",
        "year": 1973
    },
    {
        "title": "Computadora personal, Laptop",
        "year": 1974
    },
    {
        "title": "Tren bala",
        "year": 1974
    },
    {
        "title": "Walkman",
        "year": 1978
    },
    {
        "title": "Catalizador",
        "year": 1979
    },
    {
        "title": "Cubo de Rubik",
        "year": 1980
    },
    {
        "title": "Fax",
        "year": 1980
    },
    {
        "title": "Transbordador espacial",
        "year": 1981
    },
    {
        "title": "Tarjeta Inteligente",
        "year": 1982
    },
    {
        "title": "Corazón artificial",
        "year": 1982
    },
    {
        "title": "Disco Compacto",
        "year": 1982
    },
    {
        "title": "Celular",
        "year": 1983
    },
    {
        "title": "realidad virtual",
        "year": 1990
    },
    {
        "title": "Fusión Nuclear",
        "year": 1990
    },
    {
        "title": "World wide web",
        "year": 1990
    },
    {
        "title": "Identificador de voz",
        "year": 1990
    },
    {
        "title": "Videófono",
        "year": 1990
    },
    {
        "title": "GPS",
        "year": 1993
    },
    {
        "title": "JAVA",
        "year": 1994
    },
    {
        "title": "Memoria USB",
        "year": 1998
    },
    {
        "title": "Wi-Fi",
        "year": 1999
    },
    {
        "title": "iPod",
        "year": 2001
    },
    {
        "title": "Blu-ray",
        "year": 2005
    },
    {
        "title": "Bluetooth",
        "year": 2005
    },
    {
        "title": "iPhone",
        "year": 2007
    }
]