<?xml version="1.0" encoding="UTF-8"?>
<!-- Created with Liquid Technologies Online Tools 1.0 (https://www.liquid-technologies.com) -->
<Configuration status="WARN"
               monitorInterval="30"
               shutdownHook="disable">
    <Properties>
        <Property name="baseDir">/logs</Property>
        <Property name="applicationName">mgr-prod-${bundle:application:pl.mgr.ms.name}</Property>
    </Properties>
    <Appenders>
        <Console name="Console" target="SYSTEM_OUT">
            <PatternLayout pattern="%d{HH:mm:ss.SSS} [%t] %-5level %logger{36} - %msg%n"/>
        </Console>
        <Gelf name="gelf"
              host="tcp:localhost"
              port="12201"
              version="1.0"
              extractStackTrace="true"
              filterStackTrace="true"
              mdcProfiling="true"
              includeFullMdc="true"
              maximumMessageSize="8192"
              originHost="%host"
              ignoreExceptions="true">
            <Field name="timestamp"
                   pattern="%d{dd MMM yyyy HH:mm:ss,SSS}"/>
            <Field name="level"
                   pattern="%level"/>
            <Field name="simpleClassName"
                   pattern="%C{1}"/>
            <Field name="className"
                   pattern="%C"/>
            <Field name="server.simple"
                   pattern="%host{simple}"/>
            <Field name="server.fqdn"
                   pattern="%host{fqdn}"/>
            <Field name="application"
                   literal="${applicationName}"/>
        </Gelf>
    </Appenders>
    <Loggers>
        <Root level="INFO">
            <AppenderRef ref="Console"/>
            <AppenderRef ref="gelf"/>
        </Root>
    </Loggers>
</Configuration>