<?xml version="1.0" encoding="UTF-8"?>
<svg width="305px" height="48px" viewBox="0 0 305 48" version="1.1" xmlns="http://www.w3.org/2000/svg" xmlns:xlink="http://www.w3.org/1999/xlink">
    <!-- Generator: Sketch 51 (57462) - http://www.bohemiancoding.com/sketch -->
    <title>Group 2</title>
    <desc>Created with Sketch.</desc>
    <defs></defs>
    <g id="Page-1" stroke="none" stroke-width="1" fill="none" fill-rule="evenodd">
        <g id="Artboard" transform="translate(-122.000000, -268.000000)" fill-rule="nonzero">
            <g id="Group-2" transform="translate(122.000000, 268.000000)">
                <g id="Group" transform="translate(79.000000, 7.000000)" fill="#5F636A">
                    <path d="M192,7.60712995 L198.805556,0.972222222 L198.805556,34.0277778 L192,34.0277778 L192,7.60712995 Z M214.361111,11.6666667 C211.13945,11.6666667 208.527778,9.05499437 208.527778,5.83333333 C208.527778,2.61167229 211.13945,0 214.361111,0 C217.582772,0 220.194444,2.61167229 220.194444,5.83333333 C220.194444,9.05499437 217.582772,11.6666667 214.361111,11.6666667 Z M214.361111,35 C208.454733,35 203.666667,30.2119341 203.666667,24.3055556 C203.666667,18.399177 208.454733,13.6111111 214.361111,13.6111111 C220.26749,13.6111111 225.055556,18.399177 225.055556,24.3055556 C225.055556,30.2119341 220.26749,35 214.361111,35 Z" id="Combined-Shape"></path>
                    <path d="M27,35 L0,35 L0,0 L27,27 L27,0 L35,0 L35,35 L27,35 Z M116.557776,17.5 C122.375546,20.4864284 126.356249,26.6756954 126.356249,33.7964143 L126.356249,35 L119.077021,35 L119.077021,33.7964143 C119.077021,27.7370838 114.391064,22.8775728 108.678124,22.8775728 C102.965185,22.8775728 98.2792277,27.7370838 98.2792277,33.7964143 L98.2792277,35 L91,35 L91,33.7964143 C91,26.6756954 94.9807027,20.4864284 100.798473,17.5 C94.9807027,14.5135716 91,8.32430462 91,1.20358567 L91,0 L98.2792277,0 L98.2792277,1.20358567 C98.2792277,7.26291619 102.965185,12.1224272 108.678124,12.1224272 C114.391064,12.1224272 119.077021,7.26291619 119.077021,1.20358567 L119.077021,0 L126.356249,0 L126.356249,1.20358567 C126.356249,8.32430462 122.375546,14.5135716 116.557776,17.5 Z M81,14 L81,22 L46,22 L46,14 L81,14 Z M81,-1.07156595e-15 L81,8 L46,8 L46,1.07156595e-15 L81,-1.07156595e-15 Z M81,27 L81,35 L46,35 L46,27 L81,27 Z M150,12 L158,12 L158,35 L150,35 L150,12 Z M171,-1.07156595e-15 L171,9 L136,9 L136,1.07156595e-15 L171,-1.07156595e-15 Z" id="Combined-Shape"></path>
                </g>
                <g id="cloud-logo">
                    <path d="M37.0666667,13.1733333 L38.8444444,13.1733333 L43.9111111,8.10666667 L44.16,5.95555556 C38.2590569,0.74717377 30.086999,-1.04497741 22.5480091,1.21599605 C15.0090191,3.47696951 9.17192504,9.47052187 7.11111111,17.0666667 C7.67556047,16.8353094 8.3008257,16.7977934 8.88888889,16.96 L19.0222222,15.2888889 C19.0222222,15.2888889 19.5377778,14.4355556 19.8044444,14.4888889 C24.312005,9.53842967 31.8978378,8.96150096 37.1022222,13.1733333 L37.0666667,13.1733333 Z" id="Shape" fill="#EA4335"></path>
                    <path d="M51.1288889,17.0666667 C49.9642906,12.7780143 47.5731714,8.92256626 44.2488889,5.97333333 L37.1377778,13.0844444 C40.1405594,15.5379999 41.8509852,19.2340926 41.7777778,23.1111111 L41.7777778,24.3733333 C45.2731266,24.3733333 48.1066667,27.2068734 48.1066667,30.7022222 C48.1066667,34.197571 45.2731266,37.0311111 41.7777778,37.0311111 L29.12,37.0311111 L27.8577778,38.3111111 L27.8577778,45.9022222 L29.12,47.1644444 L41.7777778,47.1644444 C49.0352709,47.2209476 55.4735074,42.5179776 57.6268767,35.5870758 C59.7802461,28.6561741 57.1406271,21.1327953 51.1288889,17.0666667 Z" id="Shape" fill="#4285F4"></path>
                    <path d="M16.4444444,47.0933333 L29.1022222,47.0933333 L29.1022222,36.96 L16.4444444,36.96 C15.5426351,36.9598007 14.6514009,36.7657906 13.8311111,36.3911111 L12.0533333,36.9422222 L6.95111111,42.0088889 L6.50666667,43.7866667 C9.36787884,45.9472125 12.8591619,47.1088916 16.4444444,47.0933333 Z" id="Shape" fill="#34A853"></path>
                    <path d="M16.4444444,14.2222222 C9.4134809,14.2642223 3.18528381,18.7670102 0.941396761,25.4304315 C-1.30249029,32.0938528 0.933302215,39.4468638 6.50666667,43.7333333 L13.8488889,36.3911111 C11.2836127,35.2321271 9.79213232,32.518139 10.1889766,29.7313128 C10.5858208,26.9444866 12.7755977,24.7547097 15.5624239,24.3578655 C18.3492501,23.9610212 21.0632382,25.4525016 22.2222222,28.0177778 L29.5644444,20.6755556 C26.4405106,16.5915953 21.5861716,14.203892 16.4444444,14.2222222 Z" id="Shape" fill="#FBBC05"></path>
                </g>
            </g>
        </g>
    </g>
</svg>