// Jest Snapshot v1, https://goo.gl/fbAQLP

exports[`renders correctly 1`] = `
<div
  className="app"
>
  <h1>
    TechnologyOne Code Challenge
  </h1>
  <div
    className="currency-long-form-section"
  >
    <input
      data-testid="dollar-numeric-input"
      onChange={[Function]}
      type="number"
      value={0}
    />
    <span>
      
    </span>
  </div>
</div>
`;
