{
  "$schema": "https://json.schemastore.org/launchsettings.json",
  "iisSettings": {
    "windowsAuthentication": false,
    "anonymousAuthentication": true,
    "iisExpress": {
      "applicationUrl": "http://localhost:3687",
      "sslPort": 44355
    }
  },
  "profiles": {
    "TodoApi": {
      "commandName": "Project",
      "launchBrowser": true,
      "launchUrl": "api/todoitems",
      "applicationUrl": "https://localhost:7035;http://localhost:5118",
      "environmentVariables": {
        "ASPNETCORE_ENVIRONMENT": "Development"
      }
    },
    "IIS Express": {
      "commandName": "IISExpress",
      "launchBrowser": true,
      "launchUrl": "api/todoitems",
      "environmentVariables": {
        "ASPNETCORE_ENVIRONMENT": "Development"
      }
    }
  }
}