<svg width="13" height="8" viewBox="0 0 13 8" fill="none" xmlns="http://www.w3.org/2000/svg">
<path d="M6.60029 7.10387L12.1353 1.55351C12.3165 1.37166 12.3162 1.07724 12.1344 0.895697C11.9525 0.714292 11.6579 0.714761 11.4765 0.896635L6.27098 6.11661L1.06543 0.896447C0.884028 0.714596 0.589631 0.714128 0.407757 0.89551C0.316586 0.986517 0.271 1.10574 0.271 1.22497C0.271 1.34389 0.31628 1.46265 0.406819 1.55349L5.94168 7.10387C6.02882 7.19145 6.14741 7.2406 6.27098 7.2406C6.39454 7.2406 6.51299 7.19131 6.60029 7.10387Z" fill="#19293B"/>
</svg>
