<svg width="7" height="7" viewBox="0 0 7 7" fill="currentcolor" xmlns="http://www.w3.org/2000/svg">
	<path d="M4.14131 3.50718L6.86698 0.78144C7.04436 0.604141 7.04436 0.317474 6.86698 0.140176C6.68968 -0.0371224 6.40301 -0.0371224 6.22572 0.140176L3.49997 2.86592L0.774301 0.140176C0.596919 -0.0371224 0.310335 -0.0371224 0.133036 0.140176C-0.0443454 0.317474 -0.0443454 0.604141 0.133036 0.78144L2.8587 3.50718L0.133036 6.23293C-0.0443454 6.41023 -0.0443454 6.69689 0.133036 6.87419C0.221395 6.96263 0.337573 7.00706 0.453669 7.00706C0.569764 7.00706 0.685859 6.96263 0.774301 6.87419L3.49997 4.14845L6.22572 6.87419C6.31416 6.96263 6.43025 7.00706 6.54635 7.00706C6.66244 7.00706 6.77854 6.96263 6.86698 6.87419C7.04436 6.69689 7.04436 6.41023 6.86698 6.23293L4.14131 3.50718Z" />
</svg>
