<svg width="22" height="16" viewBox="0 0 22 16" fill="none" xmlns="http://www.w3.org/2000/svg">
<path d="M1.91296 0.332031C0.856656 0.332031 0 1.18864 0 2.24571C0 3.30202 0.856656 4.15791 1.91296 4.15791C2.96927 4.15791 3.82592 3.30202 3.82592 2.24571C3.82592 1.18864 2.96927 0.332031 1.91296 0.332031Z" fill="white"/>
<path d="M1.91296 6.0874C0.856656 6.0874 0 6.94329 0 8.00037C0 9.05668 0.856656 9.91328 1.91296 9.91328C2.96927 9.91328 3.82592 9.05668 3.82592 8.00037C3.82592 6.94329 2.96927 6.0874 1.91296 6.0874Z" fill="white"/>
<path d="M1.91296 11.842C0.856656 11.842 0 12.6986 0 13.755C0 14.8113 0.856656 15.6679 1.91296 15.6679C2.96927 15.6679 3.82592 14.8113 3.82592 13.755C3.82592 12.6986 2.96927 11.842 1.91296 11.842Z" fill="white"/>
<path d="M20.5616 0.806396H6.95411C6.15977 0.806396 5.51562 1.45054 5.51562 2.2456C5.51562 3.04 6.15972 3.68409 6.95411 3.68409H20.5616C21.3559 3.68409 22.0001 3.04 22.0001 2.2456C22.0001 1.45054 21.3559 0.806396 20.5616 0.806396Z" fill="white"/>
<path d="M20.5616 6.56104H6.95411C6.15977 6.56104 5.51562 7.20513 5.51562 8.00024C5.51562 8.79463 6.15972 9.43873 6.95411 9.43873H20.5616C21.3559 9.43873 22.0001 8.79463 22.0001 8.00024C22.0001 7.20513 21.3559 6.56104 20.5616 6.56104Z" fill="white"/>
<path d="M20.5616 12.3164H6.95411C6.15977 12.3164 5.51562 12.9605 5.51562 13.7549C5.51562 14.5492 6.15972 15.1933 6.95411 15.1933H20.5616C21.3559 15.1933 22.0001 14.5492 22.0001 13.7549C22.0001 12.9605 21.3559 12.3164 20.5616 12.3164Z" fill="white"/>
</svg>
