Place,Name,Division,Country,BodyweightKg,Squat1Kg,Squat2Kg,Squat3Kg,Best3SquatKg,Squat4Kg,Bench1Kg,Bench2Kg,Bench3Kg,Best3BenchKg,Bench4Kg,Deadlift1Kg,Deadlift2Kg,Deadlift3Kg,Best3DeadliftKg,Deadlift4Kg,TotalKg,WeightClassKg,Sex,Equipment,Event
DQ,Anastasia Sergienko,T3,Russia,46.7,-50,-50,-50,,,,,,,,,,,,,,48,F,Multi-ply,SBD
1,Svetlana Ņefjodova,M3,Latvia,47.6,90,100,-105,100,,50,57.5,-60,57.5,,115,125,-130,125,,282.5,48,F,Multi-ply,SBD
1,Oksana Koveza,O,Russia,51.2,130,140,,140,,82.5,85,-87.5,85,,125,135,150,150,,375,52,F,Multi-ply,SBD
1,Marina Medvedeva,O,Russia,55.8,170,195,200,200,,100,110,112.5,112.5,117.5,165,180,190,190,,502.5,56,F,Multi-ply,SBD
2,Natacha Herbepin,O,France,54.4,145,-160,-165,145,,75,82.5,85,85,,150,160,-167.5,160,,390,56,F,Multi-ply,SBD
1,Angela Debudey,M1,Germany,55.1,70,80,85,85,,50,55,57.5,57.5,,105,115,120,120,,262.5,56,F,Multi-ply,SBD
1,Wendy Antoon,T2,Belgium,57.6,140,-150,-155,140,-155,70,-75,76,76,-77.5,115,120,125,125,,341,60,F,Multi-ply,SBD
1,Wendy Michiels,O,Belgium,58.2,180,190,-201,190,,100,105,110,110,115.5,170,180,-185.5,180,,480,60,F,Multi-ply,SBD
1,Lesley Jayne Thomas,M1,UK,58.2,160,-175,-175,160,,77.5,-80,-80,77.5,,140,147.5,157.5,157.5,,395,60,F,Multi-ply,SBD
1,Kelly Sohier,J,Belgium,66.1,135,140,-150,140,,65,70,-72.5,70,,-150,150,162.5,162.5,-165,372.5,67.5,F,Multi-ply,SBD
1,Petra Stumpfová,O,Ireland,66.9,160,180,195,195,211,112.5,125,132.5,132.5,,160,175,182.5,182.5,,510,67.5,F,Multi-ply,SBD
1,Olga Miglāne,M1,Latvia,63.3,130,140,150,150,,70,75,,75,,125,135,140,140,,365,67.5,F,Multi-ply,SBD
1,Hildegard Utecht,M4,Germany,63.3,120,130,135,135,,75,80,-85,80,,120,130,135,135,,350,67.5,F,Multi-ply,SBD
1,Helen Stack,O,UK,81.1,80,90,100,100,,60,70,-80,70,,-130,140,162.5,162.5,,332.5,82.5,F,Multi-ply,SBD
1,Ritvars Grebers,T1,Latvia,44,90,100,107.5,107.5,,30,32.5,35,35,,80,85,-87.5,85,,227.5,52,M,Multi-ply,SBD
1,Mihails Šabarovs,O,Latvia,50.1,190,-200,-200,190,,85,,,85,,190,-206,-206,190,,465,52,M,Multi-ply,SBD
1,Reno Karkuschke,O,Germany,55.6,165,196.5,-200,196.5,,120,-128,-128,120,-128,150,170,-180,170,,486.5,56,M,Multi-ply,SBD
1,Levon Sargsyan,T1,Russia,65.8,225,-250,-250,225,,100,-155,,100,,-170,170,182.5,182.5,191,507.5,67.5,M,Multi-ply,SBD
1,Joachim De Rudder,T3,Belgium,67.3,202.5,-215,215,215,225,120,127.5,130,130,,200,212.5,-222.5,212.5,-225.5,557.5,67.5,M,Multi-ply,SBD
1,Gatis Dumpis,J,Latvia,62.8,80,100,120,120,,80,90,-92.5,90,,140,160,-170,160,,370,67.5,M,Multi-ply,SBD
1,Levon Sargsyan,O,Russia,65.8,100,,,100,,135,-150,-150,135,,100,,,100,,335,67.5,M,Multi-ply,SBD
DQ,Toni Haaparanta,O,Finland,67,-285,-285,-285,,,,,,,,,,,,,,67.5,M,Multi-ply,SBD
1,Gerard McNamara #1,M1,Ireland,67.5,290,310,326,326,,160,170,180,180,,240,-250,-250,240,,746,67.5,M,Multi-ply,SBD
2,Rudy Triangle,M1,Belgium,62.2,120,130,-140,130,,70,85,90,90,,120,135,-140,135,,355,67.5,M,Multi-ply,SBD
1,Marcus Heuer,T1,Germany,70.9,150,170,175.5,175.5,180,90,115,,115,,180,200,-210.5,200,210.5,490.5,75,M,Multi-ply,SBD
DQ,Glenn Versaen,T2,Belgium,71.9,-115,-115,-115,,,,,,,,,,,,,,75,M,Multi-ply,SBD
1,Brieuc De Rudder,J,Belgium,70,165,177.5,185,185,,85,90,97.5,97.5,,170,180,185,185,,467.5,75,M,Multi-ply,SBD
1,Stanislav Pryakhin,O,Russia,75,310,-342.5,-342.5,310,,-185,187.5,202.5,202.5,,270,285,300,300,,812.5,75,M,Multi-ply,SBD
2,Sergey Ayvazov,O,Russia,74.6,300,320,335,335,,160,175,-180,175,,250,-290,-290,250,,760,75,M,Multi-ply,SBD
3,Jeffrey Podszuweit,O,Germany,73.7,270,-290,-300,270,,195,202.5,207.5,207.5,,-235,235,252.5,252.5,,730,75,M,Multi-ply,SBD
4,Maxim Kutuzov,O,Russia,74.8,220,240,260,260,,170,177.5,-180,177.5,,222.5,230,-240,230,,667.5,75,M,Multi-ply,SBD
DQ,Sarkhan Aliyev,O,Azerbaijan,74.6,-235,-250,,,,,,,,,,,,,,,75,M,Multi-ply,SBD
1,Patrick Van Oosterwijck,M1,Belgium,73.4,195,210,-230,210,,100,110,115,115,,210,230,240,240,,565,75,M,Multi-ply,SBD
1,Steffen Burkhard,M4,Germany,70.3,140,150,160,160,,100,105,-107.5,105,,140,150,160,160,,425,75,M,Multi-ply,SBD
1,Janis Paulukas,M5,Latvia,71.3,-185,185,190,190,,130,-135,135,135,,210,220,230,230,,555,75,M,Multi-ply,SBD
1,Ainis Stagars,T3,Latvia,80.9,-220,220,230,230,,135,,,135,,240,250,260,260,,625,82.5,M,Multi-ply,SBD
1,Denis Druzhinin,J,Russia,80.5,200,250,-300,250,,160,170,-175,170,,200,250,-260,250,,670,82.5,M,Multi-ply,SBD
1,Petri Salmela,O,Finland,82.4,300,-320,-320,300,,-180,180,-190,180,,-270,290,-317.5,290,,770,82.5,M,Multi-ply,SBD
2,Markus Horanek,O,Austria,81.8,250,265,280,280,,190,200,205,205,,230,240,245,245,,730,82.5,M,Multi-ply,SBD
3,Michaël Blösch,O,Germany,82.2,240,-270,270,270,,-175,185,192.5,192.5,,-240,240,265,265,,727.5,82.5,M,Multi-ply,SBD
4,Ian Humphreys,O,UK,81.8,290,-302.5,,290,,170,185,195,195,,220,235,-242.5,235,,720,82.5,M,Multi-ply,SBD
5,Konstantin Konstantinov,O,Russia,80.4,-280,-280,280,280,,-170,,170,170,,230,245,-255,245,,695,82.5,M,Multi-ply,SBD
6,Viktor Babenko,O,Ukraine,82.4,220,240,-250,240,,-170,180,-190,180,,200,-220,-220,200,,620,82.5,M,Multi-ply,SBD
1,Aleksandrs Miglāns,M1,Latvia,80.2,240,250,-260,250,,150,170,-280,170,,235,250,-260,250,,670,82.5,M,Multi-ply,SBD
2,Václav Vích,M1,Czechia,82.5,210,235,245,245,,120,-135,135,135,,250,-270,270,270,,650,82.5,M,Multi-ply,SBD
3,Michael Molgedey,M1,Germany,78.7,220,-235,,220,,135,145,-150,145,,220,-240,240,240,,605,82.5,M,Multi-ply,SBD
1,Detlef Riedel,M2,Germany,79.1,220,235,250,250,,170,180,187.5,187.5,,210,220,-230,220,,657.5,82.5,M,Multi-ply,SBD
1,Lothar Bohrish,M5,Germany,,152.5,165,170,170,,112.5,120,-125,120,,185,-200,-200,185,,475,82.5,M,Multi-ply,SBD
1,Artūrs Ūdris,T3,Latvia,89.3,240,260,-272.5,260,,160,165,-170,165,,250,260,-265,260,,685,90,M,Multi-ply,SBD
1,Jens Vandenbrande,T3,Belgium,83,-230,230,-255,230,,135,140,-150,140,,210,220,235,235,,605,90,M,Multi-ply,SBD
1,Nikolay Bezuglov,J,Russia,89.1,310,346,355,355,,200,210,215,215,,260,-300,-300,260,,830,90,M,Multi-ply,SBD
2,Dzintars Vircavs,J,Latvia,88.8,240,-260,-260,240,,140,160,-170,160,,260,-280,-280,260,,660,90,M,Multi-ply,SBD
1,Andrey Sharapov,O,Russia,88.9,350,-370,-370,350,,220,230,235,235,,260,285,305,305,,890,90,M,Multi-ply,SBD
2,Emin Galib Ogly Mamedov,O,Russia,89.7,-350,-350,350,350,,240,252.5,260,260,270,280,-297.5,-297.5,280,,890,90,M,Multi-ply,SBD
3,Helmut Kraus,O,Germany,88.9,275,305,320,320,,215,230,237.5,237.5,,245,265,272.5,272.5,,830,90,M,Multi-ply,SBD
4,Helmut Pignitter,O,Austria,87,260,-280,290,290,,212.5,227.5,230,230,,240,260,-280,260,,780,90,M,Multi-ply,SBD
5,David Velička,O,Czechia,88.8,240,255,-265,255,,190,200,-205,200,,220,235,240,240,,695,90,M,Multi-ply,SBD
DQ,Andrey Sizov,O,Russia,89.4,-275,285,,285,,,,,,,,,,,,,90,M,Multi-ply,SBD
1,Jan Vrba,M1,Czechia,88.6,170,200,220,220,,130,170,180,180,,150,180,200,200,,600,90,M,Multi-ply,SBD
1,Henry Trost,M2,Germany,87.4,210,220,-230,220,,-125,125,-130,125,,210,225,240,240,,585,90,M,Multi-ply,SBD
1,Frank Thomas Kutzsch,M3,Germany,88.7,205,220,230,230,,160,167.5,,167.5,,190,215,225,225,,622.5,90,M,Multi-ply,SBD
1,Ernst Utecht,M4,Germany,88,200,215,220,220,,90,-110,-110,90,,200,215,-225,215,,525,90,M,Multi-ply,SBD
1,Ģirts Gūtmanis,T3,Latvia,95.1,240,-260,-260,240,,155,-165,165,165,,240,250,260,260,,665,100,M,Multi-ply,SBD
1,Nando Stoll,J,Germany,93,310,330,-350,330,,190,200,210,210,,270,-280,280,280,,820,100,M,Multi-ply,SBD
1,Edgars Rekšņa,O,Latvia,98.3,360,372.5,380,380,,255,265,270,270,,330,340,-350,340,,990,100,M,Multi-ply,SBD
2,Andrey Ayvazov,O,Russia,98.2,-370,-385,385,385,,220,227.5,-323.5,227.5,,330,367.5,-377.5,367.5,,980,100,M,Multi-ply,SBD
3,Jamie Burke,O,UK,95.8,350,370,380,380,,222.5,230,,230,,290,310,322.5,322.5,,932.5,100,M,Multi-ply,SBD
4,Ville Rautio,O,Finland,99.1,310,325,-340,325,,200,-215,-220,200,,265,275,-300,275,,800,100,M,Multi-ply,SBD
5,Jiří Hačkulič,O,Czechia,97,250,-260,270,270,,180,190,-195,190,,250,270,-285,270,,730,100,M,Multi-ply,SBD
6,Vusal Tahir Mardanov,O,Azerbaijan,100,260,-300,300,300,,275,-280,-285,275,,55,,,55,,630,100,M,Multi-ply,SBD
DQ,Jiri Ferenc,O,Czechia,97.2,-300,-330,-340,,,,,,,,,,,,,,100,M,Multi-ply,SBD
1,Sam Graham #1,M1,Ireland,95.4,260,,,260,,170,180,190,190,,230,,,230,,680,100,M,Multi-ply,SBD
2,Patrick Verblijdt,M1,Belgium,94.9,-240,240,-255,240,,120,130,-140,130,,190,200,210,210,,580,100,M,Multi-ply,SBD
1,Mikhail Bobkov,M4,Russia,98,-175,175,-215,175,,100,-135,-135,100,,175,200,222.5,222.5,,497.5,100,M,Multi-ply,SBD
1,Valeriy Fadeev,M3,Russia,99.3,230,,,230,,120,,,120,,200,,,200,,550,100,M,Multi-ply,SBD
DQ,Kārlis Bulāns,M4,Latvia,97.2,-270,,,,,-140,-150,-162.5,,,-280,-280,-280,,,,100,M,Multi-ply,SBD
1,Alexandrs Smelovs,M5,Latvia,90.9,170,180,200,200,,160.5,171,175,175,,180,200,,200,,575,100,M,Multi-ply,SBD
2,Heinz-Joachim Probst,M5,Germany,98.9,-115,115,135,135,,100,110,117.5,117.5,,150,175,180,180,,432.5,100,M,Multi-ply,SBD
1,Yuriy Khandzhyan,T1,Russia,106.4,160,200,,200,,100,-155,,100,,130,155,180,180,200,480,110,M,Multi-ply,SBD
DQ,Tomas Vrana,T2,Czechia,104.9,-200,-265,,,,,,,,,,,,,,,110,M,Multi-ply,SBD
1,Simon Benzler,J,Germany,108.4,300,410.5,-430,410.5,,200,-220,-220,200,,300,-330,,300,,910.5,110,M,Multi-ply,SBD
2,Szabo Istuas,J,Hungary,108.7,260,285,,285,,190,200,,200,,260,-280,280,280,,765,110,M,Multi-ply,SBD
1,Bakhtiyar Guliyev,O,Azerbaijan,108.8,310,325,335,335,,240,-250,-250,240,,320,355,367.5,367.5,,942.5,110,M,Multi-ply,SBD
2,Martin Košnar,O,Czechia,109.1,350,360,370,370,,250,260,265,265,,290,300,-310,300,,935,110,M,Multi-ply,SBD
3,Steven Middleton-Lowes,O,UK,108.8,340,360,-377.5,360,,215,225,235,235,,280,305,-315,305,,900,110,M,Multi-ply,SBD
4,Antti Kousa,O,Finland,108,-355,365,-380,365,,195,205,-210,205,,300,315,-330,315,,885,110,M,Multi-ply,SBD
5,Kyle Vauls,O,UK,103.3,300,327.5,337.5,337.5,,210,225,235,235,,275,-290,290,290,,862.5,110,M,Multi-ply,SBD
6,Vitalij Jakubiv,O,Germany,108.8,-350,350,-365,350,,220,-230,,220,,-280,280,-300,280,,850,110,M,Multi-ply,SBD
7,Jaromír Kratochvíl,O,Czechia,105.6,350,360,-370,360,,215,225,-235,225,,250,,,250,,835,110,M,Multi-ply,SBD
8,Aleksandrs Zvezdenkovs,O,Latvia,104,275,-290,290,290,,175,190,-200,190,,265,280,,280,,760,110,M,Multi-ply,SBD
9,Franck Weiss,O,France,105.3,-230,250,270,270,,-170,180,-190,180,,260,280,-290,280,,730,110,M,Multi-ply,SBD
DQ,Ivars Ozols,O,Latvia,106.8,-320,-320,-320,,,,,,,,,,,,,,110,M,Multi-ply,SBD
1,Audrius Vosylius,M1,Latvia,106.6,300,-325,345,345,,255,265,-275,265,,300,-320,-320,300,,910,110,M,Multi-ply,SBD
2,Vadim Pavlyuk,M1,Russia,107.2,315,-335,-335,315,,200,-212.5,-212.5,200,,-270,270,275,275,,790,110,M,Multi-ply,SBD
3,Jeremy Faulks,M1,UK,108.4,300,-315,315,315,,215,-222.5,222.5,222.5,,250,,,250,,787.5,110,M,Multi-ply,SBD
1,Normunds Tanona,M3,Latvia,107.3,240,260,282.5,282.5,,100,,,100,,240,-260,,240,,622.5,110,M,Multi-ply,SBD
1,Matti Lehto,J,Finland,122.9,280,375,390,390,,230,240,250,250,,290,310,-320,310,,950,125,M,Multi-ply,SBD
DQ,Alexey Shlykov,J,Russia,121.6,370,-385,,370,,,,,,,,,,,,,125,M,Multi-ply,SBD
1,Sergey Starodubskiy,O,Russia,115,385,-405,-405,385,,270,280,285,285,,310,-320,322.5,322.5,,992.5,125,M,Multi-ply,SBD
1,Sergey Starodubskiy,O,Russia,115,385,-405,-405,385,,270,280,285,285,,310,-320,322.5,322.5,,992.5,125,M,Multi-ply,SBD
2,Reiko Kruse,O,Germany,120.5,390,415,430,430,,220,232.5,242.5,242.5,,290,300,320,320,,992.5,125,M,Multi-ply,SBD
3,Michael Schrott,O,Germany,121.2,380,-400,400,400,,-235,235,245,245,,310,-320,-320,310,,955,125,M,Multi-ply,SBD
4,Daniel Dvořák,O,Czechia,112.9,300,330,350,350,,230,250,257.5,257.5,,280,300,-320,300,,907.5,125,M,Multi-ply,SBD
5,Richard Haberl,O,Austria,121.3,-310,-350,350,350,,220,-230,-230,220,,260,280,300,300,,870,125,M,Multi-ply,SBD
6,Richard Revyn,O,Belgium,110.3,305,315,325,325,,190,195,200,200,,260,280,300,300,,825,125,M,Multi-ply,SBD
7,Kristof Van Ransbeeck,O,Belgium,120.6,-300,300,-315,300,,-200,207.5,-215,207.5,,250,-265,-265,250,,757.5,125,M,Multi-ply,SBD
DQ,Jari Rosendahl,O,Finland,123.6,-400,-415,-415,,,,,,,,,,,,,,125,M,Multi-ply,SBD
DQ,Rufat Agaev,O,Azerbaijan,115.9,-405,-405,-415,,,,,,,,,,,,,,125,M,Multi-ply,SBD
DQ,Māris Blūmfelds,O,Latvia,110.1,-320,-340,-350,,,,,,,,,,,,,,125,M,Multi-ply,SBD
1,Andrew Fogarty,M1,Ireland,124.3,310,330,,330,,170,180,190,190,,310,330,-340,330,,850,125,M,Multi-ply,SBD
2,Georg Fortmann,M1,Germany,110.5,297.5,310,320,320,,192.5,-200,-200,192.5,,297.5,310,315,315,,827.5,125,M,Multi-ply,SBD
3,Gary Boulton,M1,UK,120.2,-300,300,335,335,,60,,,60,,275,-285,,275,,670,125,M,Multi-ply,SBD
1,Lee Marshall,M2,UK,116.5,300,360,370,370,-385,190,200,205,205,,300,340,350,350,,925,125,M,Multi-ply,SBD
1,Gunnar De Vadder,J,Belgium,136.2,200,300,-310,300,,200,210,215,215,,220,230,235,235,,750,140,M,Multi-ply,SBD
1,Jonas Rantanen,O,Finland,126.8,420,440,455,455,,65,310,-320,310,,280,310,-335,310,,1075,140,M,Multi-ply,SBD
2,Tomáš Podlipný,O,Czechia,127.9,-360,360,380,380,,230,245,250,250,,300,350,370,370,,1000,140,M,Multi-ply,SBD
3,Philippe Crets,O,Belgium,136.4,330,350,360,360,,-220,230,235,235,,310,330,340,340,,935,140,M,Multi-ply,SBD
4,Oto Pospíšil,O,Czechia,129,290,-320,320,320,,245,255,-265,255,,260,280,-300,280,,855,140,M,Multi-ply,SBD
1,Māris Gūtmanis,M4,Latvia,126.3,240,280,-290,280,,150,-160,-160,150,,240,260,-270,260,,690,140,M,Multi-ply,SBD
1,Jussi Tuomainen,O,Finland,140.2,350,-360,,350,,-280,-280,290,290,,250,325,340,340,,980,140+,M,Multi-ply,SBD
1,Frances Beck,O,Germany,43.6,,,,,,40,45,-50,45,,,,,,,45,44,F,Multi-ply,B
1,Monika Labudova,T1,Czechia,45.7,,,,,,50,60,61,61,,,,,,,61,48,F,Multi-ply,B
1,Svetlana Ņefjodova,M3,Latvia,47.1,,,,,,50,55,57.5,57.5,,,,,,,57.5,48,F,Multi-ply,B
1,Anastasia Sergienko,T3,Russia,50.3,,,,,,-67.5,70,75,75,77.5,,,,,,75,52,F,Multi-ply,B
1,Oksana Koveza,O,Russia,52,,,,,,82.5,87.5,90,90,,,,,,,90,52,F,Multi-ply,B
2,Svenja Parakenings,O,Germany,52,,,,,,50,-57.5,-57.5,50,,,,,,,50,52,F,Multi-ply,B
1,Julia Grothe,J,Germany,55.9,,,,,,55,-60,60,60,,,,,,,60,56,F,Multi-ply,B
1,Marina Medvedeva,O,Russia,55.5,,,,,,95,102.5,107.5,107.5,112,,,,,,107.5,56,F,Multi-ply,B
2,Béatrice Beneke,O,Germany,,,,,,,60,65,67.5,67.5,,,,,,,67.5,56,F,Multi-ply,B
3,Ines Gerhardt,O,Germany,55.6,,,,,,52.5,57.5,60,60,,,,,,,60,56,F,Multi-ply,B
1,Angela Debudey,M1,Germany,54.5,,,,,,50,55,-60,55,,,,,,,55,56,F,Multi-ply,B
1,Christel Schubert,M5,Germany,54.7,,,,,,40,42.5,45,45,,,,,,,45,56,F,Multi-ply,B
1,Manuela Anger,M1,Germany,58.2,,,,,,50,55,57.5,57.5,,,,,,,57.5,60,F,Multi-ply,B
1,Faina Kharif,M2,Israel,58.2,,,,,,35,45,-50,45,,,,,,,45,60,F,Multi-ply,B
1,Soňa Kojanová,J,Czechia,64.9,,,,,,70,80,-87.5,80,,,,,,,80,67.5,F,Multi-ply,B
1,Piroska Horvathné Balogh,O,Hungary,60.5,,,,,,92.5,95,-100,95,,,,,,,95,67.5,F,Multi-ply,B
2,Zsuzsanna Tarjányi,O,Hungary,66.2,,,,,,-87.5,92.5,95,95,,,,,,,95,67.5,F,Multi-ply,B
3,Angelika Morawski,O,Germany,64.3,,,,,,80,85,-87.5,85,,,,,,,85,67.5,F,Multi-ply,B
1,Angelika Morawski,M1,Germany,64.3,,,,,,75,80,85,85,,,,,,,85,67.5,F,Multi-ply,B
1,Hildegard Weinelt,M2,Germany,64,,,,,,62.5,65,67.5,67.5,,,,,,,67.5,67.5,F,Multi-ply,B
2,Anna Markus,M2,Israel,66,,,,,,40,-42.5,-45,40,,,,,,,40,67.5,F,Multi-ply,B
1,Grazyna Vollbehr,M3,Germany,62,,,,,,60,-65,65,65,,,,,,,65,67.5,F,Multi-ply,B
2,Marie-Jacques Burrick,M3,Belgium,64.2,,,,,,60,-65,-67.5,60,,,,,,,60,67.5,F,Multi-ply,B
1,Virpi Pukkila,O,Finland,69.3,,,,,,-120,-120,120,120,,,,,,,120,75,F,Multi-ply,B
2,Michaela Rackova,O,Czechia,70.6,,,,,,-75,75,-85,75,,,,,,,75,75,F,Multi-ply,B
1,Valentīna Abramenko,M1,Latvia,67.6,,,,,,75,-80,-82.5,75,,,,,,,75,75,F,Multi-ply,B
1,Astrid Schroder,M3,Germany,73.8,,,,,,65,70,-72.5,70,,,,,,,70,75,F,Multi-ply,B
1,Sabrina Brandt,J,Germany,80,,,,,,70,-75,-75,70,,,,,,,70,82.5,F,Multi-ply,B
1,Heide Geber,M1,Germany,75.5,,,,,,55,60,65,65,,,,,,,65,82.5,F,Multi-ply,B
1,Libuše Leiblová,M2,Czechia,76.8,,,,,,75,95,-100,95,,,,,,,95,82.5,F,Multi-ply,B
DQ,Ingeborg Hagge,M3,Germany,79.3,,,,,,95,97.5,100,100,,,,,,,,82.5,F,Multi-ply,B
1,Kristaps Ceplis,T1,Latvia,46.9,,,,,,50,55,-57.5,55,,,,,,,55,52,M,Multi-ply,B
1,Timur Akbari,T1,Germany,52.5,,,,,,50,55,-60,55,,,,,,,55,56,M,Multi-ply,B
1,Reno Karkuschke,O,Germany,55.4,,,,,,120,127.5,-138,127.5,-138,,,,,,127.5,56,M,Multi-ply,B
1,Vladimir Scherstner,T3,Germany,59.4,,,,,,95,100,105,105,,,,,,,105,60,M,Multi-ply,B
1,Nicolas Melis,O,France,59.3,,,,,,155,162.5,165,165,,,,,,,165,60,M,Multi-ply,B
2,Gregorie Pulido,O,France,59.1,,,,,,150,155,-162.5,155,,,,,,,155,60,M,Multi-ply,B
3,Mustapha Redouani,O,France,58.7,,,,,,142.5,147.5,-155,147.5,,,,,,,147.5,60,M,Multi-ply,B
1,Frank Wunderlich,M1,Germany,58.9,,,,,,100,105,110,110,,,,,,,110,60,M,Multi-ply,B
1,Levon Sargsyan,T1,Russia,66.1,,,,,,145,165,172.5,172.5,,,,,,,172.5,67.5,M,Multi-ply,B
2,Christian Jacobsen,T1,Germany,66.1,,,,,,90,-95,95,95,,,,,,,95,67.5,M,Multi-ply,B
1,Rico Amelang,T3,Germany,66,,,,,,110,115,-120,115,,,,,,,115,67.5,M,Multi-ply,B
2,Jan Garbas,T3,Germany,66.3,,,,,,110,-120,-120,110,,,,,,,110,67.5,M,Multi-ply,B
1,Simon Quitzau,J,Germany,64.7,,,,,,150,155,-160,155,,,,,,,155,67.5,M,Multi-ply,B
2,David Mahieu,J,Belgium,65,,,,,,82.5,90,-95,90,,,,,,,90,67.5,M,Multi-ply,B
3,Dumpis Gatis,J,Latvia,63,,,,,,70,85,-92.5,85,,,,,,,85,67.5,M,Multi-ply,B
1,Levon Sargsyan,O,Russia,66.1,,,,,,100,,,100,,,,,,,100,67.5,M,Multi-ply,B
1,Frank Oppermann,M2,Germany,66.9,,,,,,105,112.5,117.5,117.5,,,,,,,117.5,67.5,M,Multi-ply,B
1,Steffen Burkhard,M4,Germany,66.8,,,,,,100,102.5,105,105,,,,,,,105,67.5,M,Multi-ply,B
2,Lothar Winter,M4,Germany,64.1,,,,,,-97.5,97.5,-102.5,97.5,,,,,,,97.5,67.5,M,Multi-ply,B
1,Hans Klein,M6,Germany,66.2,,,,,,115,-120,120,120,,,,,,,120,67.5,M,Multi-ply,B
2,Erwin Trichlin,M6,Austria,63.2,,,,,,100,-110,-110,100,,,,,,,100,67.5,M,Multi-ply,B
1,Marcus Heuer,T1,Germany,71.3,,,,,,107.5,115,122.5,122.5,,,,,,,122.5,75,M,Multi-ply,B
1,Phil Coenen,T2,Germany,73.2,,,,,,122.5,130,-135,130,,,,,,,130,75,M,Multi-ply,B
2,Alexandre Chamand,T2,France,70.2,,,,,,97.5,102.5,105,105,,,,,,,105,75,M,Multi-ply,B
1,Leo Graf,T3,Germany,75,,,,,,-105,130,-145,130,,,,,,,130,75,M,Multi-ply,B
2,Benjamin Malzan,T3,Germany,67.8,,,,,,-120,120,-125,120,,,,,,,120,75,M,Multi-ply,B
3,Alexian Mezoued,T3,France,74.4,,,,,,90,100,-110,100,,,,,,,100,75,M,Multi-ply,B
4,Felix Geber,T3,Germany,73.5,,,,,,75,80,85,85,,,,,,,85,75,M,Multi-ply,B
1,Sebastian Graubaum,J,Germany,73.4,,,,,,140,150,-160,150,,,,,,,150,75,M,Multi-ply,B
2,Pavlo Rudnytskyy,J,Ukraine,69,,,,,,115,125,,125,,,,,,,125,75,M,Multi-ply,B
3,Svyatoslav Gerezhuk,J,Ukraine,73.2,,,,,,80,82.5,,82.5,,,,,,,82.5,75,M,Multi-ply,B
1,Ramin Rzayev,O,Azerbaijan,72.9,,,,,,180,190,195,195,,,,,,,195,75,M,Multi-ply,B
2,Sarkhan Aliyev,O,Azerbaijan,73.6,,,,,,185,,-195,185,,,,,,,185,75,M,Multi-ply,B
3,Maxim Kutuzov,O,Germany,74.3,,,,,,165,172.5,-180,172.5,,,,,,,172.5,75,M,Multi-ply,B
2,Andris Greberis,M1,Latvia,74.3,,,,,,152.5,-175,175,175,,,,,,,175,75,M,Multi-ply,B
1,Pascal Lepaire,M2,France,72.4,,,,,,145,-150,-150,145,,,,,,,145,75,M,Multi-ply,B
1,Gerd Müller,M3,Germany,74.5,,,,,,125,130,135,135,,,,,,,135,75,M,Multi-ply,B
1,Joachim Wintorscheidt,M4,Germany,73.2,,,,,,120,-127.5,-127.5,120,,,,,,,120,75,M,Multi-ply,B
1,Guylhem Feraud,M5,France,72.8,,,,,,120,-125,-125,120,,,,,,,120,75,M,Multi-ply,B
1,Anatolijs Kuzmins,M6,Latvia,74.2,,,,,,140,-150,150,150,,,,,,,150,75,M,Multi-ply,B
2,Dieter Schweitzer,M6,Germany,68.5,,,,,,65,70,-75,70,,,,,,,70,75,M,Multi-ply,B
1,Pierre Pothee,M9,France,73.3,,,,,,47.5,52.5,57.5,57.5,-60,,,,,,57.5,75,M,Multi-ply,B
1,Viktor Kessler,T1,Germany,76,,,,,,80,85,90,90,,,,,,,90,82.5,M,Multi-ply,B
1,Alexander Knaack,T2,Germany,81.3,,,,,,130,145,-152.5,145,,,,,,,145,82.5,M,Multi-ply,B
2,Michael Rose,T2,Germany,77.9,,,,,,130,140,-150,140,,,,,,,140,82.5,M,Multi-ply,B
3,Paul Kunz,T2,Germany,79.2,,,,,,85,90,92.5,92.5,,,,,,,92.5,82.5,M,Multi-ply,B
1,Timo Bühnert,T3,Germany,81,,,,,,160,170,-175,170,-181,,,,,,170,82.5,M,Multi-ply,B
2,Ainis Stagars,T3,Latvia,80.8,,,,,,135,145,-150,145,,,,,,,145,82.5,M,Multi-ply,B
3,Kristaps Dudins,T3,Latvia,81.1,,,,,,130,-137.5,-137.5,130,,,,,,,130,82.5,M,Multi-ply,B
DQ,Dmitrijs Burča,T3,Latvia,81.2,,,,,,-170,-170,-180,,,,,,,,,82.5,M,Multi-ply,B
1,Reinhold Gints,J,Latvia,81.8,,,,,,190,200,207.5,207.5,-208.5,,,,,,207.5,82.5,M,Multi-ply,B
2,Julien Marro,J,France,80.9,,,,,,190,200,,200,,,,,,,200,82.5,M,Multi-ply,B
3,Andreas Donath,J,Germany,80.7,,,,,,180,190,-200,190,,,,,,,190,82.5,M,Multi-ply,B
4,Visar Shala,J,Germany,82.2,,,,,,-160,160,172.5,172.5,,,,,,,172.5,82.5,M,Multi-ply,B
5,Denis Druzhinin,J,Russia,79.9,,,,,,160,170,,170,,,,,,,170,82.5,M,Multi-ply,B
6,Andris Rudzitis,J,Latvia,81,,,,,,145,150,-160,150,,,,,,,150,82.5,M,Multi-ply,B
1,Sergey Koshkin,O,Russia,81.6,,,,,,-230,240,260,260,-278,,,,,,260,82.5,M,Multi-ply,B
2,Vasyl' Khoroschak,O,Ukraine,82,,,,,,240,250,260,260,-279,,,,,,260,82.5,M,Multi-ply,B
3,István Juhász,O,Hungary,82,,,,,,230,240,250,250,,,,,,,250,82.5,M,Multi-ply,B
4,Stefan Oesterle,O,Germany,80.3,,,,,,200,220,230,230,,,,,,,230,82.5,M,Multi-ply,B
5,Vagif Jafarov Namig,O,Azerbaijan,81.1,,,,,,-200,210,-222.5,210,,,,,,,210,82.5,M,Multi-ply,B
6,Michael Monier,O,France,80.6,,,,,,170,180,-185,180,,,,,,,180,82.5,M,Multi-ply,B
7,Alexandr Liskovich,O,Israel,78,,,,,,180,-190,-260,180,,,,,,,180,82.5,M,Multi-ply,B
8,Pavlo Zinko,O,Ukraine,82.2,,,,,,135,145,-155,145,,,,,,,145,82.5,M,Multi-ply,B
1,Aleksandrs Miglāns,M1,Latvia,79.9,,,,,,175,-190,-200,175,,,,,,,175,82.5,M,Multi-ply,B
2,Gunther Stolt,M1,Germany,79.9,,,,,,152.5,157.5,165,165,,,,,,,165,82.5,M,Multi-ply,B
1,Berthold Rien,M2,Germany,78.6,,,,,,130,140,150,150,,,,,,,150,82.5,M,Multi-ply,B
1,Jürgen Teubner,M3,Germany,80.6,,,,,,175,185,-200,185,,,,,,,185,82.5,M,Multi-ply,B
2,Leopold Likh,M3,Russia,81.6,,,,,,150,160,-167.5,160,,,,,,,160,82.5,M,Multi-ply,B
3,Christoph Morawski,M3,Germany,81.2,,,,,,155,160,-170,160,,,,,,,160,82.5,M,Multi-ply,B
1,Risto Leskenmaa,M4,Finland,81.9,,,,,,160,170,201,201,,,,,,,201,82.5,M,Multi-ply,B
2,Reinhold Schaumann-Kelch,M4,Germany,79.3,,,,,,140,145,-150,145,,,,,,,145,82.5,M,Multi-ply,B
3,Ivan Kulischnikov,M4,Germany,82.2,,,,,,120,125,-130,125,,,,,,,125,82.5,M,Multi-ply,B
1,Jean-Marie Kubick,M5,France,80.9,,,,,,142.5,147.5,155,155,,,,,,,155,82.5,M,Multi-ply,B
2,Valeris Petrov,M5,Latvia,81,,,,,,140,150,-157.5,150,,,,,,,150,82.5,M,Multi-ply,B
1,Konrad Högg,M6,Austria,75.3,,,,,,135,140,145,145,,,,,,,145,82.5,M,Multi-ply,B
1,Günther Tschierschky,M7,Germany,81,,,,,,105,110,115,115,,,,,,,115,82.5,M,Multi-ply,B
2,Bernhard Gromadecky,M7,Germany,77.4,,,,,,95,100,-102.5,100,,,,,,,100,82.5,M,Multi-ply,B
1,Maxim Trubacistovs,T2,Latvia,87.1,,,,,,145,-152.5,155,155,,,,,,,155,90,M,Multi-ply,B
2,Zdenk Bakus,T2,Czechia,88.3,,,,,,140,147.5,-157.5,147.5,,,,,,,147.5,90,M,Multi-ply,B
DQ,Lars Jenjahn,T2,Germany,88.4,,,,,,-125,-125,-125,,,,,,,,,90,M,Multi-ply,B
1,Benoit Humbert,T3,France,87.3,,,,,,120,127.5,132.5,132.5,,,,,,,132.5,90,M,Multi-ply,B
2,Waldemar Becker,T3,Germany,88.5,,,,,,130,-140,-140,130,,,,,,,130,90,M,Multi-ply,B
3,Andrej Bole,T3,Germany,86.1,,,,,,100,105,110,110,,,,,,,110,90,M,Multi-ply,B
DQ,Julien Girardin,T3,Switzerland,85.8,,,,,,-150,-155,-160,,,,,,,,,90,M,Multi-ply,B
1,Mathias Wendt,J,Germany,86.8,,,,,,195,202.5,207.5,207.5,,,,,,,207.5,90,M,Multi-ply,B
2,Pierre Oudeville,J,France,87.4,,,,,,170,-190,-190,170,,,,,,,170,90,M,Multi-ply,B
DQ,Eric Biermordt,J,Germany,87.1,,,,,,-190,-190,-205,,,,,,,,,90,M,Multi-ply,B
1,László Kupcsik,O,Hungary,89.8,,,,,,260,270,275,275,278,,,,,,275,90,M,Multi-ply,B
2,Vitaliy Ponomarev,O,Russia,89.6,,,,,,235,245,-272.5,245,,,,,,,245,90,M,Multi-ply,B
3,Laurent Gonzalez,O,France,89.8,,,,,,215,-225,225,225,,,,,,,225,90,M,Multi-ply,B
4,Dzhabir Ibragimov,O,Azerbaijan,88.7,,,,,,200,212.5,217.5,217.5,,,,,,,217.5,90,M,Multi-ply,B
5,David Velička,O,Czechia,88.6,,,,,,195,202.5,210,210,,,,,,,210,90,M,Multi-ply,B
6,Michal Zamazal,O,Czechia,89.2,,,,,,-190,200,210,210,,,,,,,210,90,M,Multi-ply,B
DQ,Cédric Martin,O,France,88.4,,,,,,-195,-205,-205,,,,,,,,,90,M,Multi-ply,B
DQ,Mustafa Sahib Ahmadov,O,Azerbaijan,89.6,,,,,,-235,-245,-245,,,,,,,,,90,M,Multi-ply,B
1,Jan Vrba,M1,Czechia,88.6,,,,,,130,180,185,185,,,,,,,185,90,M,Multi-ply,B
2,Andrejs Katins,M1,Latvia,89,,,,,,157.5,165,172.5,172.5,,,,,,,172.5,90,M,Multi-ply,B
1,Peter Rathke,M2,Germany,88.6,,,,,,205,215,-230,215,,,,,,,215,90,M,Multi-ply,B
2,Enzo Valentini,M2,France,86.7,,,,,,140,155,-165,155,,,,,,,155,90,M,Multi-ply,B
1,Michael Lorenzen-Schmidt,M3,Germany,86.4,,,,,,175,-180,-180,175,,,,,,,175,90,M,Multi-ply,B
1,Marek Morawski,M4,Germany,83,,,,,,165,173,-180,173,,,,,,,173,90,M,Multi-ply,B
2,Igor Barski,M4,Israel,83.8,,,,,,120,-150,150,150,,,,,,,150,90,M,Multi-ply,B
1,Alexandrs Smelovs,M5,Latvia,88,,,,,,155,170,-185,170,,,,,,,170,90,M,Multi-ply,B
1,Roland Schubert,M6,Germany,88.1,,,,,,157.5,172.5,-177.5,172.5,,,,,,,172.5,90,M,Multi-ply,B
1,Janos Deli,T3,Hungary,97.5,,,,,,210,220,225.5,225.5,,,,,,,225.5,100,M,Multi-ply,B
2,Ģirts Gūtmanis,T3,Latvia,95.4,,,,,,130,140,150,150,,,,,,,150,100,M,Multi-ply,B
1,Brice Herbert,J,France,99.2,,,,,,285,-290,-290,285,,,,,,,285,100,M,Multi-ply,B
2,Nicolas Monier,J,France,90.3,,,,,,120,-160,160,160,,,,,,,160,100,M,Multi-ply,B
3,Alex Schatzki,J,Germany,93.4,,,,,,110,115,122.5,122.5,,,,,,,122.5,100,M,Multi-ply,B
1,Konstantin Otavin,O,Russia,99.2,,,,,,280,287.5,290,290,-305.5,,,,,,290,100,M,Multi-ply,B
2,Bernhard Schwab,O,Austria,99.6,,,,,,280,-287.5,290,290,,,,,,,290,100,M,Multi-ply,B
3,Tahir Mardanov Vusal,O,Azerbaijan,99.6,,,,,,270,-282.5,-290,270,,,,,,,270,100,M,Multi-ply,B
4,Andrey Paley,O,Russia,99.4,,,,,,250,-257.5,257.5,257.5,,,,,,,257.5,100,M,Multi-ply,B
5,David Micek,O,Germany,97.6,,,,,,235,245,-250,245,,,,,,,245,100,M,Multi-ply,B
6,Daniel Kaufmann,O,Germany,99,,,,,,235,245,-270,245,,,,,,,245,100,M,Multi-ply,B
7,Normunds Sovokins,O,Latvia,97.4,,,,,,220,235,240,240,,,,,,,240,100,M,Multi-ply,B
8,Harald Selsam,O,Germany,99.3,,,,,,240,-255,-255,240,,,,,,,240,100,M,Multi-ply,B
9,Steven Peters,O,Germany,98.7,,,,,,235,-245,-255,235,,,,,,,235,100,M,Multi-ply,B
10,Aivars Krumins,O,Latvia,94.5,,,,,,165,175,-200,175,,,,,,,175,100,M,Multi-ply,B
1,Sergey Gromov,M1,Russia,98.9,,,,,,250,260,265,265,-271,,,,,,265,100,M,Multi-ply,B
2,Arturas Virbickas,M1,Latvia,100,,,,,,220,230,-240,230,,,,,,,230,100,M,Multi-ply,B
3,Juha Pukkila,M1,Finland,98.7,,,,,,205,210,220,220,,,,,,,220,100,M,Multi-ply,B
1,Andrey Paley,M2,Russia,98.4,,,,,,-240,240,-262.5,240,,,,,,,240,100,M,Multi-ply,B
2,Robert Brasseur,M2,France,98.6,,,,,,220,230,,230,,,,,,,230,100,M,Multi-ply,B
1,Vitaliy Ponomarev,M3,Russia,92,,,,,,215,220,,220,,,,,,,220,100,M,Multi-ply,B
2,Valeriy Fadeev,M3,Russia,99.5,,,,,,180,202.5,-205,202.5,,,,,,,202.5,100,M,Multi-ply,B
1,Axel Gersdorf,M4,Germany,98,,,,,,202.5,205,210,210,,,,,,,210,100,M,Multi-ply,B
2,Hans-Jürgen Borkowski,M4,Germany,99.4,,,,,,190,200,-207.5,200,,,,,,,200,100,M,Multi-ply,B
1,Henri Marion,M5,France,94.8,,,,,,160,-170,172.5,172.5,,,,,,,172.5,100,M,Multi-ply,B
2,Heinz-Joachim Probst,M5,Germany,97,,,,,,-95,-110,110,110,,,,,,,110,100,M,Multi-ply,B
1,Marc LeBolay,M6,France,98.4,,,,,,170,175,177.5,177.5,,,,,,,177.5,100,M,Multi-ply,B
1,Igor Goldman,M7,Russia,97.7,,,,,,140,155.5,,155.5,,,,,,,155.5,100,M,Multi-ply,B
1,Yuriy Khandzhyan,T1,Russia,105.3,,,,,,-160,-160,160,160,-175,,,,,,160,110,M,Multi-ply,B
1,Mārtiņš Apškalns,J,Latvia,100.4,,,,,,240,255,-275,255,,,,,,,255,110,M,Multi-ply,B
2,Jakub Gutveis,J,Czechia,101.9,,,,,,180,190,200,200,,,,,,,200,110,M,Multi-ply,B
1,Matthias Marten,O,Germany,108.8,,,,,,325,-330,330,330,-337,,,,,,330,110,M,Multi-ply,B
2,Aleksandr Tretyakov #1,O,Russia,109.3,,,,,,310,-317.5,-327.5,310,,,,,,,310,110,M,Multi-ply,B
3,Ivars Ozols,O,Latvia,106.6,,,,,,270,282.5,-290,282.5,,,,,,,282.5,110,M,Multi-ply,B
4,Zoltán Csepregi,O,Hungary,103.7,,,,,,280,-300,-300,280,,,,,,,280,110,M,Multi-ply,B
5,Didier Michelon,O,France,107.5,,,,,,245,-255,,245,,,,,,,245,110,M,Multi-ply,B
6,Kaspar Petr,O,Czechia,102.8,,,,,,200,210,220,220,,,,,,,220,110,M,Multi-ply,B
7,Vili Rinkinen,O,Finland,107.7,,,,,,210,220,-230,220,,,,,,,220,110,M,Multi-ply,B
8,Igor Poliačik,O,Czechia,108,,,,,,190,200,-210,200,,,,,,,200,110,M,Multi-ply,B
DQ,Ibrahim Ibrahimov,O,Azerbaijan,108.7,,,,,,-280,-280,-292.5,,,,,,,,,110,M,Multi-ply,B
DQ,Gerd Tiefenbacher,O,Austria,103.8,,,,,,-312.5,-312.5,-312.5,,,,,,,,,110,M,Multi-ply,B
1,István Hegedüs,M1,Hungary,109,,,,,,240,250,255,255,,,,,,,255,110,M,Multi-ply,B
2,Didier Michelon,M1,France,108.2,,,,,,235,-250,252.5,252.5,,,,,,,252.5,110,M,Multi-ply,B
3,István Ágoston,M1,Hungary,104.8,,,,,,235,245,250,250,,,,,,,250,110,M,Multi-ply,B
4,Vadim Pavlyuk,M1,Russia,108.9,,,,,,200,210,,210,,,,,,,210,110,M,Multi-ply,B
1,Ulrich Woelk,M2,Germany,107.5,,,,,,220,-230,,220,,,,,,,220,110,M,Multi-ply,B
2,Udo Krumbholz,M2,Germany,100.7,,,,,,200,210,-220,210,,,,,,,210,110,M,Multi-ply,B
3,Yuriy Borysov,M2,Ukraine,100.1,,,,,,-100,105,110,110,,,,,,,110,110,M,Multi-ply,B
DQ,Krystian Slosarek,M2,Germany,109.6,,,,,,-215,-222.5,-222.5,,,,,,,,,110,M,Multi-ply,B
1,Karel Leibl,M3,Czechia,100.3,,,,,,150,160,170,170,,,,,,,170,110,M,Multi-ply,B
1,Josef Nussbaumer,M4,Austria,107.9,,,,,,225,-236,236,236,,,,,,,236,110,M,Multi-ply,B
2,Hans-Ulrich Vetter,M4,Germany,105.3,,,,,,-200,205,-225,205,,,,,,,205,110,M,Multi-ply,B
3,Simon Reitzke,M4,Germany,109.6,,,,,,150,160,165,165,,,,,,,165,110,M,Multi-ply,B
1,Joachim Eulenstein,M5,Germany,107.5,,,,,,140,145,147.5,147.5,,,,,,,147.5,110,M,Multi-ply,B
1,Alexey Shlykov,J,Russia,120.6,,,,,,250,-255,-255,250,,,,,,,250,125,M,Multi-ply,B
2,Edgars Spila,J,Latvia,118.4,,,,,,220,230,-245,230,,,,,,,230,125,M,Multi-ply,B
DQ,Matti Lehto,J,Finland,122,,,,,,-245,-245,-245,,,,,,,,,125,M,Multi-ply,B
1,Sergey Starodubskiy,O,Russia,115.6,,,,,,282.5,290,-300,290,,,,,,,290,125,M,Multi-ply,B
2,Kai-Uwe Göllnitz,O,Germany,121.9,,,,,,285,-292.5,-292.5,285,,,,,,,285,125,M,Multi-ply,B
3,Jani Toivo Kristian Ihalainen,O,Finland,115.3,,,,,,260,270,277.5,277.5,,,,,,,277.5,125,M,Multi-ply,B
4,Martin Baumbach,O,Germany,115.3,,,,,,255,270,275,275,,,,,,,275,125,M,Multi-ply,B
5,Janis Klamers,O,Latvia,111.8,,,,,,180,-205,-205,180,,,,,,,180,125,M,Multi-ply,B
DQ,Sasa Bojovil,O,Germany,116,,,,,,-270,-270,-277.5,,,,,,,,,125,M,Multi-ply,B
1,Gyula Szatmari,M1,Hungary,113.1,,,,,,-235,-235,235,235,,,,,,,235,125,M,Multi-ply,B
2,Georg Fortmann,M1,Germany,110.5,,,,,,190,200,205,205,,,,,,,205,125,M,Multi-ply,B
1,Stipe Caletha,M2,Germany,120,,,,,,200,215,222.5,222.5,,,,,,,222.5,125,M,Multi-ply,B
2,Andreas Mrosek,M2,Germany,115.2,,,,,,190,-205,-215,190,,,,,,,190,125,M,Multi-ply,B
1,Viktors Pevko,M3,Latvia,115.9,,,,,,225,,235,235,,,,,,,235,125,M,Multi-ply,B
2,Andreas Richter,M3,Germany,116.1,,,,,,225,-232.5,232.5,232.5,,,,,,,232.5,125,M,Multi-ply,B
3,Peter Sammrey,M3,Germany,124.3,,,,,,205,210,-217.5,210,,,,,,,210,125,M,Multi-ply,B
1,Alexander Maksimushkin,M4,Russia,118.1,,,,,,230,245,-250.5,245,,,,,,,245,125,M,Multi-ply,B
1,Jonas Rantanen,J,Finland,126.4,,,,,,310,-320,,310,,,,,,,310,140,M,Multi-ply,B
1,Gints Gridbeirgs,O,Latvia,127.1,,,,,,220,235,240,240,,,,,,,240,140,M,Multi-ply,B
2,Radovan Kaděra,O,Czechia,125.3,,,,,,215,230,237.5,237.5,,,,,,,237.5,140,M,Multi-ply,B
3,Karel Koldovský,O,Czechia,125.2,,,,,,200,215,220,220,,,,,,,220,140,M,Multi-ply,B
DQ,Franz Seewald,O,Austria,131.1,,,,,,-290,-295,-305,,,,,,,,,140,M,Multi-ply,B
DQ,Vladimir Maksimov,O,Russia,128.5,,,,,,-350,-350,-350,,,,,,,,,140,M,Multi-ply,B
DQ,Tomi Rantanen,O,Finland,130.8,,,,,,-360,-375,-375,,,,,,,,,140,M,Multi-ply,B
1,Vladimir Maksimov,M1,Russia,129.2,,,,,,340,-367.5,-367.5,340,,,,,,,340,140,M,Multi-ply,B
2,Tomas Veselý,M1,Czechia,127.5,,,,,,-170,-170,190,190,,,,,,,190,140,M,Multi-ply,B
DQ,Volker Stamm,M1,Germany,133.9,,,,,,-275,-285,-300,,,,,,,,,140,M,Multi-ply,B
1,Mario Böttcher,M2,Germany,136,,,,,,240,257.5,270,270,,,,,,,270,140,M,Multi-ply,B
2,Mentes Gabor,M2,Hungary,132,,,,,,225,-240,240,240,,,,,,,240,140,M,Multi-ply,B
1,Māris Gūtmanis,M4,Latvia,125.7,,,,,,130,-140,,130,,,,,,,130,140,M,Multi-ply,B
1,Jussi Tuomainen,O,Finland,140.1,,,,,,280,300,,300,,,,,,,300,140+,M,Multi-ply,B
2,Alexey Brazhkin,O,Russia,140.4,,,,,,-270,270,-302.5,270,,,,,,,270,140+,M,Multi-ply,B
3,Hans-Peter Brucker,O,Germany,144.3,,,,,,220,243,,243,,,,,,,243,140+,M,Multi-ply,B
4,Karl-Ralf Quint,O,Germany,146.5,,,,,,200,-210,210,210,,,,,,,210,140+,M,Multi-ply,B
