Division,WeightClassKg,Place,Name,Team,BodyweightKg,Best3SquatKg,Best3BenchKg,Best3DeadliftKg,TotalKg,Equipment,Event,Sex,BirthDate
Boys,59.87,1,Brennan Riker,Post,59.24,197.31,106.59,170.1,474,Single-ply,SBD,M,
Boys,59.87,2,Toby Crabb,Slaton,58.51,158.76,108.86,161.03,428.64,Single-ply,SBD,M,
Boys,67.13,1,Landen Simmons,Slaton,66.86,183.7,120.2,179.17,483.08,Single-ply,SBD,M,
Boys,67.13,2,Jesus Montoya,Post,64.32,151.95,86.18,140.61,378.75,Single-ply,SBD,M,
Boys,67.13,3,Quincy Graham,Slaton,65.14,129.27,79.38,124.74,333.39,Single-ply,SBD,M,
Boys,74.84,1,Chris Rader,Slaton,74.39,215.46,131.54,217.72,564.72,Single-ply,SBD,M,
Boys,74.84,2,Eddie Betancourt,Slaton,73.75,192.78,131.54,215.46,539.77,Single-ply,SBD,M,
Boys,74.84,3,Landon Pevey,Post,74.84,183.7,97.52,172.37,453.59,Single-ply,SBD,M,
Boys,74.84,4,Cj Anzley,Slaton,73.39,154.22,113.4,181.44,449.06,Single-ply,SBD,M,
Boys,74.84,5,Bryson Salazar,Slaton,73.03,145.15,102.06,156.49,403.7,Single-ply,SBD,M,
Boys,74.84,6,Jayden Aleman,Slaton,67.77,86.18,61.23,106.59,254.01,Single-ply,SBD,M,
Boys,82.1,1,Jacorien Doss,Slaton,77.02,165.56,102.06,185.97,453.59,Single-ply,SBD,M,
Boys,82.1,2,Nick Quintana,Post,79.83,174.63,97.52,181.44,453.59,Single-ply,SBD,M,
Boys,82.1,3,Cj Linarez,Slaton,80.65,138.35,74.84,154.22,367.41,Single-ply,SBD,M,
Boys,89.81,1,Alejandro Rodriguez,Post,85.28,163.29,99.79,170.1,433.18,Single-ply,SBD,M,
Boys,99.79,1,Cole Boren,Post,94.35,254.01,161.03,210.92,625.96,Single-ply,SBD,M,
Boys,109.77,1,Knoah Escobedo,Post,106.5,185.97,115.67,179.17,480.81,Single-ply,SBD,M,
Boys,124.74,1,Taye Perez,Post,124.56,249.48,158.76,258.55,666.78,Single-ply,SBD,M,
Boys,139.71,1,Javen Diaz,Post,138.71,256.28,138.35,219.99,614.62,Single-ply,SBD,M,
