Division,WeightClassKg,Place,Name,Team,BodyweightKg,Best3SquatKg,Best3BenchKg,Best3DeadliftKg,TotalKg,Equipment,Event,Sex,BirthDate
Boys,51.71,1,Sebastian Urteaga,Eustace,49.9,127.01,68.04,129.27,324.32,Single-ply,SBD,M,
Boys,55.79,1,Aaron Neal,Eustace,55.52,115.67,68.04,142.88,326.59,Single-ply,SBD,M,
Boys,67.13,1,Logan Baker #3,Eustace,63.5,179.17,108.86,170.1,458.13,Single-ply,SBD,M,
Boys,67.13,2,Ty'Nyrious Baker,Terrell,67.13,142.88,74.84,163.29,381.02,Single-ply,SBD,M,
Boys,74.84,1,Colton Milligan,Terrell,68.49,142.88,102.06,136.08,381.02,Single-ply,SBD,M,
Boys,74.84,2,Joe Gomez,Eustace,68.04,136.08,70.31,142.88,349.27,Single-ply,SBD,M,
Boys,74.84,3,Micah Eaton,Eustace,68.49,83.91,58.97,83.91,226.8,Single-ply,SBD,M,
Boys,82.1,1,Josh Garcia,Eustace,77.11,149.69,92.99,158.76,401.43,Single-ply,SBD,M,
Boys,82.1,2,Zacckary Swasso,Eustace,75.75,113.4,63.5,136.08,312.98,Single-ply,SBD,M,
Boys,89.81,1,Travis Munden,Eustace,85.28,158.76,97.52,172.37,428.64,Single-ply,SBD,M,
Boys,89.81,2,Wilfred Bowers,Eustace,83.46,131.54,81.65,154.22,367.41,Single-ply,SBD,M,
Boys,99.79,1,Christien Hedgeman,Terrell,98.43,190.51,102.06,188.24,480.81,Single-ply,SBD,M,
Boys,99.79,2,Cameron Winkles,Eustace,95.71,167.83,104.33,183.7,455.86,Single-ply,SBD,M,
Boys,99.79,3,Gabriel Rudman,Eustace,90.26,149.69,104.33,163.29,417.3,Single-ply,SBD,M,
Boys,99.79,4,Conner Johnson,Eustace,90.26,149.69,88.45,158.76,396.89,Single-ply,SBD,M,
Boys,99.79,5,Damon Dunbar,Terrell,91.63,158.76,65.77,163.29,387.82,Single-ply,SBD,M,
Boys,109.77,1,Michkeal Kennedy,Terrell,107.5,204.12,108.86,188.24,501.22,Single-ply,SBD,M,
Boys,109.77,2,Cody Phillips,Terrell,107.05,181.44,90.72,195.04,467.2,Single-ply,SBD,M,
Boys,109.77,3,Hersey McCrady,Terrell,105.23,167.83,97.52,149.69,415.04,Single-ply,SBD,M,
Boys,109.77,4,Jordan Grant,Eustace,108.86,136.08,115.67,149.69,401.43,Single-ply,SBD,M,
Boys,124.74,1,Jocob Chandler,Eustace,124.74,226.8,99.79,197.31,523.9,Single-ply,SBD,M,
Boys,124.74,2,David French,Eustace,113.4,188.24,133.81,197.31,519.36,Single-ply,SBD,M,
Boys,124.74,3,Cody Byrd,Eustace,111.13,183.7,104.33,179.17,467.2,Single-ply,SBD,M,
Boys,139.71+,1,Joshua Nwankap,Terrell,150.14,170.1,113.4,190.51,474,Single-ply,SBD,M,
