Division,WeightClassKg,Place,Name,Team,BodyweightKg,Best3SquatKg,Best3BenchKg,Best3DeadliftKg,TotalKg,Equipment,Event,Sex,BirthDate
Girls,47.85,1,Bella Montemayor,Elgin,46.9,65.77,31.75,65.77,163.29,Single-ply,SBD,F,
Girls,47.85,2,Chesney Mouser,Smithville,47.81,54.43,40.82,61.23,156.49,Single-ply,SBD,F,
Girls,56.02,1,Kayla Herrera,Giddings,55.07,106.59,45.36,102.06,254.01,Single-ply,SBD,F,
Girls,56.02,2,Cassady Galabeas,Smithville,55.88,99.79,38.56,97.52,235.87,Single-ply,SBD,F,
Girls,60.1,1,Makiah Grant,Elgin,58.24,106.59,52.16,108.86,267.62,Single-ply,SBD,F,
Girls,60.1,NS,Galilea Trujillo,Elgin,,,,,,Single-ply,SBD,F,
Girls,67.36,1,Alyssary Wade,Elgin,65.95,104.33,49.9,106.59,260.82,Single-ply,SBD,F,
Girls,67.36,2,Azalea Palacios,Elgin,63.59,102.06,54.43,97.52,254.01,Single-ply,SBD,F,
Girls,67.36,3,Avery Davis #3,Giddings,64.5,58.97,31.75,74.84,165.56,Single-ply,SBD,F,
Girls,75.07,1,Dayla Palacios,Elgin,74.12,120.2,70.31,117.93,308.44,Single-ply,SBD,F,
Girls,82.33,1,Kiara Trevino,Smithville,82.01,97.52,65.77,104.33,267.62,Single-ply,SBD,F,
Girls,82.33,DQ,Marisa Puente,Giddings,77.38,,45.36,,,Single-ply,SBD,F,
Girls,90.04,1,Ainsley Orme,Elgin,84.73,127.01,65.77,106.59,299.37,Single-ply,SBD,F,
Girls,90.04,2,Victoria Smith,Giddings,88.9,111.13,56.7,95.25,263.08,Single-ply,SBD,F,
Girls,90.04,3,Ayla Ramos,Smithville,89.9,45.36,43.09,88.45,176.9,Single-ply,SBD,F,
Girls,90.04,DQ,Persia Rodriguez,Giddings,82.83,92.99,54.43,,,Single-ply,SBD,F,
Girls,100.02,1,Ariel Lopez #1,Giddings,96.07,147.42,81.65,136.08,365.14,Single-ply,SBD,F,
Girls,100.02,2,Emma Huerta,Smithville,99.7,102.06,65.77,117.93,285.76,Single-ply,SBD,F,
Girls,100.02,3,Steeley Earp,Smithville,92.71,86.18,54.43,97.52,238.14,Single-ply,SBD,F,
Girls,100.02,4,Jami Robledo,Elgin,96.07,81.65,58.97,70.31,210.92,Single-ply,SBD,F,
Girls,117.71,1,Aranza Zuniga-Hernandez,Elgin,101.51,117.93,70.31,106.59,294.84,Single-ply,SBD,F,
Girls,117.71,2,Lina Price,Giddings,111.67,92.99,79.38,111.13,283.5,Single-ply,SBD,F,
Girls,117.71,3,Trezser Anderson,Smithville,104.78,90.72,56.7,120.2,267.62,Single-ply,SBD,F,
Girls,117.71,4,Kyndadi Blackmore,Elgin,114.03,111.13,52.16,90.72,254.01,Single-ply,SBD,F,
Girls,117.71+,1,Emily Hernandez,Giddings,120.02,127.01,65.77,111.13,303.91,Single-ply,SBD,F,
Girls,117.71+,2,Cheyenne Stratton,Elgin,134.54,79.38,61.23,106.59,247.21,Single-ply,SBD,F,
Girls,117.71+,NS,Delaney Turner,Giddings,,,,,,Single-ply,SBD,F,
