Name,Team,Sex,BirthDate,Division,BodyweightKg,WeightClassKg,Squat1Kg,Squat2Kg,Squat3Kg,Best3SquatKg,Squat4Kg,Bench1Kg,Bench2Kg,Bench3Kg,Best3BenchKg,Bench4Kg,Deadlift1Kg,Deadlift2Kg,Deadlift3Kg,Best3DeadliftKg,Deadlift4Kg,TotalKg,Place,Event,Equipment
Manon Sene,Maromme,F,2002-09-26,F-T2,59.3,63,85,90,96,96,-100,,,,,,,,,,,96,1,S,Raw
Stéphanie Lagrange,Beauvoir,F,1976-05-21,F-M1,61.2,63,107.5,112.5,120,120,,,,,,,,,,,,120,1,S,Raw
Charles Maheust,Lisieux,M,2000-02-22,M-T3,57.9,60,120,-125,-125,120,,,,,,,,,,,,120,1,S,Raw
Yohann Jacquemard,Rioz,M,1994-01-10,M-O,73.5,75,157.5,-165,,157.5,,,,,,,,,,,,157.5,1,S,Raw
Patrick Metayer,Saint Aubin,M,1964-08-26,M-M3,74.8,75,135,145,151,151,,,,,,,,,,,,151,1,S,Raw
Benjamin Cannessant,Saint Aubin,M,1988-04-24,M-O,82.5,82.5,200,-210.5,-210.5,200,,,,,,,,,,,,200,1,S,Raw
Manu Faber,Rioz,M,1978-07-07,M-M1,80.8,82.5,170,-180,180,180,,,,,,,,,,,,180,1,S,Raw
Daniel Fortier,Evreux,M,1958-12-11,M-M5,80.6,82.5,152.5,160,,160,,,,,,,,,,,,160,1,S,Raw
Patrick Simonin,Rioz,M,1956-07-21,M-M5,86.2,90,135,140,145,145,150,,,,,,,,,,,145,1,S,Raw
Serge Bustreel,Trilport,M,1946-05-24,M-M7,98.6,100,-190,200,-208,200,,,,,,,,,,,,200,1,S,Raw
Océane Galtier,Yerres,F,1999-10-26,F-T3,62.1,63,,,,,,,,,,,97.5,105,,105,,105,1,D,Raw
Sarah Meunier,Yerres,F,1978-11-12,F-M1,62.1,63,,,,,,,,,,,110,120,-125.5,120,,120,1,D,Raw
Nina Le Blevenec,Yerres,F,1972-01-31,F-M2,61.9,63,,,,,,,,,,,142.5,148,152.5,152.5,155,152.5,1,D,Raw
Marie Julien,Yerres,F,1994-02-17,F-O,69.6,70,,,,,,,,,,,120,127.5,135,135,,135,1,D,Raw
Thibault Auguste,Gournay,M,1998-09-15,M-JR,55.5,56,,,,,,,,,,,137.5,145,-152.5,145,,145,1,D,Raw
Charles Maheust,Lisieux,M,2000-02-22,M-T3,57,60,,,,,,,,,,,150,-162.5,-162.5,150,,150,1,D,Raw
Duke Douret,,M,1995-04-21,M-JR,65.9,67.5,,,,,,,,,,,190,-200,-200,190,,190,1,D,Raw
Alexis Kalpakdjian,Trilport,M,2003-02-20,M-T2,65.5,67.5,,,,,,,,,,,120,130,-140,130,,130,1,D,Raw
Paul Reiners,Yerres,M,1993-10-22,M-O,73.8,75,,,,,,,,,,,202.5,212.5,220,220,,220,1,D,Raw
Ibrahim Dem,Saint Aubin,M,1990-08-04,M-O,73.6,75,,,,,,,,,,,190,202.5,-217.5,202.5,,202.5,2,D,Raw
Jean-Claude D'Heilly,,M,1958-05-29,M-M5,73.9,75,,,,,,,,,,,192.5,206,210,210,,210,2,D,Raw
Daniel Delaporte,Maromme,M,1948-05-21,M-M7,74.2,75,,,,,,,,,,,150,170,181,181,-182.5,181,1,D,Raw
Jean-Claude D'Heilly,,M,1958-05-29,M-M5,73.9,75,,,,,,,,,,,205,221,-230,221,,221,1,D,Raw
Julien Samyn,Lisieux,M,2001-06-14,M-T2,79.2,82.5,,,,,,,,,,,160,-175,,160,,160,1,D,Raw
Nicolas Fanni,Evreux,M,1990-02-11,M-O,81.8,82.5,,,,,,,,,,,220,230,-240,230,,230,1,D,Raw
Manu Faber,Rioz,M,1978-07-07,M-M1,81,82.5,,,,,,,,,,,222.5,232.5,242.5,242.5,,242.5,1,D,Raw
Daniel Fortier,Evreux,M,1958-12-11,M-M5,81.9,82.5,,,,,,,,,,,195,205,212.5,212.5,,212.5,1,D,Raw
Antonio Carbone,Yerres,M,1956-02-14,M-M5,81.9,82.5,,,,,,,,,,,175,182.5,-190,182.5,,182.5,2,D,Raw
David Mssa,Yerres,M,1981-10-10,M-O,87.3,90,,,,,,,,,,,240,255,273,273,,273,1,D,Raw
Emmanuel Preclaire,Yerres,M,1970-08-16,M-M2,88.7,90,,,,,,,,,,,215,230,240.5,240.5,,240.5,1,D,Raw
Jonny Piotrowski,Oissel,M,1961-07-29,M-M4,87.8,90,,,,,,,,,,,175,185,-187.5,185,,185,1,D,Raw
Stéphane Simon,Yerres,M,1975-07-17,M-M1,88.5,90,,,,,,,,,,,190,210,-222.5,210,,210,1,D,Raw
Valentin Pons,Gournay,M,2000-05-13,M-T3,99.5,100,,,,,,,,,,,230,240,-247.5,240,,240,1,D,Raw
Mathieu Baudin,Trilport,M,1998-12-28,M-JR,98.3,100,,,,,,,,,,,210,217.5,-222.5,217.5,,217.5,1,D,Raw
Serge Bustreel,Trilport,M,1946-05-24,M-M7,98.5,100,,,,,,,,,,,215,230,240,240,-245,240,1,D,Raw
Jonathan Finot,Paray,M,1989-01-09,M-O,108.3,110,,,,,,,,,,,220,235,-247.5,235,,235,1,D,Raw
Nicole Debail,Lisieux,F,1961-01-14,F-M4,41.7,44,,,,,,50,52.5,-55,52.5,,,,,,,52.5,1,B,Raw
Corinne Larée,Evreux,F,1967-08-26,F-M3,51.6,53,,,,,,52.5,55,57.5,57.5,-58.5,,,,,,57.5,1,B,Raw
Fatiha Chettibi,Billy Montigny,F,1990-06-06,F-O,58.1,58.5,,,,,,87.5,-92.5,-92.5,87.5,,,,,,,87.5,1,B,Raw
Sophie Hebert,Deville,F,1989-08-21,F-O,61.3,63,,,,,,-70,70,-75,70,,,,,,,70,1,B,Raw
Sarah Meunier,Yerres,F,1978-11-12,F-M1,62.1,63,,,,,,62.5,67.5,-72.5,67.5,,,,,,,67.5,3,B,Raw
Stéphanie Lagrange,Beauvoir,F,1976-05-21,F-M1,62.1,63,,,,,,72.5,77.5,82.5,82.5,,,,,,,82.5,2,B,Raw
Nina Le Blevenec,Yerres,F,1972-01-31,F-M2,61.9,63,,,,,,45,50,-55,50,,,,,,,50,1,B,Raw
Véronique Bourdon,Maromme,F,1957-11-20,F-M5,63,63,,,,,,60,65,67.5,67.5,,,,,,,67.5,1,B,Raw
Marie-Christine Liege,Yerres,F,1955-07-16,F-M5,67,70,,,,,,60,65,,65,,,,,,,65,1,B,Raw
Marie-Christine Larée,Evreux,F,1968-12-25,F-M3,88.1,90,,,,,,60,65,67.5,67.5,-70,,,,,,67.5,1,B,Raw
Anthony Pauchard,Gournay,M,1998-10-06,M-JR,58.9,60,,,,,,100,105,-110,105,,,,,,,105,1,B,Raw
Jean-Michel Moreiro,Vitry,M,1953-04-13,M-M6,59.4,60,,,,,,75,77.5,-80,77.5,,,,,,,77.5,2,B,Raw
Corentin Spinali,Gournay,M,1996-04-11,M-JR,66.5,67.5,,,,,,102.5,-107.5,107.5,107.5,,,,,,,107.5,1,B,Raw
Thomas Dupre,Soissons,M,1985-12-01,M-O,65.7,67.5,,,,,,132.5,-140,-140,132.5,,,,,,,132.5,1,B,Raw
Christian Faidherbe,Billy Montigny,M,1983-08-17,M-O,66.1,67.5,,,,,,127.5,-132.5,-135,127.5,,,,,,,127.5,2,B,Raw
Sébastien Britó,,M,1986-03-23,M-O,67,67.5,,,,,,117.5,122.5,-125,122.5,,,,,,,122.5,3,B,Raw
Rémi Duchenne,Gournay,M,1992-09-19,M-O,66.9,67.5,,,,,,115,-122.5,-122.5,115,,,,,,,115,4,B,Raw
Daniel Vallée,Lisieux,M,1967-06-29,M-M3,65.1,67.5,,,,,,95,100,-102.5,100,,,,,,,100,1,B,Raw
Didier Debail,Lisieux,M,1956-08-24,M-M5,65.6,67.5,,,,,,97.5,102.5,-105,102.5,,,,,,,102.5,1,B,Raw
Dominique Loquet,Caudebec,M,1962-09-15,M-M4,67.5,67.5,,,,,,90,-95,-95,90,,,,,,,90,1,B,Raw
Léo Massi,Caudebec,M,1938-03-28,M-M9,67.4,67.5,,,,,,70,75,77.5,77.5,,,,,,,77.5,1,B,Raw
Mathieu Coudriaud,Vitry,M,1986-08-26,M-O,73.6,75,,,,,,145,150,152.5,152.5,-160.5,,,,,,152.5,2,B,Raw
Eric Ribeiro,Soissons,M,1990-05-27,M-O,72.6,75,,,,,,150,-160,-160,150,,,,,,,150,3,B,Raw
Frederic Cusumano,Caudebec,M,1970-12-06,M-M2,73.5,75,,,,,,100,110,-120,110,,,,,,,110,1,B,Raw
Frédéric Saunois,,M,1965-05-15,M-M3,73.2,75,,,,,,130,137.5,141,141,-142.5,,,,,,141,2,B,Raw
Patrick Metayer,Saint Aubin,M,1964-08-26,M-M3,75,75,,,,,,100,105,107.5,107.5,,,,,,,107.5,3,B,Raw
Victor Schipani,Sedan,M,1961-05-08,M-M4,73,75,,,,,,122.5,-127.5,-133.5,122.5,,,,,,,122.5,1,B,Raw
Eric Buron,Deville,M,1962-11-28,M-M4,73.1,75,,,,,,112.5,117.5,120,120,,,,,,,120,2,B,Raw
Thierry Behier,Bonnelles,M,1962-07-19,M-M4,71.2,75,,,,,,95,-100,100,100,,,,,,,100,4,B,Raw
Philippe Boudot,Bonnelles,M,1957-07-11,M-M5,74.5,75,,,,,,112.5,117.5,-120,117.5,,,,,,,117.5,1,B,Raw
Patrick Tellier,Bonnelles,M,1955-06-25,M-M5,74.4,75,,,,,,90,-92.5,-92.5,90,,,,,,,90,3,B,Raw
Daniel Delaporte,Maromme,M,1948-05-21,M-M7,74.2,75,,,,,,90,95,101,101,103,,,,,,101,1,B,Raw
Hugo Prunier,Oissel,M,2001-10-15,M-T2,77.3,82.5,,,,,,100,-110,110,110,112.5,,,,,,110,1,B,Raw
Alexandre Grain,Maromme,M,1997-05-06,M-JR,77.6,82.5,,,,,,107.5,112.5,-117.5,112.5,,,,,,,112.5,1,B,Raw
Jean-Marcel Maire,Ornans,M,1990-05-22,M-O,82.5,82.5,,,,,,157.5,165,-170,165,,,,,,,165,1,B,Raw
David Caillou,Caudebec,M,1979-10-10,M-O,80.8,82.5,,,,,,132.5,140,-145,140,,,,,,,140,2,B,Raw
Benjamin Cannessant,Saint Aubin,M,1988-04-24,M-O,82.3,82.5,,,,,,120,130,-142.5,130,,,,,,,130,3,B,Raw
Eddy Varin,Oissel,M,1973-08-23,M-M2,82.5,82.5,,,,,,130,135,-140,135,,,,,,,135,1,B,Raw
Gwennael Lechanoine,Lisieux,M,1967-11-04,M-M3,76.8,82.5,,,,,,125,130,-135,130,,,,,,,130,2,B,Raw
Pascal Costa,Vitry,M,1967-01-04,M-M3,81.8,82.5,,,,,,100,-107.5,-107.5,100,,,,,,,100,3,B,Raw
Mohand Kadoun,Caudebec,M,1964-03-24,M-M4,81.6,82.5,,,,,,100,110,-120,110,,,,,,,110,2,B,Raw
Michel Soranzo,Bonnelles,M,1958-03-21,M-M5,81.5,82.5,,,,,,120,-125,-125,120,,,,,,,120,2,B,Raw
Alain Schall,Caudebec,M,1950-11-05,M-M6,80.1,82.5,,,,,,90,-97.5,-97.5,90,,,,,,,90,1,B,Raw
Jessy Bouvree,Duclair,M,2000-06-18,M-T3,89.2,90,,,,,,-135,135,145,145,-150,,,,,,145,1,B,Raw
Vincent Virly,Trilport,M,1981-12-22,M-O,89.7,90,,,,,,-142.5,142.5,-145,142.5,,,,,,,142.5,1,B,Raw
Jean-Michel Flandre,Charleville,M,1974-05-31,M-M1,87.3,90,,,,,,152.5,-160,-160,152.5,,,,,,,152.5,1,B,Raw
Jérôme Prevot,Caudebec,M,1977-12-13,M-M1,88.9,90,,,,,,145,152.5,-160,152.5,,,,,,,152.5,2,B,Raw
Stéphane Simon,Yerres,M,1975-07-17,M-M1,88.5,90,,,,,,130,137.5,-142.5,137.5,,,,,,,137.5,3,B,Raw
Franck Cahours,Evreux,M,1977-12-13,M-M1,,90,,,,,,,,,,,,,,,,,DQ,B,Raw
Romaould Boudekhane,Maromme,M,1972-03-14,M-M2,89.2,90,,,,,,145,150,-152.5,150,,,,,,,150,2,B,Raw
Rudy Pereira,Charleville,M,1971-08-31,M-M2,89.5,90,,,,,,125,-132.5,-132.5,125,,,,,,,125,3,B,Raw
Steeve Wattebled,Caudebec,M,1972-01-06,M-M2,89.4,90,,,,,,142.5,152.5,-162.5,152.5,,,,,,,152.5,1,B,Raw
Patrick Valfrey,Rioz,M,1965-02-23,M-M3,89.7,90,,,,,,130,-137.5,,130,,,,,,,130,2,B,Raw
Patrick LeBlevennec,Yerres,M,1963-04-08,M-M4,89.3,90,,,,,,140,-150.5,-150.5,140,,,,,,,140,1,B,Raw
Fabrice Marchet,Beauvoir,M,1961-08-11,M-M4,89,90,,,,,,110,112.5,-115,112.5,,,,,,,112.5,3,B,Raw
Patrick Simonin,Rioz,M,1956-07-21,M-M5,87,90,,,,,,122.5,-127.5,127.5,127.5,,,,,,,127.5,1,B,Raw
Michel Rioland,Vitry,M,1948-04-21,M-M7,,90,,,,,,,,,,,,,,,,,DQ,B,Raw
Daniel Mouchard,Saint Aubin,M,1948-06-17,M-M7,85.4,90,,,,,,-112.5,112.5,-115.5,112.5,,,,,,,112.5,1,B,Raw
Alexandre Bekouche,Moulins,M,1981-03-03,M-O,98.3,100,,,,,,-160,160,170,170,,,,,,,170,1,B,Raw
Patrick Lecoche,Charleville,M,1974-08-12,M-M1,97.5,100,,,,,,130,140,-147.5,140,,,,,,,140,1,B,Raw
Philippe Belloncle,Maromme,M,1960-04-22,M-M4,97.8,100,,,,,,140,145,-147.5,145,,,,,,,145,1,B,Raw
Pascal LeBlanc,Billy Montigny,M,1963-04-14,M-M4,99.2,100,,,,,,135,140,-145,140,,,,,,,140,2,B,Raw
Jacky Bussiere,Beauvoir,M,1952-07-11,M-M6,94.9,100,,,,,,135,137.5,140.5,140.5,145.5,,,,,,140.5,2,B,Raw
Pierre Vallais,Caudebec,M,1947-05-14,M-M7,98.6,100,,,,,,125,130,133,133,,,,,,,133,1,B,Raw
Yann Leroy,,M,1982-03-17,M-O,107.4,110,,,,,,160,175,182.5,182.5,,,,,,,182.5,1,B,Raw
Kamorudeen Animashaun,Maromme,M,1971-11-07,M-M2,107.7,110,,,,,,180,190,-195,190,,,,,,,190,2,B,Raw
Kévin Butel,Oissel,M,1993-04-22,M-O,124.7,125,,,,,,170,180,185,185,,,,,,,185,1,B,Raw
Cédric Colange,Maromme,M,1982-11-16,M-O,119.4,125,,,,,,175,180,182.5,182.5,,,,,,,182.5,2,B,Raw
David Hernandez,Castelnau,M,1981-07-07,M-O,142.3,145,,,,,,-205,205,-215,205,,,,,,,205,1,B,Raw
Vincent Grandamme,Billy Montigny,M,1989-08-05,M-O,161.2,145+,,,,,,170,175,-180,175,,,,,,,175,1,B,Raw
Sebastien Brunel,Soissons,M,1968-10-18,M-M3,154.2,145+,,,,,,155,162.5,170,170,,,,,,,170,1,B,Raw
Stéphanie Lagrange,Beauvoir,F,1976-05-21,F-M1,62.1,63,,,,,,90,97.5,105.5,105.5,,,,,,,105.5,1,B,Raw
Marie-Line Demare,Beauvoir,F,1963-09-06,F-M4,62.2,63,,,,,,65,67.5,70,70,72.5,,,,,,70,1,B,Raw
Jean-Michel Moreiro,Vitry,M,1953-04-13,M-M6,59.4,60,,,,,,85,87.5,90,90,-92.5,,,,,,90,1,B,Raw
Mathieu Coudriaud,Vitry,M,1986-08-26,M-O,73.6,75,,,,,,165,175,-182.5,175,,,,,,,175,1,B,Raw
Frédéric Saunois,,M,1965-05-15,M-M3,73.2,75,,,,,,160,-167.5,-167.5,160,,,,,,,160,1,B,Raw
Nicolas Isacesco,Vitry,M,1962-12-07,M-M4,75,75,,,,,,107.5,-115,-115,107.5,,,,,,,107.5,3,B,Raw
Patrick Tellier,Bonnelles,M,1955-06-25,M-M5,74.4,75,,,,,,110,-118,-118,110,,,,,,,110,2,B,Raw
Pascal Costa,Vitry,M,1967-01-04,M-M3,81.8,82.5,,,,,,120,137.5,145,145,,,,,,,145,1,B,Raw
Pascal Gourdin,Sedan,M,1961-06-06,M-M4,78.7,82.5,,,,,,150,-155,-155,150,,,,,,,150,1,B,Raw
Michel Soranzo,Bonnelles,M,1958-03-21,M-M5,81.5,82.5,,,,,,142.5,148,150,150,-152.5,,,,,,150,1,B,Raw
Patrick Valfrey,Rioz,M,1965-02-23,M-M3,89.7,90,,,,,,150,-183,-185,150,,,,,,,150,1,B,Raw
Fabrice Marchet,Beauvoir,M,1961-08-11,M-M4,89,90,,,,,,120,125,127.5,127.5,,,,,,,127.5,2,B,Raw
Michel Rioland,Vitry,M,1948-04-21,M-M7,,90,,,,,,,,,,,,,,,,,DQ,B,Raw
Jacky Bussiere,Beauvoir,M,1952-07-11,M-M6,94.9,100,,,,,,165,170.5,172.5,172.5,175,,,,,,172.5,1,B,Raw
Ouahem Boudjadja,Rioz,M,1972-03-17,M-M2,106.6,110,,,,,,205,-215,-215,205,,,,,,,205,1,B,Raw
Clémentine Catton,Moulins,F,1990-02-23,F-O,53.5,55.5,95,100,105,105,,57.5,-60,60,60,,117.5,122.5,-127.5,122.5,,287.5,1,SBD,Raw
Rose Lozano,Tarbes,F,1961-03-09,F-M4,54.6,55.5,90,100,-102.5,100,,47.5,52.5,-55,52.5,,120,-130,130,130,,282.5,1,SBD,Raw
Sarah Meunier,Yerres,F,1978-11-12,F-M1,62,63,90,95,100,100,,65,70,-76,70,,115,122.5,-130,122.5,,292.5,1,SBD,Raw
Nina Le Blevenec,Yerres,F,1972-01-31,F-M2,61.1,63,105,-112.5,112.5,112.5,-115,50,55,-57.5,55,,150,155,-156,155,,322.5,1,SBD,Raw
Véronique Bourdon,Maromme,F,1957-11-20,F-M5,62.6,63,85,92.5,97.5,97.5,,65,-70,-70,65,,120,132.5,-141,132.5,,295,1,SBD,Raw
Clara Diman,Yerres,F,1993-03-30,F-O,,70,,,,,,,,,,,,,,,,,DQ,SBD,Raw
Camille Fonteneau,Yerres,F,1994-05-25,F-O,67.6,70,125,130,135,135,,65,70,-75,70,,125,140,-150,140,,345,1,SBD,Raw
Marie-Christine Liege,Yerres,F,1955-07-16,F-M5,66.7,70,85,92.5,97.5,97.5,,60,65,-67.5,65,,112.5,120,127.5,127.5,,290,1,SBD,Raw
Charles Maheust,Lisieux,M,2000-02-22,M-T3,57.9,60,110,120,-125,120,,70,75,-77.5,75,,150,-165,-170,150,,345,2,SBD,Raw
Yanis Boughlama,Castelnau,M,2000-03-14,M-T3,59.1,60,125,132.5,-135,132.5,,77.5,82.5,-85,82.5,,172.5,-185,185,185,,400,1,SBD,Raw
Pierre Nguyen,Yerres,M,1976-12-25,M-M1,67.5,67.5,155,165,170,170,,120,-125,-125,120,,170,180,-185,180,,470,1,SBD,Raw
Didier Gros,Rioz,M,1961-08-08,M-M4,66.9,67.5,110,117.5,122.5,122.5,,90,95,97.5,97.5,,150,160,-170,160,,380,1,SBD,Raw
Jules Chevalet,Castelnau,M,1998-08-04,M-JR,74.1,75,155,162.5,165,165,,87.5,92.5,95,95,,160,175,185,185,,445,2,SBD,Raw
Quentin Guilbert,Trilport,M,1998-11-13,M-JR,73.2,75,150,157.5,162.5,162.5,,110,117.5,-122.5,117.5,,190,197.5,202.5,202.5,,482.5,1,SBD,Raw
Paul Reiners,Yerres,M,1993-10-22,M-O,73,75,172.5,180,-185,180,,110,115,120,120,,205,215,-220,215,,515,3,SBD,Raw
Brice Domenge,Tarbes,M,1987-04-11,M-O,74.9,75,175,185,190,190,,140,145,-150,145,,225,235,-240,235,,570,1,SBD,Raw
Maxime Anjot,Lisieux,M,1987-02-26,M-O,75,75,140,150,157.5,157.5,,112.5,117.5,122.5,122.5,,190,202.5,-210,202.5,,482.5,4,SBD,Raw
Kevin Denouille,Castelnau,M,1993-08-09,M-O,75,75,182.5,195,-202.5,195,,120,127.5,-132.5,127.5,,215,225,-232.5,225,,547.5,2,SBD,Raw
Patrick Metayer,Saint Aubin,M,1964-08-26,M-M3,74.8,75,135,145,151,151,152.5,100,105,110,110,,180,190,200,200,,461,1,SBD,Raw
Jean-Claude D'Heilly,,M,1958-05-29,M-M5,74.2,75,130,135,140,140,,90,95,97.5,97.5,,190,200,205.5,205.5,210,443,1,SBD,Raw
Daniel Brunet,Duclair,M,1951-04-29,M-M6,72,75,120,125,131,131,132.5,80,85,88,88,90,140,150,160,160,,379,1,SBD,Raw
Julien Samyn,Lisieux,M,2001-06-14,M-T2,79.1,82.5,110,120,130,130,,90,100,102.5,102.5,,150,160,170,170,-175,402.5,1,SBD,Raw
Rémi Tavernier,,M,1996-05-04,M-JR,81.3,82.5,150,170,-175,170,,120,130,-135,130,,210,230,-235,230,,530,2,SBD,Raw
Tristan Rabache,Pau,M,1995-06-14,M-JR,82.1,82.5,140,150,160,160,,102.5,107.5,112.5,112.5,,165,175,185,185,,457.5,3,SBD,Raw
Dimitri Pluss,Castelnau,M,1998-02-27,M-JR,81.9,82.5,175,185,192.5,192.5,,127.5,132.5,-137.5,132.5,,220,230,-235,230,,555,1,SBD,Raw
Benjamin Cannessant,Saint Aubin,M,1988-04-24,M-O,82.5,82.5,195,202.5,207.5,207.5,,130,135,140,140,,190,202.5,210,210,,557.5,2,SBD,Raw
Nicolas Fanni,Evreux,M,1990-02-11,M-O,81,82.5,170,180,190,190,,125,130,-135,130,,210,225,237.5,237.5,,557.5,1,SBD,Raw
David Perroud,,M,1969-02-23,M-M3,81.2,82.5,145,-155,,145,,90,100,-105,100,,190,-200,,190,,435,2,SBD,Raw
Pascal Costa,Vitry,M,1967-01-04,M-M3,79,82.5,147.5,160,-170,160,,-117.5,117.5,127.5,127.5,,147.5,-160,-160,147.5,,435,1,SBD,Raw
Pascal Mauhourat,Tarbes,M,1958-09-04,M-M5,81.7,82.5,170,180,182.5,182.5,,90,-95,95,95,,230,240,242.5,242.5,,520,1,SBD,Raw
Antonio Carbone,Yerres,M,1956-02-14,M-M5,81.7,82.5,145,152.5,160,160,,85,90,,90,,185,-200,200,200,,450,3,SBD,Raw
Daniel Fortier,Evreux,M,1958-12-11,M-M5,80.6,82.5,157.5,165,170,170,,115,120,125,125,,195,210,222.5,222.5,,517.5,2,SBD,Raw
William Kadmiry,Yerres,M,1991-03-04,M-O,,90,,,,,,,,,,,,,,,,,DQ,SBD,Raw
Maxime Hellec-Marche,Montbeliard,M,1994-05-16,M-O,87.1,90,180,185,-187.5,185,,150,-155,-155,150,,200,210,-215,210,,545,1,SBD,Raw
Denis Handala,Yerres,M,1970-04-03,M-M2,85.6,90,200,210,,210,,120,125,130,130,,215,227.5,-238,227.5,,567.5,1,SBD,Raw
Rémi Cortot,Paray,M,1954-07-29,M-M5,85.6,90,150,165,172.5,172.5,,100,110,-117.5,110,,180,195,205,205,,487.5,1,SBD,Raw
Fabien Pollet,Gournay,M,1984-06-22,M-O,99.2,100,205,220,-230,220,,150,-160,-160,150,,245,265,,265,,635,1,SBD,Raw
Patrice Baumel,Paray,M,1975-10-21,M-M1,98.5,100,217.5,230,-240,230,,132.5,140,145,145,,230,247.5,-255,247.5,,622.5,1,SBD,Raw
François Kalic,Trilport,M,1965-06-12,M-M3,98.2,100,200,210,,210,,160,165,172.5,172.5,177.5,215,230,245,245,,627.5,1,SBD,Raw
Serge Bustreel,Trilport,M,1946-05-24,M-M7,98.6,100,-190,-200,,,,110,115,-120,115,,215,-220,225,225,,,DQ,SBD,Raw
Julien Villin,Castelnau,M,1989-09-08,M-O,107.2,110,205,215,220,220,,150,155,160,160,,265,285,290,290,,670,1,SBD,Raw
