Place,Tested,Equipment,WeightClassKg,Name,CyrillicName,Country,BirthDate,Division,BodyweightKg,Squat1Kg,Squat2Kg,Squat3Kg,Best3SquatKg,Bench1Kg,Bench2Kg,Bench3Kg,Bench4Kg,Best3BenchKg,Deadlift1Kg,Deadlift2Kg,Deadlift3Kg,Deadlift4Kg,Best3DeadliftKg,TotalKg,Event,Sex
1,Yes,Wraps,52,Olga Petrichenko,Ольга Петриченко,Russia,1985-12-21,Amateur Open,51.15,100,110,115,115,,,,,,,,,,,115,S,F
1,Yes,Wraps,67.5,Laura Minosyan,Лаура Миносян,Russia,1983-05-11,Amateur Open,67.5,100,-110,110,110,,,,,,,,,,,110,S,F
DQ,Yes,Wraps,67.5,Valentina Torosyan,Валентина Торосян,Russia,1997-09-27,Amateur Teen 18-19,66.4,-100,-100,-100,,,,,,,,,,,,,S,F
1,Yes,Raw,48,Galina Elchina,Галина Ельчина,Russia,1968-06-08,Amateur Masters 45-49,47.65,,,,,,,,,,92.5,102.5,-110,,102.5,102.5,D,F
1,Yes,Raw,48,Yuliya Samokhvalova,Юлия Самохвалова,Russia,1987-09-01,Amateur Open,46.7,,,,,,,,,,75,85,95,,95,95,D,F
1,Yes,Raw,48,Dinara Kamaletdinova,Динара Камалетдинова,Russia,2002-09-30,Amateur Teen 14-15,47.4,,,,,,,,,,60,70,75,,75,75,D,F
1,Yes,Raw,52,Valentina Vorozheykina,Валентина Ворожейкина,Russia,1994-08-30,Amateur Juniors 20-23,52,,,,,,,,,,120,-130,-130,,120,120,D,F
1,Yes,Raw,52,Anna Klishch,Анна Клищ,Russia,1989-05-12,Amateur Open,51.9,,,,,,,,,,-120,120,130,,130,130,D,F
2,Yes,Raw,52,Olga Petrichenko,Ольга Петриченко,Russia,1985-12-21,Amateur Open,51.15,,,,,,,,,,110,120,-127.5,,120,120,D,F
1,Yes,Raw,56,Elina Rikman,Элина Рикман,Russia,1999-07-03,Amateur Teen 16-17,55.15,,,,,,,,,,-112.5,115,120,122.5,120,120,D,F
DQ,Yes,Raw,60,Marianna Efremova-Otchenash,Марианна Ефремова-Отченаш,Russia,1977-04-09,Amateur Masters 40-44,60,,,,,,,,,,-95,-95,-95,,,,D,F
1,Yes,Raw,67.5,Ruzaliya Mingazetdinova,Рузалия Мингазетдинова,Russia,1969-02-28,Amateur Masters 45-49,66.55,,,,,,,,,,80,100,110,,110,110,D,F
1,Yes,Raw,67.5,Tatyana Beglova,Татьяна Беглова,Russia,1965-04-28,Amateur Masters 50-54,64.35,,,,,,,,,,95,105,-110,,105,105,D,F
1,Yes,Raw,67.5,Valentina Torosyan,Валентина Торосян,Russia,1997-09-27,Amateur Teen 18-19,66.4,,,,,,,,,,110,120,-125,,120,120,D,F
1,Yes,Wraps,44,Kristina Mikhaylova,Кристина Михайлова,Russia,1987-12-06,Amateur Open,43.6,-55,55,57.5,57.5,-47.5,-47.5,47.5,,47.5,75,77.5,80,,80,185,SBD,F
1,Yes,Wraps,44,Olga Kulikova,Ольга Куликова,Russia,2005-04-18,Amateur Teen 13,44,42.5,47.5,-50,47.5,30,32.5,-35,,32.5,70,75,-80,,75,155,SBD,F
1,Yes,Wraps,48,Galina Elchina,Галина Ельчина,Russia,1968-06-08,Amateur Masters 45-49,47.65,70,-75,75,75,40,-45,-45,,40,92.5,102.5,-110,,102.5,217.5,SBD,F
1,Yes,Wraps,48,Dinara Kamaletdinova,Динара Камалетдинова,Russia,2002-09-30,Amateur Teen 14-15,47.4,50,55,-60,55,-45,45,-55,,45,60,70,75,,75,175,SBD,F
1,Yes,Wraps,52,Olga Petrichenko,Ольга Петриченко,Russia,1985-12-21,Amateur Open,51.15,100,110,115,115,55,60,62.5,,62.5,110,120,-127.5,,120,297.5,SBD,F
2,Yes,Wraps,52,Ekaterina Stepanyan,Екатерина Степанян,Russia,1983-07-08,Amateur Open,51.9,87.5,-92.5,92.5,92.5,42.5,45,47.5,,47.5,100,110,115,,115,255,SBD,F
1,Yes,Wraps,56,Anna Vishnyak,Анна Вишняк,Russia,1984-12-12,Amateur Open,54.65,-112.5,-117.5,117.5,117.5,77.5,82.5,-87.5,,82.5,132.5,-142.5,-142.5,,132.5,332.5,SBD,F
2,Yes,Wraps,56,Anastasiya Dzhulay,Анастасия Джулай,Russia,1985-03-25,Amateur Open,54.5,75,80,-90,80,45,-50,-50,,45,90,100,105,,105,230,SBD,F
1,Yes,Wraps,56,Elina Rikman,Элина Рикман,Russia,1999-07-03,Amateur Teen 16-17,55.15,77.5,82.5,-87.5,82.5,60,-65,65,,65,-112.5,115,120,122.5,120,267.5,SBD,F
1,Yes,Wraps,60,Natalya Kraeva,Наталья Краева,Russia,1977-02-02,Amateur Masters 40-44,58.3,105,110,112.5,112.5,72.5,77.5,-82.5,,77.5,112.5,117.5,122.5,,122.5,312.5,SBD,F
1,Yes,Wraps,60,Nina Mukhortova,Нина Мухортова,Russia,1966-09-16,Amateur Masters 50-54,59.2,100,110,120,120,85,90,95,,95,130,140,-145,,140,355,SBD,F
1,Yes,Wraps,60,Nina Mukhortova,Нина Мухортова,Russia,1966-09-16,Amateur Open,59.2,100,110,120,120,85,90,95,,95,130,140,-145,,140,355,SBD,F
2,Yes,Wraps,60,Ruzanna Safaryan,Рузанна Сафарян,Russia,1990-10-03,Amateur Open,57.05,60,70,75,75,50,55,-57.5,,55,50,90,95,,95,225,SBD,F
1,Yes,Wraps,67.5,Valeriya Doroshenko,Валерия Дорошенко,Russia,1994-04-30,Amateur Juniors 20-23,67.25,120,130,135,135,47.5,55,-60,,55,120,130,140,,140,330,SBD,F
1,Yes,Wraps,67.5,Ruzaliya Mingazetdinova,Рузалия Мингазетдинова,Russia,1969-02-28,Amateur Masters 45-49,66.55,60,70,80,80,40,50,55,,55,80,100,110,,110,245,SBD,F
1,Yes,Wraps,75,Nikolay Lazarev,Николай Лазарев,Russia,1983-05-25,Amateur Open,72.3,100,-110,110,110,,,,,,,,,,,110,S,M
1,Yes,Wraps,82.5,Matvey Sidorov,Матвей Сидоров,Russia,2001-04-17,Amateur Teen 16-17,81.45,140,-150,-150,140,,,,,,,,,,,140,S,M
DQ,Yes,Wraps,90,Vasiliy Leonenko,Василий Леоненко,Russia,1967-04-06,Amateur Masters 50-54,87,-140,-140,-140,,,,,,,,,,,,,S,M
1,Yes,Wraps,90,Vladislav Trautveyn,Владислав Траутвейн,Russia,1985-06-03,Amateur Open,83.4,105,110,115,115,,,,,,,,,,,115,S,M
1,Yes,Wraps,110,Evgeniy Kochnev,Евгений Кочнев,Russia,1965-09-19,Amateur Masters 50-54,108.4,180,202.5,207.5,207.5,,,,,,,,,,,207.5,S,M
1,Yes,Raw,44,Lev Mitrofanov,Лев Митрофанов,Russia,2008-07-02,Amateur Teen 13,30,,,,,,,,,,60,70,75,,75,75,D,M
1,Yes,Raw,60,Ayrat Khayrullin,Айрат Хайруллин,Russia,1964-01-24,Amateur Masters 50-54,58.95,,,,,,,,,,135,145,155,,155,155,D,M
1,Yes,Raw,75,Valeriy Korepanov,Валерий Корепанов,Russia,1966-10-17,Amateur Masters 50-54,75,,,,,,,,,,180,190,205,,205,205,D,M
2,Yes,Raw,75,Yuriy Beglov,Юрий Беглов,Russia,1965-05-06,Amateur Masters 50-54,74.3,,,,,,,,,,180,190,-192.5,,190,190,D,M
3,Yes,Raw,75,Aleksandr Ilin,Александр Ильин,Russia,1966-04-30,Amateur Masters 50-54,73.5,,,,,,,,,,150,,,,150,150,D,M
1,Yes,Raw,82.5,Mikhail Gogoberishvili,Михаил Гогоберишвили,Russia,1989-02-01,Amateur Open,78.1,,,,,,,,,,200,-217.5,-217.5,,200,200,D,M
2,Yes,Raw,82.5,Evgeniy Zelenov,Евгений Зеленов,Russia,1991-03-01,Amateur Open,80.9,,,,,,,,,,170,-187.5,-187.5,,170,170,D,M
1,Yes,Raw,82.5,Matvey Sidorov,Матвей Сидоров,Russia,2001-04-17,Amateur Teen 16-17,81.45,,,,,,,,,,145,152.5,155,,155,155,D,M
1,Yes,Raw,90,Oleg Galdin,Олег Галдин,Russia,1971-09-25,Amateur Masters 45-49,87.85,,,,,,,,,,150,180,-200,,180,180,D,M
1,Yes,Raw,90,Vasiliy Leonenko,Василий Леоненко,Russia,1967-04-06,Amateur Masters 50-54,87,,,,,,,,,,195,210,215,,215,215,D,M
1,Yes,Raw,90,Yuriy Kulikov #1,Юрій Куліков,Russia,1959-08-07,Amateur Masters 55-59,89.6,,,,,,,,,,190,205,,,205,205,D,M
1,Yes,Raw,90,Florit Maksyutov,Флорит Максютов,Russia,1955-08-12,Amateur Masters 60-64,89.15,,,,,,,,,,160,170,-180,,170,170,D,M
1,Yes,Raw,90,Sergey Nosachev,Сергей Носачев,Russia,1987-10-19,Amateur Open,89.75,,,,,,,,,,210,-220,-225,,210,210,D,M
DQ,Yes,Raw,100,Vyacheslav Nikolaev,Вячеслав Николаев,Russia,1956-07-10,Amateur Masters 60-64,99.4,,,,,,,,,,-220,-220,-220,,,,D,M
1,Yes,Raw,100,Artyom Petrov,Артём Петров,Russia,1988-09-28,Amateur Open,97.75,,,,,,,,,,230,240,260,,260,260,D,M
1,Yes,Raw,100,Valeriy Bystrov,Валерий Быстров,Russia,1941-06-14,Amateur Masters 75-79,96.35,,,,,,,,,,190,195,205,,205,205,D,M
DQ,Yes,Raw,100,Dmitriy Epishko,Дмитрий Епишко,Russia,1989-08-17,Amateur Open,91.1,,,,,,,,,,-210,,,,,,D,M
1,Yes,Raw,110,Akop Mkrtchyan,Акоп Мкртчян,Russia,1987-03-23,Amateur Open,106.75,,,,,,,,,,-245,250,-270,,250,250,D,M
2,Yes,Raw,110,Egor Ulanov,Егор Уланов,Russia,1988-06-06,Amateur Open,110,,,,,,,,,,190,-210,-210,,190,190,D,M
1,Yes,Raw,125,Sergey Chernyshov,Сергей Чернышов,Russia,1971-06-12,Amateur Masters 45-49,114,,,,,,,,,,200,217.5,230,,230,230,D,M
1,Yes,Raw,125,Ivan Regulyarnyy,Иван Регулярный,Russia,1984-11-27,Amateur Open,119.2,,,,,,,,,,270,287.5,-297.5,,287.5,287.5,D,M
1,Yes,Wraps,75,Said Lordkipanidze,Саид Лордкипанидзе,Abkhazia,1995-03-28,Amateur Juniors 20-23,72,-180,200,,200,110,120,-125,,120,210,220,,,220,540,SBD,M
2,Yes,Wraps,75,Amr Akhmetov,Амр Ахметов,Russia,1996-06-25,Amateur Juniors 20-23,71.3,150,165,-180,165,110,120,130,,130,195,-205,,,195,490,SBD,M
3,Yes,Wraps,75,Vyacheslav Skrynnikov,Вячеслав Скрынников,Russia,1996-06-02,Amateur Juniors 20-23,74.45,140,-150,155,155,105,110,-115,,110,160,175,-185,,175,440,SBD,M
1,Yes,Wraps,75,Igor Chernyaev #2,Игорь Черняев,Russia,1984-04-05,Amateur Open,75,165,-170,-170,165,130,-135,-135,,130,190,200,-210,,200,495,SBD,M
1,Yes,Wraps,75,Danil Kuranov,Данил Куранов,Russia,2002-02-22,Amateur Teen 14-15,73.55,105,110,115,115,80,-85,-85,,80,-130,130,-135,,130,325,SBD,M
DQ,Yes,Wraps,75,Alper Yshyk,Альпер Ышык,Abkhazia,1999-07-28,Amateur Teen 16-17,71.7,-155,-155,-155,,-80,,,,,-140,,,,,,SBD,M
1,Yes,Wraps,82.5,Eduard Titulenko,Эдуард Титуленко,Russia,1996-07-10,Amateur Juniors 20-23,82,210,220,-225,220,165,170,-175,,170,240,-257.5,,,240,630,SBD,M
2,Yes,Wraps,82.5,Viktor Kurzenev,Виктор Курзенев,Russia,1993-07-23,Amateur Juniors 20-23,81.5,197.5,207.5,-212.5,207.5,135,142.5,147.5,,147.5,217.5,-225,,,217.5,572.5,SBD,M
1,Yes,Wraps,82.5,Aleksey Krasnov,Алексей Краснов,Russia,1959-11-15,Amateur Masters 55-59,82.4,200,215,-230,215,135,140,145,,145,210,-220,,,210,570,SBD,M
1,Yes,Wraps,82.5,Viktor Kurzenev,Виктор Курзенев,Russia,1993-07-23,Amateur Open,81.5,197.5,207.5,-212.5,207.5,135,142.5,147.5,,147.5,217.5,-225,,,217.5,572.5,SBD,M
2,Yes,Wraps,82.5,Grigoriy Ivanovskiy,Григорий Ивановский,Russia,1984-06-01,Amateur Open,78.7,150,-160,-160,150,100,110,115,,115,200,,,,200,465,SBD,M
DQ,Yes,Wraps,82.5,Mikhail Gogoberishvili,Михаил Гогоберишвили,Russia,1989-02-01,Amateur Open,78.1,-160,-167.5,-167.5,,-115,,,,,-170,,,,,,SBD,M
1,Yes,Wraps,82.5,Dmitriy Boytsevskiy,Дмитрий Бойцевский,Russia,2003-06-16,Amateur Teen 13,81.45,80,-90,95,95,60,67.5,72.5,,72.5,125,135,-145,,135,302.5,SBD,M
DQ,Yes,Wraps,90,Vasiliy Leonenko,Василий Леоненко,Russia,1967-04-06,Amateur Masters 50-54,87,-140,-140,-140,,-120,,,,,-210,,,,,,SBD,M
1,Yes,Wraps,90,Yuriy Kulikov #1,Юрій Куліков,Russia,1959-08-07,Amateur Masters 55-59,89.6,130,-140,-140,130,-115,120,125,,125,190,205,,,205,460,SBD,M
1,Yes,Wraps,90,Florit Maksyutov,Флорит Максютов,Russia,1955-08-12,Amateur Masters 60-64,89.15,130,140,150,150,115,120,-125,,120,160,170,-180,,170,440,SBD,M
1,Yes,Wraps,90,Vladislav Trautveyn,Владислав Траутвейн,Russia,1985-06-03,Amateur Open,83.4,105,110,115,115,85,90,-95,,90,150,160,165,,165,370,SBD,M
DQ,Yes,Wraps,100,Oleg Efremov-Otchenash,Олег Ефремов-Отченаш,Russia,1969-12-31,Amateur Masters 45-49,98.65,-215,,,,-140,,,,,-225,,,,,,SBD,M
1,Yes,Wraps,100,Valeriy Bystrov,Валерий Быстров,Russia,1941-06-14,Amateur Masters 75-79,96.35,160,-180,-180,160,100,105,-107.5,,105,190,195,205,,205,470,SBD,M
1,Yes,Wraps,100,Aleksandr Zubakin,Александр Зубакин,Russia,1985-01-13,Amateur Open,99.95,190,210,215,215,170,180,185,,185,220,235,245,,245,645,SBD,M
2,Yes,Wraps,100,Aleksandr Boytsevskiy,Александр Бойцевский,Russia,1987-05-30,Amateur Open,96.7,180,190,200,200,160,165,-170,,165,230,240,250,,250,615,SBD,M
3,Yes,Wraps,100,Artyom Petrov,Артём Петров,Russia,1988-09-28,Amateur Open,97.75,190,200,-212.5,200,140,-150,155,,155,230,240,260,,260,615,SBD,M
4,Yes,Wraps,100,Aleksey Lazukin,Алексей Лазукин,Russia,1990-05-03,Amateur Open,97.8,190,200,-205,200,145,150,155,,155,200,-210,217.5,,217.5,572.5,SBD,M
1,Yes,Wraps,110,Evgeniy Byzov,Евгений Бызов,Russia,1970-10-06,Amateur Masters 45-49,106.7,100,130,150,150,100,115,125,,125,130,150,160,,160,435,SBD,M
1,Yes,Wraps,110,Akop Mkrtchyan,Акоп Мкртчян,Russia,1987-03-23,Amateur Open,106.75,220,230,240,240,145,-150,150,,150,-245,250,-270,,250,640,SBD,M
2,Yes,Wraps,110,Rodion Shishkin,Родион Шишкин,Russia,1985-10-03,Amateur Open,107.9,150,160,165,165,100,-112.5,-112.5,,100,-180,-192.5,192.5,,192.5,457.5,SBD,M
1,Yes,Wraps,125,Yuriy Abregov,Юрий Абрегов,Russia,1964-10-21,Amateur Masters 50-54,116.6,-170,170,-190,170,130,140,145,,145,190,200,210,,210,525,SBD,M
1,Yes,Wraps,125,Aleksandr Ponomarenko,Александр Пономаренко,Russia,1983-11-05,Amateur Open,120.85,235,250,260,260,145,155,-160,,155,235,250,-260,,250,665,SBD,M
1,No,Wraps,75,Mariya Klintsova,Мария Клинцова,Russia,1987-01-31,Pro Open,74.5,120,-125,125,125,,,,,,,,,,,125,S,F
1,No,Raw,48,Alina Balandina,Алина Баландина,Russia,1998-09-11,Pro Open,47.8,,,,,,,,,,65,70,-75,,70,70,D,F
1,No,Raw,56,Anastasiya Kondrateva,Анастасия Кондратьева,Russia,1995-12-18,Pro Juniors 20-23,54.45,,,,,,,,,,125,-130,130,,130,130,D,F
1,No,Raw,60,Elvira Fettaeva,Эльвира Феттаева,Russia,1995-08-29,Pro Juniors 20-23,59.2,,,,,,,,,,130,-137.5,-137.5,,130,130,D,F
1,No,Raw,67.5,Elena Pecherskaya,Елена Печерская,Russia,1991-02-08,Pro Open,65.65,,,,,,,,,,130,145,150,,150,150,D,F
1,No,Raw,75,Elena Konyushenko,Елена Конюшенко,Russia,1985-03-11,Pro Open,69.85,,,,,,,,,,150,-155,-155,,150,150,D,F
2,No,Raw,75,Mariya Klintsova,Мария Клинцова,Russia,1987-01-31,Pro Open,74.5,,,,,,,,,,140,-150,,,140,140,D,F
1,No,Raw,82.5,Yuliya Medvedeva #1,Юлия Медведева,Russia,1979-07-08,Pro Open,81.6,,,,,,,,,,230,240,-245,,240,240,D,F
1,No,Wraps,48,Alina Balandina,Алина Баландина,Russia,1998-09-11,Pro Open,47.8,55,60,-65,60,-25,25,27.5,,27.5,65,70,-75,,70,157.5,SBD,F
1,No,Wraps,52,Angelina Tsys,Ангелина Цыс,Russia,1997-11-16,Pro Open,49.3,-45,50,-55,50,20,25,-27.5,,25,55,60,-65,,60,135,SBD,F
1,No,Wraps,56,Anastasiya Brylyova,Анастасия Брылёва,Russia,1984-08-16,Pro Open,54.5,70,77.5,80,80,47.5,50,-52.5,,50,95,105,112.5,,112.5,242.5,SBD,F
1,No,Wraps,60,Zarifa Guseynova,Зарифа Гусейнова,Azerbaijan,1995-03-30,Pro Juniors 20-23,60,120,130,140,140,50,60,65,,65,160,172.5,-182.5,,172.5,377.5,SBD,F
1,No,Wraps,67.5,Yuliya Drobysheva,Юлия Дробышева,Russia,1996-12-01,Pro Juniors 20-23,66.2,-50,55,60,60,30,-32.5,35,,35,60,-65,67.5,,67.5,162.5,SBD,F
1,No,Wraps,67.5,Natalya De Simon,Наталья Де Симон,Russia,1990-03-01,Pro Open,67,115,125,-135,125,70,77.5,-82.5,,77.5,-125,125,135,,135,337.5,SBD,F
1,No,Wraps,75,Anastasiya Ostapenko,Анастасия Остапенко,Russia,1998-04-19,Pro Open,75,135,145,-150,145,-75,75,80,,80,130,147.5,155,,155,380,SBD,F
2,No,Wraps,75,Elena Konyushenko,Елена Конюшенко,Russia,1985-03-11,Pro Open,69.85,90,100,110,110,-77.5,80,82.5,,82.5,150,-155,-155,,150,342.5,SBD,F
3,No,Wraps,75,Mariya Klintsova,Мария Клинцова,Russia,1987-01-31,Pro Open,74.5,120,-125,125,125,60,-67.5,-67.5,,60,140,-150,,,140,325,SBD,F
1,No,Wraps,90+,Oksana Melekhonova,Оксана Мелехонова,Russia,1978-06-04,Pro Open,94.2,90,100,-110,100,60,65,67.5,,67.5,120,130,140,,140,307.5,SBD,F
1,No,Wraps,110,Roman Makarov,Роман Макаров,Russia,1980-03-08,Pro Open,108.35,-220,-220,220,220,,,,,,,,,,,220,S,M
1,No,Raw,67.5,Oleg Kashchenko,Олег Кащенко,Russia,1996-10-30,Pro Juniors 20-23,65.8,,,,,,,,,,180,192.5,-200,,192.5,192.5,D,M
1,No,Raw,90,Aleksandr Malina,Александр Малина,Russia,1971-06-04,Pro Masters 45-49,85.5,,,,,,,,,,160,170,185,,185,185,D,M
1,No,Raw,90,Vladimir Goryunov,Владимир Горюнов,Russia,1953-02-02,Pro Masters 60-64,85.8,,,,,,,,,,-200,200,220,,220,220,D,M
1,No,Raw,100,Andrey Maksimenko,Андрей Максименко,Russia,1972-10-03,Pro Masters 40-44,94.2,,,,,,,,,,180,190,,,190,190,D,M
1,No,Raw,100,Namig Mekhtiev,Намиг Мехтиев,Azerbaijan,1985-10-23,Pro Open,93.7,,,,,,,,,,230,260,270,,270,270,D,M
1,No,Raw,110,Oleg Sokolov,Олег Соколов,Russia,1972-08-14,Pro Masters 40-44,103.8,,,,,,,,,,200,-220,-220,,200,200,D,M
1,No,Raw,110,Artyom Taranov,Артём Таранов,Russia,1998-11-25,Pro Teen 18-19,100.5,,,,,,,,,,140,160,175,,175,175,D,M
1,No,Raw,125,Aleksandr Vovenko,Александр Вовенко,Russia,1980-11-25,Pro Open,123,,,,,,,,,,300,310,320,,320,320,D,M
1,No,Wraps,67.5,Pavel Shulga,Павел Шульга,Russia,1996-10-04,Pro Juniors 20-23,66.1,130,140,-150,140,100,105,110,,110,150,160,170,,170,420,SBD,M
1,No,Wraps,67.5,Andrey Dyu,Андрей Дю,Russia,1991-08-20,Pro Open,66.3,160,170,180,180,100,105,-110,,105,-200,200,215,,215,500,SBD,M
1,No,Wraps,75,Aydyn Guseynov,Айдын Гусейнов,Azerbaijan,1993-10-12,Pro Juniors 20-23,74.75,170,-180,-180,170,125,-132.5,-132.5,,125,200,-215,-215,,200,495,SBD,M
1,No,Wraps,75,Rovshan Khalilov,Ровшан Халилов,Azerbaijan,1990-11-08,Pro Open,75,170,185,200,200,145,160,-170,,160,220,245,262.5,,262.5,622.5,SBD,M
DQ,No,Wraps,75,Stepan Kozlov,Степан Козлов,Russia,1992-08-17,Pro Open,75,-160,-160,-160,,-100,,,,,-180,,,,,,SBD,M
1,No,Wraps,82.5,Sergey Mikhaylyov,Сергей Михайлёв,Russia,1996-06-28,Pro Juniors 20-23,78,180,-185,185,185,110,115,122.5,,122.5,-210,215,220,,220,527.5,SBD,M
1,No,Wraps,82.5,Kaplan Tlevtsezhev,Каплан Тлевцежев,Russia,1956-02-13,Pro Masters 60-64,81.3,180,190,,190,90,-100,-100,,90,200,210,,,210,490,SBD,M
1,No,Wraps,90,Sergey Khodunov,Сергей Ходунов,Russia,1968-10-23,Pro Masters 45-49,83.5,120,135,150,150,160,170,175,,175,165,180,,,180,505,SBD,M
1,No,Wraps,90,Rezo Gochava,Резо Гочава,Russia,1997-12-17,Pro Teen 18-19,89,225,-235,-235,225,160,-165,165,,165,240,255,270,,270,660,SBD,M
1,No,Wraps,100,Oleg Efremov-Otchenash,Олег Ефремов-Отченаш,Russia,1969-12-31,Pro Masters 45-49,98.65,215,230,-240,230,140,147.5,150,,150,210,-230,-230,,210,590,SBD,M
1,No,Wraps,100,Nikolay Ivnenko,Николай Ивненко,Russia,1989-06-21,Pro Open,96.1,245,255,260,260,-170,-175,175,,175,280,290,-295,,290,725,SBD,M
2,No,Wraps,100,Andrey Kirindyasov,Андрей Кириндясов,Russia,1988-03-20,Pro Open,99.5,240,255,265,265,180,190,-200,,190,240,250,-262.5,,250,705,SBD,M
1,No,Wraps,100,Kirill Kolesnikov,Кирилл Колесников,Russia,1998-01-19,Pro Teen 18-19,90.7,160,175,190,190,120,-135,,,120,180,200,-220,,200,510,SBD,M
1,No,Wraps,110,Roman Makarov,Роман Макаров,Russia,1980-03-08,Pro Open,108.35,-220,-220,220,220,155,170,-175,,170,230,-240,,,230,620,SBD,M
DQ,No,Wraps,110,Artyom Taranov,Артём Таранов,Russia,1998-11-25,Pro Teen 18-19,100.5,-130,-130,-130,,-95,,,,,-170,,,,,,SBD,M
1,No,Wraps,125,Vüsal Mardanov,Вусал Марданов,Azerbaijan,1985-02-18,Pro Open,117.4,230,270,,270,180,-200,200,,200,330,-360,-360,,330,800,SBD,M
1,No,Wraps,125,Artyom Fatykhov,Артём Фатыхов,Russia,2001-04-07,Pro Teen 16-17,120.9,100,110,125,125,75,80,-85,,80,130,,,,130,335,SBD,M
1,No,Wraps,125,Roman Spirkin,Роман Спиркин,Russia,1997-07-01,Pro Teen 18-19,113.6,140,150,160,160,85,90,-95,,90,170,180,190,,190,440,SBD,M
1,No,Wraps,140,Maksim Pogas,Максим Погас,Russia,1985-03-10,Pro Open,128.35,-280,-280,280,280,-225,225,-235,,225,310,-322.5,-322.5,,310,815,SBD,M
1,Yes,Wraps,90,Furkat Shafiev,Фуркат Шафиев,Kazakhstan,1973-08-24,Amateur Masters 40-44,83.9,70,90,110,110,,,,,,,,,,,110,S,M
1,Yes,Raw,82.5,Nikolay Efanov,Николай Ефанов,Russia,1958-07-10,Amateur Masters 55-59,82.25,,,,,,,,,,200,-210,-210,,200,200,D,M
DQ,Yes,Raw,100,Pavel Sudakov,Павел Судаков,Russia,1987-01-01,Amateur Open,96,,,,,,,,,,230,250,257.5,,257.5,,D,M
1,Yes,Unlimited,44,Alyona Piven,Алёна Пивень,Russia,1994-01-16,Amateur Open,44,-75,80,-95,80,35,,,,35,90,100,-110,,100,215,SBD,F
DQ,Yes,Unlimited,82.5,Nikolay Efanov,Николай Ефанов,Russia,1958-07-10,Amateur Masters 55-59,82.25,-180,180,-200,180,-170,-180,-180,,,-200,,,,,,SBD,M
1,Yes,Unlimited,140+,Artyom Nechushkin,Артём Нечушкин,Russia,1999-07-09,Amateur Teen 16-17,154.6,280,300,310,310,-250,260,270,,270,210,225,,,225,805,SBD,M
1,Yes,Single-ply,52,Margarita Galaktionova,Маргарита Галактионова,Russia,1991-03-01,Amateur Open,52,,,,,,,,,,150,-165,-165,,150,150,D,F
1,Yes,Single-ply,82.5,Dmitriy Nosenko,Дмитрий Носенко,Russia,1976-10-12,Amateur Masters 40-44,80.4,,,,,,,,,,205,217.5,225,,225,225,D,M
1,Yes,Single-ply,90,Artem Bykhovets,Артем Быховец,Russia,1983-07-19,Amateur Open,85.5,,,,,,,,,,240,260,-280,,260,260,D,M
1,Yes,Single-ply,56,Lyana Zatonskaya,Ляна Затонская,Russia,1995-11-06,Amateur Juniors 20-23,55.75,110,115,120,120,-60,60,-65,,60,120,130,-132.5,,130,310,SBD,F
1,Yes,Multi-ply,75,Amr Akhmetov,Амр Ахметов,Russia,1996-06-25,Amateur Juniors 20-23,72.9,,,,,,,,,,205,215,225,,225,225,D,M
1,Yes,Multi-ply,67.5,Alyona Baturina,Алёна Батурина,Russia,1994-10-03,Amateur Juniors 20-23,67.2,200,215,-230,215,130,135,140,,140,180,-190,-191,,180,535,SBD,F
1,Yes,Multi-ply,75,Amr Akhmetov,Амр Ахметов,Russia,1996-06-25,Amateur Juniors 20-23,72.9,-230,230,255,255,140,160,-175,,160,205,215,225,,225,640,SBD,M
1,No,Raw,67.5,Ivan Smorodin,Иван Смородин,Russia,1994-09-25,Pro Juniors 20-23,66.3,,,,,,,,,,190,-200,-200,,190,190,D,M
1,No,Raw,110,Nikolay Kolyuchkin,Николай Колючкин,Russia,1967-05-20,Pro Masters 50-54,101.4,,,,,,,,,,235,252.5,-260,,252.5,252.5,D,M
1,No,Raw,110,Nikolay Kolyuchkin,Николай Колючкин,Russia,1967-05-20,Pro Open,101.4,,,,,,,,,,235,252.5,-260,,252.5,252.5,D,M
1,No,Unlimited,75,Marina Morozova,Марина Морозова,Russia,1978-10-09,Pro Open,74.5,190,205,-215,205,130,-140,140,,140,-180,180,190,,190,535,SBD,F
DQ,No,Unlimited,67.5,Ivan Smorodin,Иван Смородин,Russia,1994-09-25,Pro Juniors 20-23,66.3,-160,-160,-160,,,,,,,,,,,,,SBD,M
1,No,Unlimited,90,Andrey Perminov,Андрей Перминов,Russia,1967-11-06,Pro Masters 45-49,88.2,190,200,210,210,125,135,142.5,,142.5,-200,200,215,,215,567.5,SBD,M
1,No,Unlimited,140,Dmitriy Kalinin,Дмитрий Калинин,Russia,1989-01-05,Pro Open,132,270,285,295,295,250,265,-275,,265,255,,,,255,815,SBD,M
1,No,Single-ply,67.5,Vladimir Afonin,Владимир Афонин,Russia,1945-06-09,Pro Masters 70-74,67.5,150,155,160,160,,,,,,,,,,,160,S,M
1,No,Single-ply,67.5,Vladimir Afonin,Владимир Афонин,Russia,1945-06-09,Pro Masters 70-74,67.5,,,,,,,,,,180,190,-195,,190,190,D,M
1,No,Single-ply,90,Roman Stepanov,Роман Степанов,Russia,1993-08-14,Pro Open,90,,,,,,,,,,270,-290,-300,,270,270,D,M
1,No,Single-ply,125,Anatoliy Talovasov,Анатолий Таловасов,Russia,1960-12-01,Pro Masters 55-59,117.75,,,,,,,,,,200,210,-220,,210,210,D,M
1,No,Single-ply,67.5,Vladimir Afonin,Владимир Афонин,Russia,1945-06-09,Pro Masters 70-74,67.5,150,155,160,160,100,-107.5,-107.5,,100,180,190,-195,,190,450,SBD,M
1,No,Single-ply,67.5,Vigen Marutyan,Виген Марутян,Russia,1995-05-03,Pro Juniors 20-23,67.45,160,180,-210,180,105,120,130,,130,-190,190,210,,210,520,SBD,M
1,No,Single-ply,100,Nikolay Korshunov,Николай Коршунов,Russia,1995-03-07,Pro Juniors 20-23,97.8,285,310,,310,185,200,-210,,200,255,270,,,270,780,SBD,M
1,No,Single-ply,100,Evgeniy Blinkov,Евгений Блинков,Russia,1987-09-03,Pro Open,99.35,337.5,355,370,370,-230,230,-240,,230,-315,325,-337.5,,325,925,SBD,M
1,No,Multi-ply,82.5,Andrey Mitrofanov,Андрей Митрофанов,Russia,1978-08-08,Pro Open,80.5,-350,-350,350,350,,,,,,,,,,,350,S,M
1,No,Multi-ply,100,Pavel Mitrofanov,Павел Митрофанов,Russia,1983-08-12,Pro Open,99.8,340,372.5,-405,372.5,,,,,,,,,,,372.5,S,M
1,No,Multi-ply,82.5,Andrey Mitrofanov,Андрей Митрофанов,Russia,1978-08-08,Pro Open,80.5,,,,,,,,,,-280,-280,280,,280,280,D,M
1,No,Multi-ply,90,Artyom Krylov,Артём Крылов,Russia,1990-09-03,Pro Open,88.6,,,,,,,,,,305,-325,-325,,305,305,D,M
DQ,No,Multi-ply,82.5,Vladimir Zhabin,Владимир Жабин,Russia,1980-06-27,Pro Open,81.7,,,,,,,,,,-335,-335,-335,,,,D,M
1,No,Multi-ply,82.5,Andrey Mitrofanov,Андрей Митрофанов,Russia,1978-08-08,Pro Open,80.5,-350,-350,350,350,185,200,,,200,-280,-280,280,,280,830,SBD,M
1,No,Multi-ply,100,Pavel Mitrofanov,Павел Митрофанов,Russia,1983-08-12,Pro Open,99.8,340,372.5,-405,372.5,-260,260,-275,,260,280,-302.5,,,280,912.5,SBD,M
1,Yes,Unlimited,52,Oksana Levenets,Оксана Левенец,Russia,1975-10-16,Amateur Masters 40-44,50.2,,,,,50,-62.5,-62.5,,50,,,,,,50,B,F
1,Yes,Unlimited,82.5,Vasilina Mitenkova,Василина Митенкова,Russia,1983-08-19,Amateur Open,78.8,,,,,90,107.5,-115,,107.5,,,,,,107.5,B,F
1,Yes,Unlimited,82.5,Aleksandr Tkachenko,Александр Ткаченко,Russia,1989-08-22,Amateur Open,81.35,,,,,152.5,-165,175,,175,,,,,,175,B,M
1,Yes,Unlimited,90,Aleksandr Safonov,Александр Сафонов,Russia,1976-02-17,Amateur Masters 40-44,87.8,,,,,210,220,235,,235,,,,,,235,B,M
1,Yes,Unlimited,90,Artem Bykhovets,Артем Быховец,Russia,1983-07-19,Amateur Open,85.5,,,,,235,-247.5,247.5,-260.5,247.5,,,,,,247.5,B,M
2,Yes,Unlimited,90,Aleksandr Safonov,Александр Сафонов,Russia,1976-02-17,Amateur Open,87.8,,,,,210,220,235,,235,,,,,,235,B,M
3,Yes,Unlimited,90,Andrey Shadyra,Андрей Шадыра,Russia,1981-10-01,Amateur Open,85.2,,,,,165,172.5,180,,180,,,,,,180,B,M
1,Yes,Unlimited,100,Vyacheslav Nikolaev,Вячеслав Николаев,Russia,1956-07-10,Amateur Masters 60-64,97.4,,,,,205,-215,-217.5,,205,,,,,,205,B,M
1,Yes,Unlimited,100,Mikhail Likhach,Михаил Лихач,Russia,1989-04-20,Amateur Open,98.1,,,,,265,275,290,-300,290,,,,,,290,B,M
2,Yes,Unlimited,100,Aleksandr Boytsevskiy,Александр Бойцевский,Russia,1987-05-30,Amateur Open,96.9,,,,,200,220,232.5,,232.5,,,,,,232.5,B,M
3,Yes,Unlimited,100,Ilya Kunygin,Илья Куныгин,Russia,1989-12-02,Amateur Open,93.9,,,,,200,215,222.5,,222.5,,,,,,222.5,B,M
4,Yes,Unlimited,100,Vasiliy Zhilyakov,Василий Жиляков,Russia,1985-02-16,Amateur Open,97.5,,,,,180,-202.5,202.5,,202.5,,,,,,202.5,B,M
1,Yes,Unlimited,110,Vladimir Shchukin,Владимир Щукин,Russia,1980-03-15,Amateur Open,101,,,,,180,205,217.5,,217.5,,,,,,217.5,B,M
1,Yes,Unlimited,140,Aleksandr Oreshkin,Александр Орешкин,Russia,1982-08-21,Amateur Open,129.15,,,,,-270,270,282.5,,282.5,,,,,,282.5,B,M
1,No,Unlimited,56,Kristina Isymbaeva,Кристина Исымбаева,Russia,1992-09-26,Pro Open,56,,,,,40,47.5,-52.5,,47.5,,,,,,47.5,B,F
1,No,Unlimited,67.5,Ekaterina Kuzmicheva,Екатерина Кузьмичева,Russia,1996-01-23,Pro Juniors 20-23,67,,,,,142.5,-152.5,-152.5,,142.5,,,,,,142.5,B,F
1,No,Unlimited,60,Ivan Kozlov,Иван Козлов,Russia,2002-01-15,Pro Teen 14-15,58.5,,,,,45,55,-65,,55,,,,,,55,B,M
1,No,Unlimited,67.5,Denis Nikonov #1,Денис Ніконов,Russia,1992-09-21,Pro Open,64.15,,,,,130,140,-145,,140,,,,,,140,B,M
1,No,Unlimited,82.5,Aleksey Usmanov,Алексей Усманов,Russia,1973-02-27,Pro Masters 40-44,82,,,,,190,200,210,,210,,,,,,210,B,M
1,No,Unlimited,82.5,Aleksey Usmanov,Алексей Усманов,Russia,1973-02-27,Pro Open,82,,,,,190,200,210,,210,,,,,,210,B,M
1,No,Unlimited,90,Roman Stepanov,Роман Степанов,Russia,1993-08-14,Pro Juniors 20-23,90,,,,,240,255,-265,,255,,,,,,255,B,M
1,No,Unlimited,90,Andrey Yakushin,Андрей Якушин,Russia,1973-12-19,Pro Masters 40-44,88.35,,,,,280,302.5,310,,310,,,,,,310,B,M
1,No,Unlimited,90,Andrey Yakushin,Андрей Якушин,Russia,1973-12-19,Pro Open,88.35,,,,,280,302.5,310,,310,,,,,,310,B,M
DQ,No,Unlimited,90,Sergey Koshkin,Сергей Кошкин,Russia,1971-09-28,Pro Open,84.35,,,,,-280,-280,,,,,,,,,,B,M
1,No,Unlimited,100,Vyacheslav Gorbunov #1,В'ячеслав Горбунов,Russia,1967-12-20,Pro Masters 45-49,96.8,,,,,220,232.5,242.5,,242.5,,,,,,242.5,B,M
1,No,Unlimited,100,Aleksey Melnikov,Алексей Мельников,Russia,1987-10-22,Pro Open,97,,,,,322.5,-330,330,,330,,,,,,330,B,M
1,No,Unlimited,110,Oleg Sokolov,Олег Соколов,Russia,1972-08-14,Pro Masters 40-44,103.8,,,,,-240,240,-252.5,,240,,,,,,240,B,M
1,No,Unlimited,110,Aleksey Kozlov #1,Алексей Козлов,Russia,1970-05-19,Pro Masters 45-49,104.4,,,,,200,215,250,,250,,,,,,250,B,M
1,No,Unlimited,110,Ivan Vasyunin,Иван Васюнин,Russia,1983-08-01,Pro Open,102.3,,,,,320,-342.5,-342.5,,320,,,,,,320,B,M
2,No,Unlimited,110,Evgeniy Karyakin,Евгений Карякин,Russia,1979-01-17,Pro Open,106,,,,,230,240,252.5,,252.5,,,,,,252.5,B,M
DQ,No,Unlimited,110,Aleksandr Zhukov,Александр Жуков,Russia,1983-03-13,Pro Open,100.1,,,,,-280,-280,-280,,,,,,,,,B,M
1,No,Unlimited,125,Mikhail Mikao,Михаил Микао,Russia,1985-07-29,Pro Open,124.4,,,,,240,265,280,,280,,,,,,280,B,M
1,No,Unlimited,140,Evgeniy Chugunov,Евгений Чугунов,Russia,1983-04-24,Pro Open,126.4,,,,,290,305,312.5,,312.5,,,,,,312.5,B,M
1,Yes,Single-ply,82.5,Andrey Balantaev,Андрей Балантаев,Russia,1974-09-20,Amateur Masters 40-44,80.3,,,,,-155,160,-165,,160,,,,,,160,B,M
1,Yes,Single-ply,82.5,Rishat Fattakhov,Ришат Фаттахов,Russia,1967-05-08,Amateur Masters 50-54,82.45,,,,,-180,180,191,,191,,,,,,191,B,M
DQ,Yes,Single-ply,100,Evgeniy Chernozipunnikov,Евгений Чернозипунников,Russia,1956-01-21,Amateur Masters 60-64,96.2,,,,,-165,-165,-165,,,,,,,,,B,M
1,Yes,Multi-ply,56,Nadezhda Timofeeva,Надежда Тимофеева,Russia,1993-01-30,Amateur Open,55.1,,,,,-80,80,90,,90,,,,,,90,B,F
1,Yes,Multi-ply,90,Namig Dzhafarov,Намиг Джафаров,Azerbaijan,1976-08-27,Amateur Masters 40-44,87.3,,,,,190,200,-210,,200,,,,,,200,B,M
1,No,Single-ply,56,Roman Belousov,Роман Белоусов,Russia,1991-10-19,Pro Open,55.05,,,,,185,-190,190,,190,,,,,,190,B,M
1,No,Single-ply,90,Dilyus Gumarov,Дилюс Гумаров,Russia,1960-10-16,Pro Masters 55-59,88.95,,,,,110,-115,-120,,110,,,,,,110,B,M
1,No,Single-ply,90,Stepan Pogosyan,Степан Погосян,Russia,1985-04-18,Pro Open,87.2,,,,,220,230,235,,235,,,,,,235,B,M
1,No,Single-ply,100,Sergey Vinnichenko,Сергей Винниченко,Russia,1974-12-04,Pro Open,90.9,,,,,230,-240,240,,240,,,,,,240,B,M
1,No,Single-ply,125,Anatoliy Talovasov,Анатолий Таловасов,Russia,1960-12-01,Pro Masters 55-59,117.75,,,,,130,140,150,,150,,,,,,150,B,M
1,No,Multi-ply,82.5,Agshin Ismailov,Агшин Исмаилов,Azerbaijan,1978-03-30,Pro Open,82.5,,,,,230,-245,245,,245,,,,,,245,B,M
DQ,No,Multi-ply,90,Nidzhat Guseynov,Ниджат Гусейнов,Azerbaijan,1988-09-08,Pro Open,90,,,,,-220,-220,-220,,,,,,,,,B,M
1,No,Multi-ply,100,Artem Kamyshov,Артем Камышов,Russia,1986-09-27,Pro Open,94.45,,,,,160,175,-200,,175,,,,,,175,B,M
1,No,Multi-ply,100,Vagif Mamedov,Вагиф Мамедов,Azerbaijan,1972-10-27,Pro Masters 40-44,96.45,,,,,210,230,240,,240,,,,,,240,B,M
2,No,Multi-ply,100,Aleksey Kunichkin,Алексей Куничкин,Russia,1973-04-25,Pro Masters 40-44,98.45,,,,,-220,220,-232.5,,220,,,,,,220,B,M
1,No,Multi-ply,100,Eldar Mammadov,Эльдар Маммадов,Azerbaijan,1978-08-14,Pro Open,100,,,,,240,-260,260,,260,,,,,,260,B,M
1,No,Multi-ply,125,Ivan Polyakov,Иван Поляков,Russia,1974-12-25,Pro Masters 40-44,115.5,,,,,190,-205,205,,205,,,,,,205,B,M
1,No,Multi-ply,140,Nikolay Pyshmintsev,Николай Пышминцев,Russia,1981-01-04,Pro Open,127,,,,,310,340,-370,,340,,,,,,340,B,M
DQ,Yes,Raw,44,Kristina Mikhaylova,Кристина Михайлова,Russia,1987-12-06,Amateur Open,43.5,,,,,-47.5,-47.5,-47.5,,,,,,,,,B,F
1,Yes,Raw,44,Elizaveta Voronova,Елизавета Воронова,Russia,2005-06-09,Amateur Teen 13,43.05,,,,,60,65,66,67.5,66,,,,,,66,B,F
2,Yes,Raw,44,Regina Amurskaya,Регина Амурская,Russia,2003-01-25,Amateur Teen 14-15,42.95,,,,,45,50,55,,55,,,,,,55,B,F
1,Yes,Raw,52,Larisa Dovzhenko,Лариса Довженко,Russia,1976-01-20,Amateur Masters 40-44,50.5,,,,,40,45,47.5,,47.5,,,,,,47.5,B,F
1,Yes,Raw,52,Anna Klishch,Анна Клищ,Russia,1989-05-12,Amateur Open,50.7,,,,,62.5,-70,-70,,62.5,,,,,,62.5,B,F
1,Yes,Raw,52,Anna Bibanaeva,Анна Бибанаева,Russia,2002-04-25,Amateur Teen 14-15,51.25,,,,,47.5,-50,50,,50,,,,,,50,B,F
1,Yes,Raw,56,Elena Vorozhishcheva,Елена Ворожищева,Russia,1976-06-18,Amateur Masters 40-44,54.45,,,,,60,62.5,65,,65,,,,,,65,B,F
1,Yes,Raw,60,Nina Mukhortova,Нина Мухортова,Russia,1966-09-16,Amateur Open,59.3,,,,,90,95,100,,100,,,,,,100,B,F
1,Yes,Raw,75,Svetlana Nekrasova,Светлана Некрасова,Russia,1963-03-02,Amateur Masters 50-54,74.3,,,,,50,55,-57.5,,55,,,,,,55,B,F
1,Yes,Raw,44,Lev Mitrofanov,Лев Митрофанов,Russia,2008-07-02,Amateur Teen 13,30,,,,,20,25,-30,,25,,,,,,25,B,M
2,Yes,Raw,44,Pyotr Storozhenko,Пётр Стороженко,Abkhazia,2008-04-30,Amateur Teen 13,31.15,,,,,25,-27.5,-27.5,,25,,,,,,25,B,M
1,Yes,Raw,60,Ayrat Khayrullin,Айрат Хайруллин,Russia,1964-01-24,Amateur Masters 50-54,59,,,,,87.5,-92.5,-92.5,,87.5,,,,,,87.5,B,M
1,Yes,Raw,67.5,Igor Nikulin,Игорь Никулин,Russia,1975-05-12,Amateur Masters 40-44,66.15,,,,,105,115,120,,120,,,,,,120,B,M
1,Yes,Raw,67.5,Yuriy Brodskiy,Юрий Бродский,Israel,1938-02-08,Amateur Masters 75-79,65.45,,,,,82.5,-90,-90,,82.5,,,,,,82.5,B,M
1,Yes,Raw,67.5,Igor Nikulin,Игорь Никулин,Russia,1975-05-12,Amateur Open,66.15,,,,,105,115,120,,120,,,,,,120,B,M
2,Yes,Raw,67.5,Maksim Tyutikov,Максим Тютиков,Russia,1981-03-09,Amateur Open,66.9,,,,,62.5,65,-67.5,,65,,,,,,65,B,M
1,Yes,Raw,75,Sergey Zavarukhin,Сергей Заварухин,Russia,1973-11-03,Amateur Masters 40-44,75,,,,,110,120,125,,125,,,,,,125,B,M
1,Yes,Raw,75,Dmitriy Nekrasov,Дмитрий Некрасов,Russia,1963-06-06,Amateur Masters 50-54,74.25,,,,,120,125,-130,,125,,,,,,125,B,M
1,Yes,Raw,75,Leonid Dvorkin,Леонид Дворкин,Russia,1941-01-23,Amateur Masters 75-79,73.2,,,,,97.5,102.5,-106,,102.5,,,,,,102.5,B,M
1,Yes,Raw,75,Vladimir Martirosyan,Владимир Мартиросян,Russia,1987-05-14,Amateur Open,74.9,,,,,120,-137.5,137.5,,137.5,,,,,,137.5,B,M
2,Yes,Raw,75,Boris Kitov,Борис Китов,Russia,1989-10-26,Amateur Open,75,,,,,125,-130,-130,,125,,,,,,125,B,M
3,Yes,Raw,75,Stanislav Yazev,Станислав Язев,Russia,1989-07-14,Amateur Open,73.8,,,,,85,97.5,102.5,,102.5,,,,,,102.5,B,M
4,Yes,Raw,75,Sergey Avakov,Сергей Аваков,Russia,1985-06-11,Amateur Open,74,,,,,90,-95,-100,,90,,,,,,90,B,M
DQ,Yes,Raw,75,Nikolay Lazarev,Николай Лазарев,Russia,1983-05-25,Amateur Open,73.7,,,,,-97.5,-97.5,-97.5,,,,,,,,,B,M
1,Yes,Raw,82.5,Aleksandr Frolov,Александр Фролов,Russia,1976-05-07,Amateur Masters 40-44,82.2,,,,,140,145,-147.5,,145,,,,,,145,B,M
2,Yes,Raw,82.5,Andrey Balantaev,Андрей Балантаев,Russia,1974-09-20,Amateur Masters 40-44,81.5,,,,,130,-137.5,,,130,,,,,,130,B,M
1,Yes,Raw,82.5,Leonid Aleksandrov,Леонид Александров,Russia,1971-07-15,Amateur Masters 45-49,82.25,,,,,150,155,-157.5,,155,,,,,,155,B,M
1,Yes,Raw,82.5,Yuriy Gilman,Юрий Гильман,Russia,1951-10-09,Amateur Masters 65-69,79.25,,,,,75,80,-82.5,,80,,,,,,80,B,M
1,Yes,Raw,82.5,Nikolay Storozhenko,Николай Стороженко,Abkhazia,1979-08-21,Amateur Open,82,,,,,150,155,157.5,,157.5,,,,,,157.5,B,M
2,Yes,Raw,82.5,Yuriy Grekov,Юрий Греков,Russia,1984-04-02,Amateur Open,81.9,,,,,155,-160,,,155,,,,,,155,B,M
3,Yes,Raw,82.5,Aleksandr Frolov,Александр Фролов,Russia,1976-05-07,Amateur Open,82.2,,,,,140,145,-147.5,,145,,,,,,145,B,M
4,Yes,Raw,82.5,Aleksandr Tkachenko,Александр Ткаченко,Russia,1989-08-22,Amateur Open,81.35,,,,,135,142.5,-147.5,,142.5,,,,,,142.5,B,M
5,Yes,Raw,82.5,Vyacheslav Knutarev,Вячеслав Кнутарев,Russia,1978-10-05,Amateur Open,78.2,,,,,115,122.5,-130,,122.5,,,,,,122.5,B,M
DQ,Yes,Raw,82.5,Evgeniy Zelenov,Евгений Зеленов,Russia,1991-03-01,Amateur Open,80.7,,,,,-130,-130,-130,,,,,,,,,B,M
1,Yes,Raw,90,Ivan Rubanov,Иван Рубанов,Russia,1995-01-01,Amateur Juniors 20-23,90,,,,,-142.5,142.5,-150,,142.5,,,,,,142.5,B,M
1,Yes,Raw,90,Sergey Gamov,Сергей Гамов,Russia,1974-12-22,Amateur Masters 40-44,90,,,,,150,157.5,-167.5,,157.5,,,,,,157.5,B,M
2,Yes,Raw,90,Aleksandr Safonov,Александр Сафонов,Russia,1976-02-12,Amateur Masters 40-44,89,,,,,135,145,152.5,,152.5,,,,,,152.5,B,M
3,Yes,Raw,90,Furkat Shafiev,Фуркат Шафиев,Kazakhstan,1973-08-24,Amateur Masters 40-44,83.9,,,,,95,105,-110,,105,,,,,,105,B,M
1,Yes,Raw,90,Evgeniy Zverev,Евгений Зверев,Russia,1967-09-28,Amateur Masters 45-49,89.75,,,,,145,150,155,,155,,,,,,155,B,M
2,Yes,Raw,90,Oleg Galdin,Олег Галдин,Russia,1971-09-25,Amateur Masters 45-49,87.55,,,,,120,135,-140,,135,,,,,,135,B,M
1,Yes,Raw,90,Konstantin Zaiko,Константин Зайко,Russia,1989-04-06,Amateur Open,89.15,,,,,175,180,185,,185,,,,,,185,B,M
2,Yes,Raw,90,Vasiliy Anisimov,Василий Анисимов,Russia,1982-12-15,Amateur Open,89.5,,,,,175,-180,180,,180,,,,,,180,B,M
3,Yes,Raw,90,Maksim Strunin,Максим Струнин,Russia,1990-09-13,Amateur Open,87.25,,,,,160,-170,-170,,160,,,,,,160,B,M
4,Yes,Raw,90,Denis Zubov,Денис Зубов,Russia,1987-01-01,Amateur Open,88.5,,,,,140,150,-155,,150,,,,,,150,B,M
DQ,Yes,Raw,90,Anton Bitkov,Антон Битков,Russia,1984-05-26,Amateur Open,87,,,,,-145,-155,-155,,,,,,,,,B,M
1,Yes,Raw,100,Egor Zhuravlyov,Егор Журавлёв,Israel,1996-06-11,Amateur Juniors 20-23,90.95,,,,,60,70,80,,80,,,,,,80,B,M
1,Yes,Raw,100,Dmitriy Bibanaev,Дмитрий Бибанаев,Russia,1972-08-02,Amateur Masters 40-44,98.5,,,,,155,-160,160,,160,,,,,,160,B,M
1,Yes,Raw,100,Yuriy Rubanov,Юрий Рубанов,Russia,1967-11-28,Amateur Masters 45-49,90.6,,,,,20,,,,20,,,,,,20,B,M
1,Yes,Raw,100,Evgeniy Bobin,Евгений Бобин,Russia,1965-11-30,Amateur Masters 50-54,90.6,,,,,100,-102.5,102.5,,102.5,,,,,,102.5,B,M
1,Yes,Raw,100,Grigoriy Kalinin,Григорий Калинин,Russia,1950-11-19,Amateur Masters 65-69,97.35,,,,,140,-145,,,140,,,,,,140,B,M
1,Yes,Raw,100,Oleg Narykov,Олег Нарыков,Russia,1984-10-23,Amateur Open,93.5,,,,,160,170,172.5,,172.5,,,,,,172.5,B,M
2,Yes,Raw,100,Ramil Mingazov,Рамиль Мингазов,Russia,1989-03-03,Amateur Open,98.3,,,,,160,165,-172.5,,165,,,,,,165,B,M
3,Yes,Raw,100,Aleksey Nabatov,Алексей Набатов,Russia,1987-06-28,Amateur Open,96.2,,,,,-162.5,162.5,-165,,162.5,,,,,,162.5,B,M
DQ,Yes,Raw,100,Sergey Paskeev,Сергей Паскеев,Russia,1982-10-31,Amateur Open,95.8,,,,,-140,-142.5,-142.5,,,,,,,,,B,M
1,Yes,Raw,110,Sergey Matveev,Сергей Матвеев,Russia,1973-04-29,Amateur Masters 40-44,104.15,,,,,192.5,200,-202.5,,200,,,,,,200,B,M
2,Yes,Raw,110,Vladimir Kirdin,Владимир Кирдин,Russia,1975-05-25,Amateur Masters 40-44,101.4,,,,,160,170,-180,,170,,,,,,170,B,M
1,Yes,Raw,110,Murat Dzhaytabarov,Мурат Джайтабаров,Kazakhstan,1963-12-03,Amateur Masters 50-54,101.9,,,,,147.5,150,155,,155,,,,,,155,B,M
1,Yes,Raw,110,Marat Dzhaylaubaev,Марат Джайлаубаев,Kazakhstan,1956-05-09,Amateur Masters 60-64,105.3,,,,,130,140,-150,,140,,,,,,140,B,M
2,Yes,Raw,110,Boris Grabovoy,Борис Грабовой,Russia,1956-01-23,Amateur Masters 60-64,102.5,,,,,105,-115,120,,120,,,,,,120,B,M
1,Yes,Raw,110,Dmitriy Voloshin,Дмитрий Волошин,Russia,1978-11-11,Amateur Open,108.75,,,,,185,190,195,,195,,,,,,195,B,M
2,Yes,Raw,110,Ivan Sorokin,Иван Сорокин,Russia,1983-09-02,Amateur Open,104.7,,,,,175,180,-185,,180,,,,,,180,B,M
3,Yes,Raw,110,Murat Dzhaytabarov,Мурат Джайтабаров,Kazakhstan,1963-12-03,Amateur Open,101.9,,,,,147.5,150,155,,155,,,,,,155,B,M
1,Yes,Raw,125,Aleksandr Vasilchenko,Александр Васильченко,Russia,1966-03-19,Amateur Masters 50-54,120.15,,,,,180,-190,-190,,180,,,,,,180,B,M
1,Yes,Raw,125,Ivan Regulyarnyy,Иван Регулярный,Russia,1984-11-27,Amateur Open,121.3,,,,,197.5,205,210,,210,,,,,,210,B,M
2,Yes,Raw,125,Sergey Babin,Сергей Бабин,Russia,1981-11-18,Amateur Open,115.2,,,,,170,180,187.5,,187.5,,,,,,187.5,B,M
3,Yes,Raw,125,Vladimir Novozhilov,Владимир Новожилов,Kazakhstan,1989-09-19,Amateur Open,110.5,,,,,165,175,180,,180,,,,,,180,B,M
4,Yes,Raw,125,Aleksandr Vasilchenko,Александр Васильченко,Russia,1966-03-19,Amateur Open,120.15,,,,,180,-190,-190,,180,,,,,,180,B,M
1,Yes,Raw,125,Dmitriy Petrenko,Дмитрий Петренко,Russia,1997-11-01,Amateur Teen 18-19,117.6,,,,,-130,130,-137.5,,130,,,,,,130,B,M
1,Yes,Raw,140,Aleksandr Oreshkin,Александр Орешкин,Russia,1982-08-21,Amateur Open,129.15,,,,,190,200,,,200,,,,,,200,B,M
1,Yes,Raw,140+,Maksim Panov,Максим Панов,Russia,1981-05-30,Amateur Open,148.7,,,,,180,190,-200,,190,,,,,,190,B,M
1,No,Raw,67.5,Darya Kovalenko,Дарья Коваленко,Russia,2002-09-13,Pro Open,66.4,,,,,85,-87.5,87.5,90,87.5,,,,,,87.5,B,F
1,No,Raw,67.5,Darya Kovalenko,Дарья Коваленко,Russia,2002-09-13,Pro Teen 14-15,66.4,,,,,85,-87.5,87.5,90,87.5,,,,,,87.5,B,F
1,No,Raw,82.5,Yuliya Kalinchenko,Юлія Калінченко,Russia,1977-11-20,Pro Open,81.2,,,,,95,102.5,-107.5,,102.5,,,,,,102.5,B,F
1,No,Raw,56,Roman Belousov,Роман Белоусов,Russia,1991-10-19,Pro Open,54.55,,,,,155,160,165,,165,,,,,,165,B,M
1,No,Raw,75,Ilya Shikhov,Илья Шихов,Russia,1996-06-11,Pro Juniors 20-23,73,,,,,95,102.5,-105,,102.5,,,,,,102.5,B,M
1,No,Raw,75,Sergey Pismennyy,Сергей Письменный,Russia,1952-12-12,Pro Masters 60-64,74.15,,,,,115,120,,,120,,,,,,120,B,M
1,No,Raw,75,Vladimir Afonin,Владимир Афонин,Russia,1945-06-09,Pro Masters 70-74,68.6,,,,,85,90,92.5,,92.5,,,,,,92.5,B,M
1,No,Raw,75,Vitaliy Temishev,Виталий Темишев,Russia,1983-04-15,Pro Open,70.8,,,,,105,-115,115,,115,,,,,,115,B,M
1,No,Raw,75,Denis Tomchik,Денис Томчик,Russia,2000-06-26,Pro Teen 16-17,75,,,,,102.5,110,-115,,110,,,,,,110,B,M
1,No,Raw,82.5,Ruslan Khusainov,Руслан Хусаинов,Russia,1963-06-27,Pro Masters 50-54,82.1,,,,,105,110,,,110,,,,,,110,B,M
1,No,Raw,82.5,Rustam Yailov,Рустам Яилов,Russia,1980-07-08,Pro Open,82,,,,,185,195,-200,,195,,,,,,195,B,M
2,No,Raw,82.5,Vadim Popov,Вадим Попов,Russia,1984-04-02,Pro Open,81.2,,,,,-160,165,170,,170,,,,,,170,B,M
1,No,Raw,90,Vladimir Goryunov,Владимир Горюнов,Russia,1953-02-02,Pro Masters 60-64,84.65,,,,,150,157.5,160,,160,,,,,,160,B,M
1,No,Raw,90,Artyom Stasyuk,Артём Стасюк,Russia,1993-05-30,Pro Open,88.75,,,,,210,220,-225,,220,,,,,,220,B,M
2,No,Raw,90,Maksim Milov,Максим Милов,Russia,1989-04-27,Pro Open,88.3,,,,,155,160,-165,,160,,,,,,160,B,M
DQ,No,Raw,90,Fuad Mamedov,Фуад Мамедов,Russia,1987-01-02,Pro Open,85.9,,,,,-160,-165,-165,,,,,,,,,B,M
1,No,Raw,100,Stanislav Nagibin,Станислав Нагибин,Russia,1996-09-17,Pro Juniors 20-23,95.45,,,,,182.5,190,192.5,,192.5,,,,,,192.5,B,M
1,No,Raw,100,Andrey Maksimenko,Андрей Максименко,Russia,1972-11-03,Pro Masters 40-44,94.2,,,,,155,-160,,,155,,,,,,155,B,M
2,No,Raw,100,Maksim Nesnov,Максим Неснов,Russia,1976-02-22,Pro Masters 40-44,94.8,,,,,130,140,-150,,140,,,,,,140,B,M
1,No,Raw,100,Aleksey Krivchikov,Алексей Кривчиков,Ukraine,1948-07-19,Pro Masters 65-69,95.5,,,,,120,125,130,,130,,,,,,130,B,M
1,No,Raw,100,Nidzhat Guseynov,Ниджат Гусейнов,Azerbaijan,1989-09-08,Pro Open,92,,,,,140,157.5,170,,170,,,,,,170,B,M
2,No,Raw,100,Aleksey Silin,Алексей Силин,Russia,1981-04-02,Pro Open,90.5,,,,,155,-167.5,167.5,,167.5,,,,,,167.5,B,M
3,No,Raw,100,Natig Guseynov,Натиг Гусейнов,Azerbaijan,1979-01-16,Pro Open,98.6,,,,,130,150,160,,160,,,,,,160,B,M
1,No,Raw,110,Aleksandr Prozorov,Александр Прозоров,,1973-12-12,Pro Masters 40-44,105.7,,,,,190,197.5,202.5,,202.5,,,,,,202.5,B,M
2,No,Raw,110,Aleksandr Bedrentsev,Александр Бедренцев,Russia,1973-11-09,Pro Masters 40-44,103.45,,,,,180,190,-202.5,,190,,,,,,190,B,M
1,No,Raw,110,Andrey Lukyanov,Андрей Лукьянов,Russia,1969-01-29,Pro Masters 45-49,108.6,,,,,165,170,172.5,,172.5,,,,,,172.5,B,M
1,No,Raw,110,Aleksandr Spiryanin,Александр Спирянин,Russia,1977-12-19,Pro Open,106.95,,,,,210,-215,,,210,,,,,,210,B,M
2,No,Raw,110,Nikita Taranin,Никита Таранин,Russia,1989-05-29,Pro Open,107.2,,,,,182.5,190,195,,195,,,,,,195,B,M
3,No,Raw,110,Vitaliy Olesyuk,Виталий Олесюк,Russia,1986-05-29,Pro Open,103,,,,,170,180,-185,,180,,,,,,180,B,M
4,No,Raw,110,Roman Makarov,Роман Макаров,Russia,1980-03-08,Pro Open,108.4,,,,,155,-175,-175,,155,,,,,,155,B,M
1,No,Raw,110,Pyotr Sintsov,Пётр Синцов,Russia,1998-07-18,Pro Teen 18-19,108.8,,,,,182.5,192.5,-200,,192.5,,,,,,192.5,B,M
1,No,Raw,125,Konstantin Silin,Константин Силин,Russia,1976-08-04,Pro Masters 40-44,118.4,,,,,200,210,215,,215,,,,,,215,B,M
1,No,Raw,125,Vyacheslav Rakhmanov,Вячеслав Рахманов,Russia,1968-09-10,Pro Masters 45-49,110.3,,,,,185,192.5,200,,200,,,,,,200,B,M
1,No,Raw,125,Aleksandr Vovenko,Александр Вовенко,Russia,1980-11-25,Pro Open,119.5,,,,,205,212.5,217.5,,217.5,,,,,,217.5,B,M
2,No,Raw,125,Evgeniy Kaminskiy,Евгений Каминский,Russia,1988-05-05,Pro Open,121.7,,,,,182.5,192.5,197.5,,197.5,,,,,,197.5,B,M
1,No,Raw,140,Dmitriy Rezaykin,Дмитрий Резайкин,Russia,1984-02-12,Pro Open,131,,,,,225,232.5,-240,,232.5,,,,,,232.5,B,M
2,No,Raw,140,Nikolay Pyshmintsev,Николай Пышминцев,Russia,1981-01-04,Pro Open,127,,,,,200,225,-240,,225,,,,,,225,B,M
3,No,Raw,140,Vadim Teterev,Вадим Тетерев,Russia,1972-11-10,Pro Open,139.8,,,,,210,220,-230,,220,,,,,,220,B,M
1,No,Raw,140+,Vladimir Bobryashov,Владимир Бобряшов,Russia,1988-12-22,Pro Open,142.3,,,,,205,-215,-215,,205,,,,,,205,B,M
2,No,Raw,140+,Ashot Khazaryan,Ашот Хазарьян,Russia,1980-06-23,Pro Open,141.2,,,,,180,187.5,-195,,187.5,,,,,,187.5,B,M
