<svg width="343" height="242" viewBox="0 0 343 242" fill="none" xmlns="http://www.w3.org/2000/svg">
    <g clip-path="url(#clip0_115_1314)">
        <rect width="343" height="242" rx="24" fill="#181C1F"/>
        <path opacity="0.1" d="M99.8777 0V275.319" stroke="url(#paint0_linear_115_1314)" stroke-width="0.459375"/>
        <path opacity="0.1" d="M146.184 0V275.319" stroke="url(#paint1_linear_115_1314)" stroke-width="0.459375"/>
        <path opacity="0.1" d="M192.176 0V275.319" stroke="url(#paint2_linear_115_1314)" stroke-width="0.459375"/>
        <path opacity="0.1" d="M238.482 0V275.319" stroke="url(#paint3_linear_115_1314)" stroke-width="0.459375"/>
        <path opacity="0.05" d="M395.987 33.076L43.1759 33.076" stroke="url(#paint4_linear_115_1314)" stroke-width="0.459375"/>
        <path opacity="0.1" d="M395.987 96.078L43.1759 96.078" stroke="url(#paint5_linear_115_1314)" stroke-width="0.459375"/>
        <path opacity="0.1" d="M395.987 159.08L43.1759 159.08" stroke="url(#paint6_linear_115_1314)" stroke-width="0.459375"/>
        <path opacity="0.1" d="M395.987 222.082L43.1759 222.082" stroke="url(#paint7_linear_115_1314)" stroke-width="0.459375"/>
        <rect opacity="0.3" x="82.2458" y="62.6957" width="33.3735" height="33.3735" rx="2.14375" fill="url(#paint8_linear_115_1314)" stroke="url(#paint9_linear_115_1314)" stroke-width="0.6125"/>
        <rect opacity="0.3" x="82.2458" y="255.464" width="33.3735" height="33.3735" rx="2.14375" transform="rotate(-90 82.2458 255.464)" fill="url(#paint10_linear_115_1314)" stroke="url(#paint11_linear_115_1314)" stroke-width="0.6125"/>
        <rect opacity="0.3" x="271.549" y="255.149" width="33.3735" height="33.3735" rx="2.14375" transform="rotate(-180 271.549 255.149)" fill="url(#paint12_linear_115_1314)" stroke="url(#paint13_linear_115_1314)" stroke-width="0.6125"/>
        <rect opacity="0.3" x="271.549" y="63.0108" width="33.3735" height="33.3735" rx="2.14375" transform="rotate(90 271.549 63.0108)" fill="url(#paint14_linear_115_1314)" stroke="url(#paint15_linear_115_1314)" stroke-width="0.6125"/>
        <path opacity="0.56" d="M133.352 209.996C132.369 209.93 131.626 209.079 131.692 208.104C131.766 207.122 132.609 206.378 133.592 206.444C134.566 206.519 135.31 207.361 135.243 208.344C135.177 209.319 134.327 210.062 133.352 209.996Z" fill="url(#paint16_linear_115_1314)"/>
        <path opacity="0.56" d="M92.9176 146.367C92.4261 146.334 92.0545 145.909 92.0875 145.421C92.1247 144.93 92.5459 144.558 93.0373 144.591C93.5247 144.628 93.8963 145.05 93.8633 145.541C93.8303 146.028 93.4049 146.4 92.9176 146.367Z" fill="url(#paint17_linear_115_1314)"/>
        <path opacity="0.56" d="M64.4393 27.5596C63.9479 27.5265 63.5762 27.1012 63.6092 26.6139C63.6464 26.1224 64.0676 25.7507 64.5591 25.7838C65.0464 25.8209 65.4181 26.2422 65.385 26.7336C65.352 27.2209 64.9266 27.5926 64.4393 27.5596Z" fill="url(#paint18_linear_115_1314)"/>
        <path opacity="0.56" d="M130.74 35.5691C130.249 35.5361 129.877 35.1107 129.91 34.6234C129.947 34.1319 130.368 33.7603 130.86 33.7933C131.347 33.8305 131.719 34.2517 131.686 34.7431C131.653 35.2305 131.227 35.6021 130.74 35.5691Z" fill="url(#paint19_linear_115_1314)"/>
        <path opacity="0.56" d="M249.993 136.133C249.501 136.1 249.129 135.674 249.162 135.187C249.2 134.696 249.621 134.324 250.112 134.357C250.6 134.394 250.971 134.815 250.938 135.307C250.905 135.794 250.48 136.166 249.993 136.133Z" fill="url(#paint20_linear_115_1314)"/>
        <path opacity="0.56" d="M59.8163 161.49C57.8505 161.358 56.3638 159.656 56.496 157.707C56.6446 155.741 58.3296 154.255 60.2954 154.387C62.2446 154.536 63.7313 156.22 63.5992 158.186C63.467 160.135 61.7655 161.622 59.8163 161.49Z" fill="url(#paint21_linear_115_1314)"/>
        <path opacity="0.56" d="M284.527 34.6731C282.561 34.541 281.074 32.8395 281.206 30.8903C281.355 28.9245 283.04 27.4378 285.006 27.5699C286.955 27.7186 288.442 29.4036 288.31 31.3693C288.177 33.3186 286.476 34.8053 284.527 34.6731Z" fill="url(#paint22_linear_115_1314)"/>
        <path opacity="0.56" d="M22.4964 54.2538C21.0221 54.1547 19.907 52.8786 20.0061 51.4167C20.1176 49.9423 21.3813 48.8273 22.8557 48.9264C24.3176 49.0379 25.4326 50.3016 25.3335 51.776C25.2344 53.2379 23.9583 54.3529 22.4964 54.2538Z" fill="url(#paint23_linear_115_1314)"/>
        <path opacity="0.56" d="M303.719 160.602C302.244 160.503 301.129 159.227 301.228 157.765C301.34 156.29 302.604 155.175 304.078 155.275C305.54 155.386 306.655 156.65 306.556 158.124C306.457 159.586 305.18 160.701 303.719 160.602Z" fill="url(#paint24_linear_115_1314)"/>
        <path d="M109.009 37.679C109.533 37.679 110.037 37.7668 110.521 37.9425C111.008 38.1181 111.442 38.3982 111.823 38.7827C112.208 39.1671 112.511 39.6776 112.733 40.3139C112.958 40.947 113.073 41.7242 113.076 42.6456C113.076 43.5107 112.978 44.2829 112.783 44.9624C112.59 45.6385 112.314 46.2135 111.952 46.6875C111.591 47.1615 111.155 47.5227 110.645 47.7713C110.134 48.0166 109.564 48.1392 108.935 48.1392C108.255 48.1392 107.655 48.0083 107.135 47.7464C106.615 47.4813 106.195 47.1217 105.877 46.6676C105.562 46.2102 105.372 45.6965 105.305 45.1264H107.428C107.511 45.4976 107.685 45.786 107.95 45.9915C108.215 46.1937 108.544 46.2947 108.935 46.2947C109.598 46.2947 110.101 46.0064 110.446 45.4297C110.791 44.8497 110.965 44.0559 110.968 43.0483H110.898C110.746 43.3466 110.54 43.6035 110.282 43.8189C110.023 44.031 109.727 44.1951 109.392 44.3111C109.061 44.4271 108.708 44.4851 108.333 44.4851C107.733 44.4851 107.198 44.3442 106.727 44.0625C106.257 43.7808 105.885 43.393 105.614 42.8991C105.342 42.4053 105.206 41.8419 105.206 41.2088C105.203 40.526 105.36 39.9179 105.678 39.3842C105.996 38.8506 106.441 38.433 107.011 38.1314C107.584 37.8265 108.25 37.6757 109.009 37.679ZM109.024 39.3693C108.689 39.3693 108.391 39.4489 108.129 39.608C107.871 39.767 107.665 39.9808 107.513 40.2493C107.364 40.5178 107.291 40.8177 107.294 41.1491C107.294 41.4839 107.367 41.7855 107.513 42.054C107.662 42.3191 107.864 42.5312 108.119 42.6903C108.378 42.8461 108.673 42.924 109.004 42.924C109.253 42.924 109.483 42.8776 109.695 42.7848C109.907 42.692 110.091 42.5644 110.247 42.402C110.406 42.2363 110.531 42.0457 110.62 41.8303C110.71 41.6148 110.754 41.3861 110.754 41.1442C110.751 40.8227 110.675 40.5277 110.526 40.2592C110.376 39.9908 110.171 39.7753 109.909 39.6129C109.647 39.4505 109.352 39.3693 109.024 39.3693ZM117.427 48V37.8182H121.444C122.216 37.8182 122.874 37.9657 123.418 38.2607C123.961 38.5523 124.376 38.9583 124.661 39.4787C124.949 39.9957 125.093 40.5923 125.093 41.2685C125.093 41.9446 124.947 42.5412 124.656 43.0582C124.364 43.5753 123.942 43.978 123.388 44.2663C122.838 44.5547 122.172 44.6989 121.389 44.6989H118.829V42.9737H121.041C121.456 42.9737 121.797 42.9025 122.066 42.7599C122.337 42.6141 122.54 42.4136 122.672 42.1584C122.808 41.8999 122.876 41.6032 122.876 41.2685C122.876 40.9304 122.808 40.6354 122.672 40.3835C122.54 40.1283 122.337 39.9311 122.066 39.7919C121.794 39.6494 121.449 39.5781 121.032 39.5781H119.58V48H117.427ZM129.871 48H127.564L131.079 37.8182H133.853L137.363 48H135.056L132.506 40.1449H132.426L129.871 48ZM129.727 43.9979H135.175V45.6783H129.727V43.9979ZM147.661 41.1094C147.592 40.8674 147.494 40.6536 147.368 40.468C147.242 40.2791 147.088 40.12 146.906 39.9908C146.727 39.8582 146.521 39.7571 146.289 39.6875C146.061 39.6179 145.807 39.5831 145.529 39.5831C145.008 39.5831 144.551 39.7124 144.156 39.9709C143.765 40.2294 143.46 40.6056 143.242 41.0994C143.023 41.59 142.913 42.1899 142.913 42.8991C142.913 43.6084 143.021 44.2116 143.237 44.7088C143.452 45.206 143.757 45.5855 144.151 45.8473C144.546 46.1058 145.012 46.2351 145.548 46.2351C146.036 46.2351 146.452 46.1489 146.796 45.9766C147.144 45.8009 147.409 45.554 147.592 45.2358C147.777 44.9176 147.87 44.5414 147.87 44.1072L148.308 44.1719H145.683V42.5511H149.943V43.8338C149.943 44.7287 149.754 45.4976 149.377 46.1406C148.999 46.7803 148.478 47.2741 147.815 47.6222C147.153 47.9669 146.394 48.1392 145.538 48.1392C144.584 48.1392 143.745 47.9287 143.023 47.5078C142.3 47.0836 141.737 46.482 141.333 45.7031C140.931 44.9209 140.731 43.9929 140.731 42.919C140.731 42.0937 140.85 41.358 141.089 40.7116C141.331 40.062 141.669 39.5118 142.103 39.0611C142.537 38.6103 143.043 38.2673 143.619 38.032C144.196 37.7966 144.821 37.679 145.494 37.679C146.07 37.679 146.607 37.7635 147.105 37.9325C147.602 38.0982 148.043 38.3336 148.427 38.6385C148.815 38.9434 149.131 39.3063 149.377 39.7273C149.622 40.1449 149.779 40.6056 149.849 41.1094H147.661ZM154.36 48V37.8182H161.221V39.593H156.513V42.0192H160.868V43.794H156.513V46.2251H161.241V48H154.36ZM180.757 41.3828H178.579C178.539 41.1011 178.458 40.8509 178.335 40.6321C178.213 40.41 178.055 40.2211 177.863 40.0653C177.671 39.9096 177.449 39.7902 177.197 39.7074C176.948 39.6245 176.678 39.5831 176.386 39.5831C175.859 39.5831 175.4 39.714 175.009 39.9759C174.618 40.2344 174.315 40.6122 174.1 41.1094C173.884 41.6032 173.776 42.2031 173.776 42.9091C173.776 43.6349 173.884 44.2448 174.1 44.7386C174.318 45.2325 174.623 45.6054 175.014 45.8572C175.405 46.1091 175.858 46.2351 176.372 46.2351C176.66 46.2351 176.927 46.197 177.172 46.1207C177.421 46.0445 177.641 45.9335 177.833 45.7876C178.025 45.6385 178.185 45.4579 178.31 45.2457C178.44 45.0336 178.529 44.7917 178.579 44.5199L180.757 44.5298C180.7 44.9972 180.559 45.4479 180.334 45.8821C180.112 46.313 179.812 46.6991 179.434 47.0405C179.06 47.3786 178.612 47.647 178.092 47.8459C177.575 48.0414 176.99 48.1392 176.337 48.1392C175.429 48.1392 174.617 47.9337 173.901 47.5227C173.188 47.1117 172.625 46.5168 172.21 45.7379C171.799 44.959 171.594 44.0161 171.594 42.9091C171.594 41.7988 171.803 40.8542 172.22 40.0753C172.638 39.2964 173.205 38.7031 173.921 38.2955C174.636 37.8845 175.442 37.679 176.337 37.679C176.927 37.679 177.474 37.7618 177.977 37.9276C178.484 38.0933 178.934 38.3352 179.325 38.6534C179.716 38.9683 180.034 39.3544 180.279 39.8118C180.528 40.2692 180.687 40.7929 180.757 41.3828ZM194.457 42.9091C194.457 44.0194 194.246 44.964 193.825 45.7429C193.408 46.5218 192.838 47.1167 192.115 47.5277C191.396 47.9354 190.587 48.1392 189.689 48.1392C188.784 48.1392 187.972 47.9337 187.253 47.5227C186.534 47.1117 185.965 46.5168 185.548 45.7379C185.13 44.959 184.921 44.0161 184.921 42.9091C184.921 41.7988 185.13 40.8542 185.548 40.0753C185.965 39.2964 186.534 38.7031 187.253 38.2955C187.972 37.8845 188.784 37.679 189.689 37.679C190.587 37.679 191.396 37.8845 192.115 38.2955C192.838 38.7031 193.408 39.2964 193.825 40.0753C194.246 40.8542 194.457 41.7988 194.457 42.9091ZM192.274 42.9091C192.274 42.1899 192.166 41.5833 191.951 41.0895C191.739 40.5956 191.439 40.2211 191.051 39.9659C190.663 39.7107 190.209 39.5831 189.689 39.5831C189.169 39.5831 188.715 39.7107 188.327 39.9659C187.939 40.2211 187.637 40.5956 187.422 41.0895C187.21 41.5833 187.104 42.1899 187.104 42.9091C187.104 43.6283 187.21 44.2348 187.422 44.7287C187.637 45.2225 187.939 45.5971 188.327 45.8523C188.715 46.1075 189.169 46.2351 189.689 46.2351C190.209 46.2351 190.663 46.1075 191.051 45.8523C191.439 45.5971 191.739 45.2225 191.951 44.7287C192.166 44.2348 192.274 43.6283 192.274 42.9091ZM188.928 36.8338L189.982 34.5717H191.941L190.425 36.8338H188.928ZM204.504 39.593V37.8182H212.866V39.593H209.749V48H207.621V39.593H204.504ZM217.043 48V37.8182H219.196V42.0192H223.566V37.8182H225.714V48H223.566V43.794H219.196V48H217.043ZM230.288 48V37.8182H237.149V39.593H232.441V42.0192H236.796V43.794H232.441V46.2251H237.169V48H230.288ZM234.325 35.4915L236.284 37.0376H234.828L233.724 36.1676L232.605 37.0376H231.149L233.107 35.4915H234.325ZM236.737 36.1676H235.638L235.543 35.4219C235.828 35.4086 236.036 35.3722 236.165 35.3125C236.294 35.2528 236.359 35.165 236.359 35.049C236.359 34.8965 236.278 34.7938 236.115 34.7408C235.953 34.6877 235.751 34.6612 235.509 34.6612L235.558 33.8608C236.231 33.8608 236.745 33.9602 237.1 34.1591C237.454 34.3546 237.632 34.6314 237.632 34.9893C237.632 35.2379 237.537 35.4285 237.348 35.5611C237.163 35.6903 236.959 35.7732 236.737 35.8097V36.1676Z" fill="url(#paint25_linear_115_1314)"/>
        <path d="M35.7202 88V70.5455H39.4105V77.7472H46.902V70.5455H50.5838V88H46.902V80.7898H39.4105V88H35.7202ZM57.2912 88.2472C56.456 88.2472 55.7116 88.1023 55.0582 87.8125C54.4048 87.517 53.8878 87.0824 53.5071 86.5085C53.1321 85.929 52.9446 85.2074 52.9446 84.3438C52.9446 83.6165 53.0781 83.0057 53.3452 82.5114C53.6122 82.017 53.9759 81.6193 54.4361 81.3182C54.8963 81.017 55.419 80.7898 56.0043 80.6364C56.5952 80.483 57.2145 80.375 57.8622 80.3125C58.6236 80.233 59.2372 80.1591 59.7031 80.0909C60.169 80.017 60.5071 79.9091 60.7173 79.767C60.9276 79.625 61.0327 79.4148 61.0327 79.1364V79.0852C61.0327 78.5455 60.8622 78.1278 60.5213 77.8324C60.1861 77.5369 59.7088 77.3892 59.0895 77.3892C58.4361 77.3892 57.9162 77.5341 57.5298 77.8239C57.1435 78.108 56.8878 78.4659 56.7628 78.8977L53.4048 78.625C53.5753 77.8295 53.9105 77.142 54.4105 76.5625C54.9105 75.9773 55.5554 75.5284 56.3452 75.2159C57.1406 74.8977 58.0611 74.7386 59.1065 74.7386C59.8338 74.7386 60.5298 74.8239 61.1946 74.9943C61.8651 75.1648 62.4588 75.429 62.9759 75.7869C63.4986 76.1449 63.9105 76.6051 64.2116 77.1676C64.5128 77.7244 64.6634 78.392 64.6634 79.1705V88H61.2202V86.1847H61.1179C60.9077 86.5938 60.6264 86.9545 60.2741 87.267C59.9219 87.5739 59.4986 87.8153 59.0043 87.9915C58.5099 88.1619 57.9389 88.2472 57.2912 88.2472ZM58.331 85.7415C58.8651 85.7415 59.3366 85.6364 59.7457 85.4261C60.1548 85.2102 60.4759 84.9205 60.7088 84.5568C60.9418 84.1932 61.0582 83.7812 61.0582 83.321V81.9318C60.9446 82.0057 60.7884 82.0739 60.5895 82.1364C60.3963 82.1932 60.1776 82.2472 59.9332 82.2983C59.6889 82.3437 59.4446 82.3864 59.2003 82.4261C58.956 82.4602 58.7344 82.4915 58.5355 82.5199C58.1094 82.5824 57.7372 82.6818 57.419 82.8182C57.1009 82.9545 56.8537 83.1392 56.6776 83.3722C56.5014 83.5994 56.4134 83.8835 56.4134 84.2244C56.4134 84.7188 56.5923 85.0966 56.9503 85.358C57.3139 85.6136 57.7741 85.7415 58.331 85.7415ZM56.8054 73.2983L54.7855 73.2727C54.7855 72.1875 55.0526 71.3551 55.5866 70.7756C56.1264 70.196 56.7827 69.9034 57.5554 69.8977C57.9531 69.8977 58.294 69.9631 58.5781 70.0938C58.8679 70.2188 59.1264 70.3665 59.3537 70.5369C59.5866 70.7074 59.8082 70.858 60.0185 70.9886C60.2287 71.1136 60.456 71.1761 60.7003 71.1761C61.0298 71.1705 61.2798 71.0483 61.4503 70.8097C61.6264 70.5653 61.7145 70.2472 61.7145 69.8551L63.7003 69.9148C63.6889 70.9886 63.4162 71.8182 62.8821 72.4034C62.348 72.983 61.6974 73.2756 60.9304 73.2812C60.5043 73.2812 60.1463 73.2188 59.8565 73.0938C59.5724 72.9631 59.3224 72.8153 59.1065 72.6506C58.8906 72.4801 58.6804 72.3295 58.4759 72.1989C58.2713 72.0682 58.0412 72.0028 57.7855 72.0028C57.4901 72.0028 57.2514 72.1193 57.0696 72.3523C56.8935 72.5852 56.8054 72.9006 56.8054 73.2983ZM69.2528 92.9091C68.7926 92.9091 68.3608 92.8722 67.9574 92.7983C67.5597 92.7301 67.2301 92.642 66.9688 92.5341L67.7869 89.8239C68.2131 89.9545 68.5966 90.0256 68.9375 90.0369C69.2841 90.0483 69.5824 89.9688 69.8324 89.7983C70.0881 89.6278 70.2955 89.3381 70.4545 88.929L70.6676 88.375L65.9716 74.9091H69.7898L72.5 84.5227H72.6364L75.3722 74.9091H79.2159L74.1278 89.4148C73.8835 90.1193 73.5511 90.733 73.1307 91.2557C72.7159 91.7841 72.1903 92.1903 71.554 92.4744C70.9176 92.7642 70.1506 92.9091 69.2528 92.9091ZM93.5916 74.9091V77.6364H85.7081V74.9091H93.5916ZM87.4979 71.7727H91.1286V83.9773C91.1286 84.3125 91.1797 84.5739 91.282 84.7614C91.3842 84.9432 91.5263 85.071 91.7081 85.1449C91.8956 85.2187 92.1115 85.2557 92.3558 85.2557C92.5263 85.2557 92.6967 85.2415 92.8672 85.2131C93.0376 85.179 93.1683 85.1534 93.2592 85.1364L93.8303 87.8381C93.6484 87.8949 93.3928 87.9602 93.0632 88.0341C92.7337 88.1136 92.3331 88.1619 91.8615 88.179C90.9865 88.2131 90.2195 88.0966 89.5604 87.8295C88.907 87.5625 88.3984 87.1477 88.0348 86.5852C87.6712 86.0227 87.4922 85.3125 87.4979 84.4545V71.7727ZM95.9567 88V74.9091H99.4766V77.1932H99.6129C99.8516 76.3807 100.252 75.767 100.815 75.3523C101.377 74.9318 102.025 74.7216 102.758 74.7216C102.94 74.7216 103.136 74.733 103.346 74.7557C103.556 74.7784 103.741 74.8097 103.9 74.8494V78.071C103.729 78.0199 103.494 77.9744 103.192 77.9347C102.891 77.8949 102.616 77.875 102.366 77.875C101.832 77.875 101.354 77.9915 100.934 78.2244C100.519 78.4517 100.19 78.7699 99.9453 79.179C99.7067 79.5881 99.5874 80.0597 99.5874 80.5938V88H95.9567ZM109.135 88.2472C108.3 88.2472 107.555 88.1023 106.902 87.8125C106.249 87.517 105.732 87.0824 105.351 86.5085C104.976 85.929 104.788 85.2074 104.788 84.3438C104.788 83.6165 104.922 83.0057 105.189 82.5114C105.456 82.017 105.82 81.6193 106.28 81.3182C106.74 81.017 107.263 80.7898 107.848 80.6364C108.439 80.483 109.058 80.375 109.706 80.3125C110.467 80.233 111.081 80.1591 111.547 80.0909C112.013 80.017 112.351 79.9091 112.561 79.767C112.771 79.625 112.876 79.4148 112.876 79.1364V79.0852C112.876 78.5455 112.706 78.1278 112.365 77.8324C112.03 77.5369 111.553 77.3892 110.933 77.3892C110.28 77.3892 109.76 77.5341 109.374 77.8239C108.987 78.108 108.732 78.4659 108.607 78.8977L105.249 78.625C105.419 77.8295 105.754 77.142 106.254 76.5625C106.754 75.9773 107.399 75.5284 108.189 75.2159C108.984 74.8977 109.905 74.7386 110.95 74.7386C111.678 74.7386 112.374 74.8239 113.038 74.9943C113.709 75.1648 114.303 75.429 114.82 75.7869C115.342 76.1449 115.754 76.6051 116.055 77.1676C116.357 77.7244 116.507 78.392 116.507 79.1705V88H113.064V86.1847H112.962C112.751 86.5938 112.47 86.9545 112.118 87.267C111.766 87.5739 111.342 87.8153 110.848 87.9915C110.354 88.1619 109.783 88.2472 109.135 88.2472ZM110.175 85.7415C110.709 85.7415 111.18 85.6364 111.589 85.4261C111.999 85.2102 112.32 84.9205 112.553 84.5568C112.786 84.1932 112.902 83.7812 112.902 83.321V81.9318C112.788 82.0057 112.632 82.0739 112.433 82.1364C112.24 82.1932 112.021 82.2472 111.777 82.2983C111.533 82.3437 111.288 82.3864 111.044 82.4261C110.8 82.4602 110.578 82.4915 110.379 82.5199C109.953 82.5824 109.581 82.6818 109.263 82.8182C108.945 82.9545 108.697 83.1392 108.521 83.3722C108.345 83.5994 108.257 83.8835 108.257 84.2244C108.257 84.7188 108.436 85.0966 108.794 85.358C109.158 85.6136 109.618 85.7415 110.175 85.7415ZM112.425 73.0341H109.732L109.544 71.5C110.146 71.4716 110.575 71.392 110.831 71.2614C111.087 71.125 111.212 70.946 111.206 70.7244C111.212 70.4176 111.05 70.2102 110.72 70.1023C110.396 69.9943 109.99 69.9403 109.501 69.9403L109.595 68.2955C111.112 68.2955 112.266 68.5 113.055 68.9091C113.851 69.3182 114.246 69.8864 114.24 70.6136C114.246 71.1307 114.058 71.5227 113.678 71.7898C113.303 72.0511 112.885 72.2159 112.425 72.2841V73.0341ZM119.324 88V74.9091H122.955V88H119.324ZM121.148 73.2216C120.608 73.2216 120.145 73.0426 119.759 72.6847C119.378 72.321 119.188 71.8864 119.188 71.3807C119.188 70.8807 119.378 70.4517 119.759 70.0938C120.145 69.7301 120.608 69.5483 121.148 69.5483C121.688 69.5483 122.148 69.7301 122.528 70.0938C122.915 70.4517 123.108 70.8807 123.108 71.3807C123.108 71.8864 122.915 72.321 122.528 72.6847C122.148 73.0426 121.688 73.2216 121.148 73.2216ZM135.048 80.4318V88H131.418V74.9091H134.878V77.2188H135.031C135.321 76.4574 135.807 75.8551 136.489 75.4119C137.17 74.9631 137.997 74.7386 138.969 74.7386C139.878 74.7386 140.67 74.9375 141.347 75.3352C142.023 75.733 142.548 76.3011 142.923 77.0398C143.298 77.7727 143.486 78.6477 143.486 79.6648V88H139.855V80.3125C139.861 79.5114 139.656 78.8864 139.241 78.4375C138.827 77.983 138.256 77.7557 137.528 77.7557C137.04 77.7557 136.608 77.8608 136.233 78.071C135.864 78.2812 135.574 78.5881 135.364 78.9915C135.159 79.3892 135.054 79.8693 135.048 80.4318ZM152.245 93.1818C151.069 93.1818 150.06 93.0199 149.219 92.696C148.384 92.3778 147.719 91.9432 147.225 91.392C146.731 90.8409 146.41 90.2216 146.262 89.5341L149.62 89.0824C149.722 89.3438 149.884 89.5881 150.106 89.8153C150.327 90.0426 150.62 90.2244 150.984 90.3608C151.353 90.5028 151.802 90.5739 152.33 90.5739C153.12 90.5739 153.771 90.3807 154.282 89.9943C154.799 89.6136 155.058 88.9744 155.058 88.0767V85.6818H154.904C154.745 86.0455 154.506 86.3892 154.188 86.7131C153.87 87.0369 153.461 87.3011 152.961 87.5057C152.461 87.7102 151.864 87.8125 151.171 87.8125C150.188 87.8125 149.293 87.5852 148.487 87.1307C147.685 86.6705 147.046 85.9687 146.569 85.0256C146.097 84.0767 145.862 82.8778 145.862 81.429C145.862 79.946 146.103 78.7074 146.586 77.7131C147.069 76.7187 147.711 75.9744 148.512 75.4801C149.319 74.9858 150.202 74.7386 151.163 74.7386C151.896 74.7386 152.509 74.8636 153.004 75.1136C153.498 75.358 153.896 75.6648 154.197 76.0341C154.504 76.3977 154.739 76.7557 154.904 77.108H155.04V74.9091H158.646V88.1278C158.646 89.2415 158.373 90.1733 157.827 90.9233C157.282 91.6733 156.526 92.2358 155.56 92.6108C154.6 92.9915 153.495 93.1818 152.245 93.1818ZM152.322 85.0852C152.907 85.0852 153.401 84.9403 153.805 84.6506C154.214 84.3551 154.526 83.9347 154.742 83.3892C154.964 82.8381 155.075 82.179 155.075 81.4119C155.075 80.6449 154.967 79.9801 154.751 79.4176C154.535 78.8494 154.222 78.4091 153.813 78.0966C153.404 77.7841 152.907 77.6278 152.322 77.6278C151.725 77.6278 151.222 77.7898 150.813 78.1136C150.404 78.4318 150.094 78.875 149.884 79.4432C149.674 80.0114 149.569 80.6676 149.569 81.4119C149.569 82.1676 149.674 82.821 149.884 83.3722C150.1 83.9176 150.41 84.3409 150.813 84.642C151.222 84.9375 151.725 85.0852 152.322 85.0852ZM165.165 80.4318V88H161.535V70.5455H165.063V77.2188H165.217C165.512 76.446 165.989 75.8409 166.648 75.4034C167.308 74.9602 168.134 74.7386 169.129 74.7386C170.038 74.7386 170.83 74.9375 171.506 75.3352C172.188 75.7273 172.717 76.2926 173.092 77.0312C173.472 77.7642 173.66 78.642 173.654 79.6648V88H170.023V80.3125C170.029 79.5057 169.825 78.8778 169.41 78.429C169.001 77.9801 168.427 77.7557 167.688 77.7557C167.194 77.7557 166.756 77.8608 166.376 78.071C166.001 78.2812 165.705 78.5881 165.489 78.9915C165.279 79.3892 165.171 79.8693 165.165 80.4318ZM176.511 88V74.9091H180.142V88H176.511ZM178.335 73.2216C177.795 73.2216 177.332 73.0426 176.946 72.6847C176.565 72.321 176.375 71.8864 176.375 71.3807C176.375 70.8807 176.565 70.4517 176.946 70.0938C177.332 69.7301 177.795 69.5483 178.335 69.5483C178.875 69.5483 179.335 69.7301 179.716 70.0938C180.102 70.4517 180.295 70.8807 180.295 71.3807C180.295 71.8864 180.102 72.321 179.716 72.6847C179.335 73.0426 178.875 73.2216 178.335 73.2216ZM189.016 88.2557C187.67 88.2557 186.511 87.983 185.539 87.4375C184.573 86.8864 183.829 86.108 183.306 85.1023C182.783 84.0909 182.522 82.8949 182.522 81.5142C182.522 80.1676 182.783 78.9858 183.306 77.9688C183.829 76.9517 184.565 76.1591 185.513 75.5909C186.468 75.0227 187.587 74.7386 188.871 74.7386C189.735 74.7386 190.539 74.8778 191.283 75.1562C192.033 75.429 192.687 75.8409 193.244 76.392C193.806 76.9432 194.244 77.6364 194.556 78.4716C194.869 79.3011 195.025 80.2727 195.025 81.3864V82.3835H183.971V80.1335H191.607C191.607 79.6108 191.494 79.1477 191.266 78.7443C191.039 78.3409 190.724 78.0256 190.32 77.7983C189.923 77.5653 189.46 77.4489 188.931 77.4489C188.38 77.4489 187.891 77.5767 187.465 77.8324C187.045 78.0824 186.715 78.4205 186.477 78.8466C186.238 79.267 186.116 79.7358 186.11 80.2528V82.392C186.11 83.0398 186.229 83.5994 186.468 84.071C186.712 84.5426 187.056 84.9062 187.499 85.1619C187.942 85.4176 188.468 85.5455 189.076 85.5455C189.479 85.5455 189.849 85.4886 190.184 85.375C190.519 85.2614 190.806 85.0909 191.045 84.8636C191.283 84.6364 191.465 84.358 191.59 84.0284L194.948 84.25C194.778 85.0568 194.428 85.7614 193.9 86.3636C193.377 86.9602 192.701 87.4261 191.871 87.7614C191.048 88.0909 190.096 88.2557 189.016 88.2557ZM190.499 73.3409L188.786 71.2614L187.073 73.3409H183.979V73.2216L187.431 69.4716H190.133L193.593 73.2216V73.3409H190.499ZM188.795 92.9006C188.255 92.9006 187.792 92.7216 187.406 92.3636C187.019 92.0057 186.826 91.5739 186.826 91.0682C186.826 90.5625 187.019 90.1307 187.406 89.7727C187.792 89.4148 188.255 89.2358 188.795 89.2358C189.335 89.2358 189.795 89.4148 190.175 89.7727C190.562 90.1307 190.755 90.5625 190.755 91.0682C190.755 91.5739 190.562 92.0057 190.175 92.3636C189.795 92.7216 189.335 92.9006 188.795 92.9006ZM197.394 88V74.9091H200.854V77.2188H201.008C201.281 76.4517 201.735 75.8466 202.371 75.4034C203.008 74.9602 203.769 74.7386 204.656 74.7386C205.553 74.7386 206.317 74.9631 206.948 75.4119C207.579 75.8551 207.999 76.4574 208.21 77.2188H208.346C208.613 76.4688 209.096 75.8693 209.795 75.4205C210.499 74.9659 211.332 74.7386 212.292 74.7386C213.513 74.7386 214.505 75.1278 215.266 75.9062C216.033 76.679 216.417 77.7756 216.417 79.196V88H212.795V79.9119C212.795 79.1847 212.602 78.6392 212.215 78.2756C211.829 77.9119 211.346 77.7301 210.766 77.7301C210.107 77.7301 209.593 77.9403 209.224 78.3608C208.854 78.7756 208.67 79.3239 208.67 80.0057V88H205.15V79.8352C205.15 79.1932 204.965 78.6818 204.596 78.3011C204.232 77.9205 203.752 77.7301 203.156 77.7301C202.752 77.7301 202.388 77.8324 202.065 78.0369C201.746 78.2358 201.494 78.517 201.306 78.8807C201.119 79.2386 201.025 79.6591 201.025 80.142V88H197.394ZM229.663 88.2131C228.669 88.2131 227.768 87.9574 226.962 87.446C226.161 86.929 225.524 86.1705 225.053 85.1705C224.587 84.1648 224.354 82.9318 224.354 81.4716C224.354 79.9716 224.595 78.7244 225.078 77.7301C225.561 76.7301 226.203 75.983 227.004 75.4886C227.811 74.9886 228.695 74.7386 229.655 74.7386C230.388 74.7386 230.999 74.8636 231.487 75.1136C231.982 75.358 232.379 75.6648 232.68 76.0341C232.987 76.3977 233.22 76.7557 233.379 77.108H233.49V70.5455H237.112V88H233.533V85.9034H233.379C233.209 86.267 232.967 86.6278 232.655 86.9858C232.348 87.3381 231.947 87.6307 231.453 87.8636C230.964 88.0966 230.368 88.2131 229.663 88.2131ZM230.814 85.3239C231.399 85.3239 231.893 85.1648 232.297 84.8466C232.706 84.5227 233.018 84.071 233.234 83.4915C233.456 82.9119 233.567 82.233 233.567 81.4545C233.567 80.6761 233.459 80 233.243 79.4261C233.027 78.8523 232.714 78.4091 232.305 78.0966C231.896 77.7841 231.399 77.6278 230.814 77.6278C230.217 77.6278 229.714 77.7898 229.305 78.1136C228.896 78.4375 228.587 78.8864 228.376 79.4602C228.166 80.0341 228.061 80.6989 228.061 81.4545C228.061 82.2159 228.166 82.8892 228.376 83.4744C228.592 84.054 228.902 84.5085 229.305 84.8381C229.714 85.1619 230.217 85.3239 230.814 85.3239ZM240.097 88V74.9091H243.728V88H240.097ZM241.921 73.2216C241.381 73.2216 240.918 73.0426 240.532 72.6847C240.151 72.321 239.961 71.8864 239.961 71.3807C239.961 70.8807 240.151 70.4517 240.532 70.0938C240.918 69.7301 241.381 69.5483 241.921 69.5483C242.461 69.5483 242.921 69.7301 243.302 70.0938C243.688 70.4517 243.881 70.8807 243.881 71.3807C243.881 71.8864 243.688 72.321 243.302 72.6847C242.921 73.0426 242.461 73.2216 241.921 73.2216ZM241.947 92.9006C241.407 92.9006 240.944 92.7216 240.558 92.3636C240.171 92.0057 239.978 91.5739 239.978 91.0682C239.978 90.5625 240.171 90.1307 240.558 89.7727C240.944 89.4148 241.407 89.2358 241.947 89.2358C242.487 89.2358 242.947 89.4148 243.327 89.7727C243.714 90.1307 243.907 90.5625 243.907 91.0682C243.907 91.5739 243.714 92.0057 243.327 92.3636C242.947 92.7216 242.487 92.9006 241.947 92.9006ZM252.551 88.2557C251.21 88.2557 250.057 87.9716 249.091 87.4034C248.131 86.8295 247.392 86.0341 246.875 85.017C246.364 84 246.108 82.8295 246.108 81.5057C246.108 80.1648 246.366 78.9886 246.884 77.9773C247.406 76.9602 248.148 76.1676 249.108 75.5994C250.068 75.0256 251.21 74.7386 252.534 74.7386C253.676 74.7386 254.676 74.946 255.534 75.3608C256.392 75.7756 257.071 76.358 257.571 77.108C258.071 77.858 258.347 78.7386 258.398 79.75H254.972C254.875 79.0966 254.619 78.571 254.205 78.1733C253.795 77.7699 253.259 77.5682 252.594 77.5682C252.031 77.5682 251.54 77.7216 251.119 78.0284C250.705 78.3295 250.381 78.7699 250.148 79.3494C249.915 79.929 249.798 80.6307 249.798 81.4545C249.798 82.2898 249.912 83 250.139 83.5852C250.372 84.1705 250.699 84.6165 251.119 84.9233C251.54 85.2301 252.031 85.3835 252.594 85.3835C253.009 85.3835 253.381 85.2983 253.71 85.1278C254.045 84.9574 254.321 84.7102 254.537 84.3864C254.759 84.0568 254.903 83.6619 254.972 83.2017H258.398C258.341 84.2017 258.068 85.0824 257.58 85.8438C257.097 86.5994 256.429 87.1903 255.577 87.6165C254.724 88.0426 253.716 88.2557 252.551 88.2557ZM264.353 80.4318V88H260.722V70.5455H264.251V77.2188H264.404C264.7 76.446 265.177 75.8409 265.836 75.4034C266.495 74.9602 267.322 74.7386 268.316 74.7386C269.225 74.7386 270.018 74.9375 270.694 75.3352C271.376 75.7273 271.904 76.2926 272.279 77.0312C272.66 77.7642 272.847 78.642 272.842 79.6648V88H269.211V80.3125C269.217 79.5057 269.012 78.8778 268.597 78.429C268.188 77.9801 267.614 77.7557 266.876 77.7557C266.381 77.7557 265.944 77.8608 265.563 78.071C265.188 78.2812 264.893 78.5881 264.677 78.9915C264.467 79.3892 264.359 79.8693 264.353 80.4318ZM293.458 74.9091L288.881 88H284.79L280.214 74.9091H284.049L286.768 84.2756H286.904L289.614 74.9091H293.458ZM303.711 82.4261V74.9091H307.342V88H303.856V85.6222H303.719C303.424 86.3892 302.933 87.0057 302.245 87.4716C301.563 87.9375 300.731 88.1705 299.748 88.1705C298.873 88.1705 298.103 87.9716 297.438 87.5739C296.773 87.1761 296.254 86.6108 295.879 85.8778C295.509 85.1449 295.322 84.267 295.316 83.2443V74.9091H298.947V82.5966C298.952 83.3693 299.16 83.9801 299.569 84.429C299.978 84.8778 300.526 85.1023 301.214 85.1023C301.651 85.1023 302.06 85.0028 302.441 84.804C302.822 84.5994 303.129 84.2983 303.362 83.9006C303.6 83.5028 303.717 83.0114 303.711 82.4261ZM301.879 92.9006C301.339 92.9006 300.876 92.7216 300.489 92.3636C300.103 92.0057 299.91 91.5739 299.91 91.0682C299.91 90.5625 300.103 90.1307 300.489 89.7727C300.876 89.4148 301.339 89.2358 301.879 89.2358C302.418 89.2358 302.879 89.4148 303.259 89.7727C303.646 90.1307 303.839 90.5625 303.839 91.0682C303.839 91.5739 303.646 92.0057 303.259 92.3636C302.879 92.7216 302.418 92.9006 301.879 92.9006ZM18.6918 122.256C17.3509 122.256 16.1974 121.972 15.2315 121.403C14.2713 120.83 13.5327 120.034 13.0156 119.017C12.5043 118 12.2486 116.83 12.2486 115.506C12.2486 114.165 12.5071 112.989 13.0241 111.977C13.5469 110.96 14.2884 110.168 15.2486 109.599C16.2088 109.026 17.3509 108.739 18.6747 108.739C19.8168 108.739 20.8168 108.946 21.6747 109.361C22.5327 109.776 23.2116 110.358 23.7116 111.108C24.2116 111.858 24.4872 112.739 24.5384 113.75H21.1122C21.0156 113.097 20.7599 112.571 20.3452 112.173C19.9361 111.77 19.3991 111.568 18.7344 111.568C18.1719 111.568 17.6804 111.722 17.2599 112.028C16.8452 112.33 16.5213 112.77 16.2884 113.349C16.0554 113.929 15.9389 114.631 15.9389 115.455C15.9389 116.29 16.0526 117 16.2798 117.585C16.5128 118.17 16.8395 118.616 17.2599 118.923C17.6804 119.23 18.1719 119.384 18.7344 119.384C19.1491 119.384 19.5213 119.298 19.8509 119.128C20.1861 118.957 20.4616 118.71 20.6776 118.386C20.8991 118.057 21.044 117.662 21.1122 117.202H24.5384C24.4815 118.202 24.2088 119.082 23.7202 119.844C23.2372 120.599 22.5696 121.19 21.7173 121.616C20.8651 122.043 19.8565 122.256 18.6918 122.256ZM35.2578 116.426V108.909H38.8885V122H35.4027V119.622H35.2663C34.9709 120.389 34.4794 121.006 33.7919 121.472C33.1101 121.937 32.2777 122.17 31.2947 122.17C30.4197 122.17 29.6499 121.972 28.9851 121.574C28.3203 121.176 27.8004 120.611 27.4254 119.878C27.0561 119.145 26.8686 118.267 26.8629 117.244V108.909H30.4936V116.597C30.4993 117.369 30.7067 117.98 31.1158 118.429C31.5249 118.878 32.0732 119.102 32.7607 119.102C33.1982 119.102 33.6072 119.003 33.9879 118.804C34.3686 118.599 34.6754 118.298 34.9084 117.901C35.147 117.503 35.2635 117.011 35.2578 116.426ZM34.2351 107.034H31.5419L31.3544 105.5C31.9567 105.472 32.3857 105.392 32.6413 105.261C32.897 105.125 33.022 104.946 33.0163 104.724C33.022 104.418 32.8601 104.21 32.5305 104.102C32.2067 103.994 31.8004 103.94 31.3118 103.94L31.4055 102.295C32.9226 102.295 34.076 102.5 34.8658 102.909C35.6612 103.318 36.0561 103.886 36.0504 104.614C36.0561 105.131 35.8686 105.523 35.4879 105.79C35.1129 106.051 34.6953 106.216 34.2351 106.284V107.034ZM45.5256 122.247C44.6903 122.247 43.946 122.102 43.2926 121.812C42.6392 121.517 42.1222 121.082 41.7415 120.509C41.3665 119.929 41.179 119.207 41.179 118.344C41.179 117.616 41.3125 117.006 41.5795 116.511C41.8466 116.017 42.2102 115.619 42.6705 115.318C43.1307 115.017 43.6534 114.79 44.2386 114.636C44.8295 114.483 45.4489 114.375 46.0966 114.312C46.858 114.233 47.4716 114.159 47.9375 114.091C48.4034 114.017 48.7415 113.909 48.9517 113.767C49.1619 113.625 49.267 113.415 49.267 113.136V113.085C49.267 112.545 49.0966 112.128 48.7557 111.832C48.4205 111.537 47.9432 111.389 47.3239 111.389C46.6705 111.389 46.1506 111.534 45.7642 111.824C45.3778 112.108 45.1222 112.466 44.9972 112.898L41.6392 112.625C41.8097 111.83 42.1449 111.142 42.6449 110.562C43.1449 109.977 43.7898 109.528 44.5795 109.216C45.375 108.898 46.2955 108.739 47.3409 108.739C48.0682 108.739 48.7642 108.824 49.429 108.994C50.0994 109.165 50.6932 109.429 51.2102 109.787C51.733 110.145 52.1449 110.605 52.446 111.168C52.7472 111.724 52.8977 112.392 52.8977 113.17V122H49.4545V120.185H49.3523C49.142 120.594 48.8608 120.955 48.5085 121.267C48.1562 121.574 47.733 121.815 47.2386 121.991C46.7443 122.162 46.1733 122.247 45.5256 122.247ZM46.5653 119.741C47.0994 119.741 47.571 119.636 47.9801 119.426C48.3892 119.21 48.7102 118.92 48.9432 118.557C49.1761 118.193 49.2926 117.781 49.2926 117.321V115.932C49.179 116.006 49.0227 116.074 48.8239 116.136C48.6307 116.193 48.4119 116.247 48.1676 116.298C47.9233 116.344 47.679 116.386 47.4347 116.426C47.1903 116.46 46.9688 116.491 46.7699 116.52C46.3438 116.582 45.9716 116.682 45.6534 116.818C45.3352 116.955 45.0881 117.139 44.9119 117.372C44.7358 117.599 44.6477 117.884 44.6477 118.224C44.6477 118.719 44.8267 119.097 45.1847 119.358C45.5483 119.614 46.0085 119.741 46.5653 119.741ZM67.1839 122.256C65.843 122.256 64.6896 121.972 63.7237 121.403C62.7635 120.83 62.0249 120.034 61.5078 119.017C60.9964 118 60.7408 116.83 60.7408 115.506C60.7408 114.165 60.9993 112.989 61.5163 111.977C62.0391 110.96 62.7805 110.168 63.7408 109.599C64.701 109.026 65.843 108.739 67.1669 108.739C68.3089 108.739 69.3089 108.946 70.1669 109.361C71.0249 109.776 71.7038 110.358 72.2038 111.108C72.7038 111.858 72.9794 112.739 73.0305 113.75H69.6044C69.5078 113.097 69.2521 112.571 68.8374 112.173C68.4283 111.77 67.8913 111.568 67.2266 111.568C66.6641 111.568 66.1726 111.722 65.7521 112.028C65.3374 112.33 65.0135 112.77 64.7805 113.349C64.5476 113.929 64.4311 114.631 64.4311 115.455C64.4311 116.29 64.5447 117 64.772 117.585C65.005 118.17 65.3317 118.616 65.7521 118.923C66.1726 119.23 66.6641 119.384 67.2266 119.384C67.6413 119.384 68.0135 119.298 68.343 119.128C68.6783 118.957 68.9538 118.71 69.1697 118.386C69.3913 118.057 69.5362 117.662 69.6044 117.202H73.0305C72.9737 118.202 72.701 119.082 72.2124 119.844C71.7294 120.599 71.0618 121.19 70.2095 121.616C69.3572 122.043 68.3487 122.256 67.1839 122.256ZM78.9858 114.432V122H75.3551V104.545H78.8835V111.219H79.0369C79.3324 110.446 79.8097 109.841 80.4688 109.403C81.1278 108.96 81.9545 108.739 82.9489 108.739C83.858 108.739 84.6506 108.938 85.3267 109.335C86.0085 109.727 86.5369 110.293 86.9119 111.031C87.2926 111.764 87.4801 112.642 87.4744 113.665V122H83.8438V114.312C83.8494 113.506 83.6449 112.878 83.2301 112.429C82.821 111.98 82.2472 111.756 81.5085 111.756C81.0142 111.756 80.5767 111.861 80.196 112.071C79.821 112.281 79.5256 112.588 79.3097 112.991C79.0994 113.389 78.9915 113.869 78.9858 114.432ZM98.7266 116.426V108.909H102.357V122H98.8714V119.622H98.7351C98.4396 120.389 97.9482 121.006 97.2607 121.472C96.5788 121.937 95.7464 122.17 94.7635 122.17C93.8885 122.17 93.1186 121.972 92.4538 121.574C91.7891 121.176 91.2692 120.611 90.8942 119.878C90.5249 119.145 90.3374 118.267 90.3317 117.244V108.909H93.9624V116.597C93.968 117.369 94.1754 117.98 94.5845 118.429C94.9936 118.878 95.5419 119.102 96.2294 119.102C96.6669 119.102 97.076 119.003 97.4567 118.804C97.8374 118.599 98.1442 118.298 98.3771 117.901C98.6158 117.503 98.7322 117.011 98.7266 116.426ZM95.0533 107.222L96.8601 103.344H100.218L97.6186 107.222H95.0533ZM108.892 114.432V122H105.261V108.909H108.722V111.219H108.875C109.165 110.457 109.651 109.855 110.332 109.412C111.014 108.963 111.841 108.739 112.812 108.739C113.722 108.739 114.514 108.938 115.19 109.335C115.866 109.733 116.392 110.301 116.767 111.04C117.142 111.773 117.33 112.648 117.33 113.665V122H113.699V114.312C113.705 113.511 113.5 112.886 113.085 112.438C112.67 111.983 112.099 111.756 111.372 111.756C110.884 111.756 110.452 111.861 110.077 112.071C109.707 112.281 109.418 112.588 109.207 112.991C109.003 113.389 108.898 113.869 108.892 114.432ZM126.089 127.182C124.913 127.182 123.904 127.02 123.063 126.696C122.228 126.378 121.563 125.943 121.069 125.392C120.575 124.841 120.254 124.222 120.106 123.534L123.464 123.082C123.566 123.344 123.728 123.588 123.95 123.815C124.171 124.043 124.464 124.224 124.827 124.361C125.197 124.503 125.646 124.574 126.174 124.574C126.964 124.574 127.614 124.381 128.126 123.994C128.643 123.614 128.901 122.974 128.901 122.077V119.682H128.748C128.589 120.045 128.35 120.389 128.032 120.713C127.714 121.037 127.305 121.301 126.805 121.506C126.305 121.71 125.708 121.812 125.015 121.812C124.032 121.812 123.137 121.585 122.33 121.131C121.529 120.67 120.89 119.969 120.413 119.026C119.941 118.077 119.705 116.878 119.705 115.429C119.705 113.946 119.947 112.707 120.43 111.713C120.913 110.719 121.555 109.974 122.356 109.48C123.163 108.986 124.046 108.739 125.006 108.739C125.739 108.739 126.353 108.864 126.847 109.114C127.342 109.358 127.739 109.665 128.04 110.034C128.347 110.398 128.583 110.756 128.748 111.108H128.884V108.909H132.489V122.128C132.489 123.241 132.217 124.173 131.671 124.923C131.126 125.673 130.37 126.236 129.404 126.611C128.444 126.991 127.339 127.182 126.089 127.182ZM126.165 119.085C126.751 119.085 127.245 118.94 127.648 118.651C128.058 118.355 128.37 117.935 128.586 117.389C128.808 116.838 128.918 116.179 128.918 115.412C128.918 114.645 128.81 113.98 128.594 113.418C128.379 112.849 128.066 112.409 127.657 112.097C127.248 111.784 126.751 111.628 126.165 111.628C125.569 111.628 125.066 111.79 124.657 112.114C124.248 112.432 123.938 112.875 123.728 113.443C123.518 114.011 123.413 114.668 123.413 115.412C123.413 116.168 123.518 116.821 123.728 117.372C123.944 117.918 124.254 118.341 124.657 118.642C125.066 118.937 125.569 119.085 126.165 119.085ZM147.896 108.909V111.636H140.013V108.909H147.896ZM141.803 105.773H145.433V117.977C145.433 118.312 145.484 118.574 145.587 118.761C145.689 118.943 145.831 119.071 146.013 119.145C146.2 119.219 146.416 119.256 146.661 119.256C146.831 119.256 147.001 119.241 147.172 119.213C147.342 119.179 147.473 119.153 147.564 119.136L148.135 121.838C147.953 121.895 147.697 121.96 147.368 122.034C147.038 122.114 146.638 122.162 146.166 122.179C145.291 122.213 144.524 122.097 143.865 121.83C143.212 121.562 142.703 121.148 142.339 120.585C141.976 120.023 141.797 119.312 141.803 118.455V105.773ZM156.036 122.256C154.712 122.256 153.567 121.974 152.601 121.412C151.641 120.844 150.899 120.054 150.376 119.043C149.854 118.026 149.592 116.847 149.592 115.506C149.592 114.153 149.854 112.972 150.376 111.96C150.899 110.943 151.641 110.153 152.601 109.591C153.567 109.023 154.712 108.739 156.036 108.739C157.359 108.739 158.501 109.023 159.462 109.591C160.428 110.153 161.172 110.943 161.695 111.96C162.217 112.972 162.479 114.153 162.479 115.506C162.479 116.847 162.217 118.026 161.695 119.043C161.172 120.054 160.428 120.844 159.462 121.412C158.501 121.974 157.359 122.256 156.036 122.256ZM156.053 119.443C156.655 119.443 157.158 119.273 157.561 118.932C157.964 118.585 158.268 118.114 158.473 117.517C158.683 116.92 158.788 116.241 158.788 115.48C158.788 114.719 158.683 114.04 158.473 113.443C158.268 112.847 157.964 112.375 157.561 112.028C157.158 111.682 156.655 111.509 156.053 111.509C155.445 111.509 154.933 111.682 154.518 112.028C154.109 112.375 153.8 112.847 153.589 113.443C153.385 114.04 153.283 114.719 153.283 115.48C153.283 116.241 153.385 116.92 153.589 117.517C153.8 118.114 154.109 118.585 154.518 118.932C154.933 119.273 155.445 119.443 156.053 119.443ZM157.749 107.341L156.036 105.261L154.322 107.341H151.229V107.222L154.68 103.472H157.382L160.842 107.222V107.341H157.749ZM164.839 122V108.909H168.47V122H164.839ZM166.663 107.222C166.124 107.222 165.661 107.043 165.274 106.685C164.893 106.321 164.703 105.886 164.703 105.381C164.703 104.881 164.893 104.452 165.274 104.094C165.661 103.73 166.124 103.548 166.663 103.548C167.203 103.548 167.663 103.73 168.044 104.094C168.43 104.452 168.624 104.881 168.624 105.381C168.624 105.886 168.43 106.321 168.044 106.685C167.663 107.043 167.203 107.222 166.663 107.222ZM180.564 114.432V122H176.933V108.909H180.393V111.219H180.547C180.837 110.457 181.322 109.855 182.004 109.412C182.686 108.963 183.513 108.739 184.484 108.739C185.393 108.739 186.186 108.938 186.862 109.335C187.538 109.733 188.064 110.301 188.439 111.04C188.814 111.773 189.001 112.648 189.001 113.665V122H185.371V114.312C185.376 113.511 185.172 112.886 184.757 112.438C184.342 111.983 183.771 111.756 183.044 111.756C182.555 111.756 182.124 111.861 181.749 112.071C181.379 112.281 181.089 112.588 180.879 112.991C180.675 113.389 180.57 113.869 180.564 114.432ZM197.761 127.182C196.585 127.182 195.576 127.02 194.735 126.696C193.9 126.378 193.235 125.943 192.741 125.392C192.246 124.841 191.925 124.222 191.778 123.534L195.136 123.082C195.238 123.344 195.4 123.588 195.621 123.815C195.843 124.043 196.136 124.224 196.499 124.361C196.869 124.503 197.317 124.574 197.846 124.574C198.636 124.574 199.286 124.381 199.798 123.994C200.315 123.614 200.573 122.974 200.573 122.077V119.682H200.42C200.261 120.045 200.022 120.389 199.704 120.713C199.386 121.037 198.977 121.301 198.477 121.506C197.977 121.71 197.38 121.812 196.687 121.812C195.704 121.812 194.809 121.585 194.002 121.131C193.201 120.67 192.562 119.969 192.085 119.026C191.613 118.077 191.377 116.878 191.377 115.429C191.377 113.946 191.619 112.707 192.102 111.713C192.585 110.719 193.227 109.974 194.028 109.48C194.835 108.986 195.718 108.739 196.678 108.739C197.411 108.739 198.025 108.864 198.519 109.114C199.013 109.358 199.411 109.665 199.712 110.034C200.019 110.398 200.255 110.756 200.42 111.108H200.556V108.909H204.161V122.128C204.161 123.241 203.888 124.173 203.343 124.923C202.798 125.673 202.042 126.236 201.076 126.611C200.116 126.991 199.011 127.182 197.761 127.182ZM197.837 119.085C198.423 119.085 198.917 118.94 199.32 118.651C199.729 118.355 200.042 117.935 200.258 117.389C200.479 116.838 200.59 116.179 200.59 115.412C200.59 114.645 200.482 113.98 200.266 113.418C200.05 112.849 199.738 112.409 199.329 112.097C198.92 111.784 198.423 111.628 197.837 111.628C197.241 111.628 196.738 111.79 196.329 112.114C195.92 112.432 195.61 112.875 195.4 113.443C195.19 114.011 195.085 114.668 195.085 115.412C195.085 116.168 195.19 116.821 195.4 117.372C195.616 117.918 195.925 118.341 196.329 118.642C196.738 118.937 197.241 119.085 197.837 119.085ZM210.783 122.247C209.948 122.247 209.204 122.102 208.55 121.812C207.897 121.517 207.38 121.082 206.999 120.509C206.624 119.929 206.437 119.207 206.437 118.344C206.437 117.616 206.57 117.006 206.837 116.511C207.104 116.017 207.468 115.619 207.928 115.318C208.388 115.017 208.911 114.79 209.496 114.636C210.087 114.483 210.707 114.375 211.354 114.312C212.116 114.233 212.729 114.159 213.195 114.091C213.661 114.017 213.999 113.909 214.21 113.767C214.42 113.625 214.525 113.415 214.525 113.136V113.085C214.525 112.545 214.354 112.128 214.013 111.832C213.678 111.537 213.201 111.389 212.582 111.389C211.928 111.389 211.408 111.534 211.022 111.824C210.636 112.108 210.38 112.466 210.255 112.898L206.897 112.625C207.067 111.83 207.403 111.142 207.903 110.562C208.403 109.977 209.048 109.528 209.837 109.216C210.633 108.898 211.553 108.739 212.599 108.739C213.326 108.739 214.022 108.824 214.687 108.994C215.357 109.165 215.951 109.429 216.468 109.787C216.991 110.145 217.403 110.605 217.704 111.168C218.005 111.724 218.156 112.392 218.156 113.17V122H214.712V120.185H214.61C214.4 120.594 214.119 120.955 213.766 121.267C213.414 121.574 212.991 121.815 212.496 121.991C212.002 122.162 211.431 122.247 210.783 122.247ZM211.823 119.741C212.357 119.741 212.829 119.636 213.238 119.426C213.647 119.21 213.968 118.92 214.201 118.557C214.434 118.193 214.55 117.781 214.55 117.321V115.932C214.437 116.006 214.281 116.074 214.082 116.136C213.888 116.193 213.67 116.247 213.425 116.298C213.181 116.344 212.937 116.386 212.692 116.426C212.448 116.46 212.227 116.491 212.028 116.52C211.602 116.582 211.229 116.682 210.911 116.818C210.593 116.955 210.346 117.139 210.17 117.372C209.994 117.599 209.906 117.884 209.906 118.224C209.906 118.719 210.085 119.097 210.442 119.358C210.806 119.614 211.266 119.741 211.823 119.741ZM222.745 126.909C222.285 126.909 221.853 126.872 221.45 126.798C221.052 126.73 220.722 126.642 220.461 126.534L221.279 123.824C221.705 123.955 222.089 124.026 222.43 124.037C222.776 124.048 223.075 123.969 223.325 123.798C223.58 123.628 223.788 123.338 223.947 122.929L224.16 122.375L219.464 108.909H223.282L225.992 118.523H226.129L228.864 108.909H232.708L227.62 123.415C227.376 124.119 227.043 124.733 226.623 125.256C226.208 125.784 225.683 126.19 225.046 126.474C224.41 126.764 223.643 126.909 222.745 126.909ZM240.189 122V104.545H243.82V111.108H243.93C244.089 110.756 244.32 110.398 244.621 110.034C244.928 109.665 245.325 109.358 245.814 109.114C246.308 108.864 246.922 108.739 247.655 108.739C248.609 108.739 249.49 108.989 250.297 109.489C251.104 109.983 251.749 110.73 252.232 111.73C252.714 112.724 252.956 113.972 252.956 115.472C252.956 116.932 252.72 118.165 252.249 119.17C251.783 120.17 251.146 120.929 250.339 121.446C249.538 121.957 248.641 122.213 247.646 122.213C246.942 122.213 246.342 122.097 245.848 121.864C245.359 121.631 244.959 121.338 244.646 120.986C244.334 120.628 244.095 120.267 243.93 119.903H243.768V122H240.189ZM243.743 115.455C243.743 116.233 243.851 116.912 244.067 117.491C244.283 118.071 244.595 118.523 245.004 118.847C245.413 119.165 245.911 119.324 246.496 119.324C247.087 119.324 247.587 119.162 247.996 118.838C248.405 118.509 248.714 118.054 248.925 117.474C249.141 116.889 249.249 116.216 249.249 115.455C249.249 114.699 249.143 114.034 248.933 113.46C248.723 112.886 248.413 112.437 248.004 112.114C247.595 111.79 247.092 111.628 246.496 111.628C245.905 111.628 245.405 111.784 244.996 112.097C244.592 112.409 244.283 112.852 244.067 113.426C243.851 114 243.743 114.676 243.743 115.455ZM259.112 122.247C258.276 122.247 257.532 122.102 256.879 121.812C256.225 121.517 255.708 121.082 255.327 120.509C254.952 119.929 254.765 119.207 254.765 118.344C254.765 117.616 254.898 117.006 255.165 116.511C255.433 116.017 255.796 115.619 256.256 115.318C256.717 115.017 257.239 114.79 257.825 114.636C258.415 114.483 259.035 114.375 259.683 114.312C260.444 114.233 261.058 114.159 261.523 114.091C261.989 114.017 262.327 113.909 262.538 113.767C262.748 113.625 262.853 113.415 262.853 113.136V113.085C262.853 112.545 262.683 112.128 262.342 111.832C262.006 111.537 261.529 111.389 260.91 111.389C260.256 111.389 259.737 111.534 259.35 111.824C258.964 112.108 258.708 112.466 258.583 112.898L255.225 112.625C255.396 111.83 255.731 111.142 256.231 110.562C256.731 109.977 257.376 109.528 258.165 109.216C258.961 108.898 259.881 108.739 260.927 108.739C261.654 108.739 262.35 108.824 263.015 108.994C263.685 109.165 264.279 109.429 264.796 109.787C265.319 110.145 265.731 110.605 266.032 111.168C266.333 111.724 266.484 112.392 266.484 113.17V122H263.04V120.185H262.938C262.728 120.594 262.447 120.955 262.094 121.267C261.742 121.574 261.319 121.815 260.825 121.991C260.33 122.162 259.759 122.247 259.112 122.247ZM260.151 119.741C260.685 119.741 261.157 119.636 261.566 119.426C261.975 119.21 262.296 118.92 262.529 118.557C262.762 118.193 262.879 117.781 262.879 117.321V115.932C262.765 116.006 262.609 116.074 262.41 116.136C262.217 116.193 261.998 116.247 261.754 116.298C261.509 116.344 261.265 116.386 261.021 116.426C260.776 116.46 260.555 116.491 260.356 116.52C259.93 116.582 259.558 116.682 259.239 116.818C258.921 116.955 258.674 117.139 258.498 117.372C258.322 117.599 258.234 117.884 258.234 118.224C258.234 118.719 258.413 119.097 258.771 119.358C259.134 119.614 259.594 119.741 260.151 119.741ZM262.776 107.341L261.063 105.261L259.35 107.341H256.256V107.222L259.708 103.472H262.41L265.87 107.222V107.341H262.776ZM271.073 126.909C270.613 126.909 270.181 126.872 269.778 126.798C269.38 126.73 269.05 126.642 268.789 126.534L269.607 123.824C270.033 123.955 270.417 124.026 270.758 124.037C271.104 124.048 271.403 123.969 271.653 123.798C271.908 123.628 272.116 123.338 272.275 122.929L272.488 122.375L267.792 108.909H271.61L274.32 118.523H274.457L277.192 108.909H281.036L275.948 123.415C275.704 124.119 275.371 124.733 274.951 125.256C274.536 125.784 274.011 126.19 273.374 126.474C272.738 126.764 271.971 126.909 271.073 126.909ZM294.347 127.182C293.17 127.182 292.162 127.02 291.321 126.696C290.486 126.378 289.821 125.943 289.327 125.392C288.832 124.841 288.511 124.222 288.364 123.534L291.722 123.082C291.824 123.344 291.986 123.588 292.207 123.815C292.429 124.043 292.722 124.224 293.085 124.361C293.455 124.503 293.903 124.574 294.432 124.574C295.222 124.574 295.872 124.381 296.384 123.994C296.901 123.614 297.159 122.974 297.159 122.077V119.682H297.006C296.847 120.045 296.608 120.389 296.29 120.713C295.972 121.037 295.562 121.301 295.062 121.506C294.562 121.71 293.966 121.812 293.273 121.812C292.29 121.812 291.395 121.585 290.588 121.131C289.787 120.67 289.148 119.969 288.67 119.026C288.199 118.077 287.963 116.878 287.963 115.429C287.963 113.946 288.205 112.707 288.688 111.713C289.17 110.719 289.813 109.974 290.614 109.48C291.42 108.986 292.304 108.739 293.264 108.739C293.997 108.739 294.611 108.864 295.105 109.114C295.599 109.358 295.997 109.665 296.298 110.034C296.605 110.398 296.841 110.756 297.006 111.108H297.142V108.909H300.747V122.128C300.747 123.241 300.474 124.173 299.929 124.923C299.384 125.673 298.628 126.236 297.662 126.611C296.702 126.991 295.597 127.182 294.347 127.182ZM294.423 119.085C295.009 119.085 295.503 118.94 295.906 118.651C296.315 118.355 296.628 117.935 296.844 117.389C297.065 116.838 297.176 116.179 297.176 115.412C297.176 114.645 297.068 113.98 296.852 113.418C296.636 112.849 296.324 112.409 295.915 112.097C295.506 111.784 295.009 111.628 294.423 111.628C293.827 111.628 293.324 111.79 292.915 112.114C292.506 112.432 292.196 112.875 291.986 113.443C291.776 114.011 291.67 114.668 291.67 115.412C291.67 116.168 291.776 116.821 291.986 117.372C292.202 117.918 292.511 118.341 292.915 118.642C293.324 118.937 293.827 119.085 294.423 119.085ZM303.636 122V108.909H307.267V122H303.636ZM305.46 107.222C304.92 107.222 304.457 107.043 304.071 106.685C303.69 106.321 303.5 105.886 303.5 105.381C303.5 104.881 303.69 104.452 304.071 104.094C304.457 103.73 304.92 103.548 305.46 103.548C306 103.548 306.46 103.73 306.841 104.094C307.227 104.452 307.42 104.881 307.42 105.381C307.42 105.886 307.227 106.321 306.841 106.685C306.46 107.043 306 107.222 305.46 107.222ZM321.732 108.142H323.897C323.897 109.585 323.553 110.71 322.866 111.517C322.178 112.318 321.073 112.719 319.55 112.719V111.27C320.153 111.27 320.61 111.145 320.923 110.895C321.235 110.639 321.448 110.278 321.562 109.812C321.675 109.347 321.732 108.79 321.732 108.142ZM316.09 122.256C314.766 122.256 313.621 121.974 312.656 121.412C311.695 120.844 310.954 120.054 310.431 119.043C309.908 118.026 309.647 116.847 309.647 115.506C309.647 114.153 309.908 112.972 310.431 111.96C310.954 110.943 311.695 110.153 312.656 109.591C313.621 109.023 314.766 108.739 316.09 108.739C317.414 108.739 318.556 109.023 319.516 109.591C320.482 110.153 321.227 110.943 321.749 111.96C322.272 112.972 322.533 114.153 322.533 115.506C322.533 116.847 322.272 118.026 321.749 119.043C321.227 120.054 320.482 120.844 319.516 121.412C318.556 121.974 317.414 122.256 316.09 122.256ZM316.107 119.443C316.71 119.443 317.212 119.273 317.616 118.932C318.019 118.585 318.323 118.114 318.528 117.517C318.738 116.92 318.843 116.241 318.843 115.48C318.843 114.719 318.738 114.04 318.528 113.443C318.323 112.847 318.019 112.375 317.616 112.028C317.212 111.682 316.71 111.509 316.107 111.509C315.499 111.509 314.988 111.682 314.573 112.028C314.164 112.375 313.854 112.847 313.644 113.443C313.44 114.04 313.337 114.719 313.337 115.48C313.337 116.241 313.44 116.92 313.644 117.517C313.854 118.114 314.164 118.585 314.573 118.932C314.988 119.273 315.499 119.443 316.107 119.443ZM314.829 107.222L312.229 103.344H315.579L317.394 107.222H314.829ZM329.678 104.545L329.345 116.767H326.226L325.885 104.545H329.678ZM327.786 122.222C327.223 122.222 326.74 122.023 326.337 121.625C325.933 121.222 325.734 120.739 325.74 120.176C325.734 119.619 325.933 119.142 326.337 118.744C326.74 118.347 327.223 118.148 327.786 118.148C328.325 118.148 328.8 118.347 329.209 118.744C329.618 119.142 329.825 119.619 329.831 120.176C329.825 120.551 329.726 120.895 329.533 121.207C329.345 121.514 329.098 121.761 328.791 121.949C328.484 122.131 328.149 122.222 327.786 122.222Z" fill="white"/>
        <rect x="67" y="162" width="209" height="48" rx="24" fill="url(#paint26_linear_115_1314)"/>
        <path d="M92.0739 182.131V180.364H101.358V182.131H97.7614V192H95.6705V182.131H92.0739ZM102.151 192V183.273H104.145V184.727H104.236C104.395 184.223 104.668 183.835 105.054 183.562C105.444 183.286 105.889 183.148 106.389 183.148C106.503 183.148 106.63 183.153 106.77 183.165C106.914 183.172 107.033 183.186 107.128 183.205V185.097C107.041 185.066 106.902 185.04 106.713 185.017C106.527 184.991 106.348 184.977 106.173 184.977C105.798 184.977 105.461 185.059 105.162 185.222C104.866 185.381 104.634 185.602 104.463 185.886C104.293 186.17 104.207 186.498 104.207 186.869V192H102.151ZM110.849 192.176C110.296 192.176 109.798 192.078 109.355 191.881C108.916 191.68 108.567 191.384 108.31 190.994C108.056 190.604 107.929 190.123 107.929 189.551C107.929 189.059 108.02 188.652 108.202 188.33C108.384 188.008 108.632 187.75 108.946 187.557C109.26 187.364 109.615 187.218 110.009 187.119C110.406 187.017 110.817 186.943 111.241 186.898C111.753 186.845 112.168 186.797 112.486 186.756C112.804 186.71 113.035 186.642 113.179 186.551C113.327 186.456 113.401 186.311 113.401 186.114V186.08C113.401 185.652 113.274 185.32 113.02 185.085C112.766 184.85 112.401 184.733 111.923 184.733C111.42 184.733 111.02 184.843 110.724 185.062C110.433 185.282 110.236 185.542 110.134 185.841L108.213 185.568C108.365 185.038 108.615 184.595 108.963 184.239C109.312 183.879 109.738 183.61 110.241 183.432C110.745 183.25 111.302 183.159 111.912 183.159C112.332 183.159 112.751 183.208 113.168 183.307C113.584 183.405 113.965 183.568 114.31 183.795C114.654 184.019 114.931 184.324 115.139 184.71C115.351 185.097 115.457 185.58 115.457 186.159V192H113.48V190.801H113.412C113.287 191.044 113.111 191.271 112.884 191.483C112.66 191.691 112.378 191.86 112.037 191.989C111.7 192.114 111.304 192.176 110.849 192.176ZM111.384 190.665C111.796 190.665 112.154 190.583 112.457 190.42C112.76 190.254 112.993 190.034 113.156 189.761C113.323 189.489 113.406 189.191 113.406 188.869V187.841C113.342 187.894 113.232 187.943 113.077 187.989C112.925 188.034 112.755 188.074 112.565 188.108C112.376 188.142 112.188 188.172 112.003 188.199C111.817 188.225 111.656 188.248 111.52 188.267C111.213 188.309 110.938 188.377 110.696 188.472C110.454 188.566 110.262 188.699 110.122 188.869C109.982 189.036 109.912 189.252 109.912 189.517C109.912 189.896 110.05 190.182 110.327 190.375C110.603 190.568 110.955 190.665 111.384 190.665ZM112.793 182.045H111.224L111.145 180.955C111.546 180.939 111.83 180.888 111.997 180.801C112.164 180.71 112.245 180.585 112.241 180.426C112.245 180.222 112.135 180.08 111.912 180C111.688 179.92 111.412 179.881 111.082 179.881L111.134 178.864C112.073 178.864 112.785 179 113.27 179.273C113.755 179.545 113.995 179.917 113.991 180.386C113.995 180.746 113.872 181.015 113.622 181.193C113.372 181.367 113.096 181.477 112.793 181.523V182.045ZM117.526 192V183.273H119.582V192H117.526ZM118.56 182.034C118.234 182.034 117.954 181.926 117.719 181.71C117.484 181.491 117.366 181.227 117.366 180.92C117.366 180.61 117.484 180.347 117.719 180.131C117.954 179.911 118.234 179.801 118.56 179.801C118.889 179.801 119.17 179.911 119.401 180.131C119.635 180.347 119.753 180.61 119.753 180.92C119.753 181.227 119.635 181.491 119.401 181.71C119.17 181.926 118.889 182.034 118.56 182.034ZM127.723 186.886V192H125.666V183.273H127.632V184.756H127.734C127.935 184.267 128.255 183.879 128.695 183.591C129.138 183.303 129.685 183.159 130.337 183.159C130.939 183.159 131.464 183.288 131.911 183.545C132.361 183.803 132.71 184.176 132.956 184.665C133.206 185.153 133.329 185.746 133.325 186.443V192H131.268V186.761C131.268 186.178 131.117 185.722 130.814 185.392C130.515 185.062 130.1 184.898 129.57 184.898C129.21 184.898 128.89 184.977 128.609 185.136C128.333 185.292 128.115 185.517 127.956 185.812C127.801 186.108 127.723 186.466 127.723 186.886ZM139.212 195.455C138.473 195.455 137.839 195.354 137.308 195.153C136.778 194.956 136.352 194.691 136.03 194.358C135.708 194.025 135.484 193.655 135.359 193.25L137.212 192.801C137.295 192.972 137.416 193.14 137.575 193.307C137.734 193.477 137.948 193.617 138.217 193.727C138.49 193.841 138.833 193.898 139.246 193.898C139.829 193.898 140.312 193.756 140.695 193.472C141.077 193.191 141.268 192.729 141.268 192.085V190.432H141.166C141.06 190.644 140.905 190.862 140.7 191.085C140.5 191.309 140.232 191.496 139.899 191.648C139.57 191.799 139.155 191.875 138.655 191.875C137.984 191.875 137.376 191.718 136.831 191.403C136.289 191.085 135.857 190.612 135.536 189.983C135.217 189.35 135.058 188.559 135.058 187.608C135.058 186.65 135.217 185.841 135.536 185.182C135.857 184.519 136.291 184.017 136.837 183.676C137.382 183.331 137.99 183.159 138.661 183.159C139.172 183.159 139.592 183.246 139.922 183.42C140.255 183.591 140.52 183.797 140.717 184.04C140.914 184.278 141.064 184.504 141.166 184.716H141.28V183.273H143.308V192.142C143.308 192.888 143.13 193.506 142.774 193.994C142.418 194.483 141.931 194.848 141.314 195.091C140.696 195.333 139.996 195.455 139.212 195.455ZM139.229 190.261C139.664 190.261 140.036 190.155 140.342 189.943C140.649 189.731 140.882 189.426 141.041 189.028C141.2 188.631 141.28 188.153 141.28 187.597C141.28 187.047 141.2 186.566 141.041 186.153C140.886 185.741 140.655 185.42 140.348 185.193C140.045 184.962 139.672 184.847 139.229 184.847C138.77 184.847 138.388 184.966 138.081 185.205C137.774 185.443 137.543 185.771 137.388 186.188C137.232 186.6 137.155 187.07 137.155 187.597C137.155 188.131 137.232 188.598 137.388 189C137.547 189.398 137.78 189.708 138.087 189.932C138.397 190.152 138.778 190.261 139.229 190.261ZM147.473 186.886V192H145.416V180.364H147.428V184.756H147.53C147.734 184.263 148.051 183.875 148.479 183.591C148.911 183.303 149.46 183.159 150.126 183.159C150.732 183.159 151.261 183.286 151.712 183.54C152.162 183.794 152.511 184.165 152.757 184.653C153.007 185.142 153.132 185.739 153.132 186.443V192H151.075V186.761C151.075 186.174 150.924 185.718 150.621 185.392C150.321 185.062 149.901 184.898 149.359 184.898C148.996 184.898 148.67 184.977 148.382 185.136C148.098 185.292 147.875 185.517 147.712 185.812C147.553 186.108 147.473 186.466 147.473 186.886ZM155.229 192V183.273H157.286V192H155.229ZM156.263 182.034C155.937 182.034 155.657 181.926 155.422 181.71C155.187 181.491 155.07 181.227 155.07 180.92C155.07 180.61 155.187 180.347 155.422 180.131C155.657 179.911 155.937 179.801 156.263 179.801C156.592 179.801 156.873 179.911 157.104 180.131C157.339 180.347 157.456 180.61 157.456 180.92C157.456 181.227 157.339 181.491 157.104 181.71C156.873 181.926 156.592 182.034 156.263 182.034ZM163.264 192.17C162.389 192.17 161.634 191.989 160.997 191.625C160.365 191.258 159.878 190.739 159.537 190.068C159.196 189.394 159.026 188.6 159.026 187.688C159.026 186.79 159.196 186.002 159.537 185.324C159.882 184.642 160.363 184.112 160.98 183.733C161.598 183.35 162.323 183.159 163.156 183.159C163.694 183.159 164.202 183.246 164.679 183.42C165.16 183.591 165.584 183.856 165.952 184.216C166.323 184.576 166.615 185.034 166.827 185.591C167.039 186.144 167.145 186.803 167.145 187.568V188.199H159.991V186.812H165.173C165.17 186.419 165.084 186.068 164.918 185.761C164.751 185.451 164.518 185.206 164.219 185.028C163.923 184.85 163.579 184.761 163.185 184.761C162.764 184.761 162.395 184.864 162.077 185.068C161.759 185.269 161.51 185.534 161.332 185.864C161.158 186.189 161.069 186.547 161.065 186.938V188.148C161.065 188.655 161.158 189.091 161.344 189.455C161.529 189.814 161.789 190.091 162.122 190.284C162.455 190.473 162.846 190.568 163.293 190.568C163.592 190.568 163.863 190.527 164.105 190.443C164.348 190.356 164.558 190.229 164.736 190.062C164.914 189.896 165.048 189.689 165.139 189.443L167.06 189.659C166.938 190.167 166.707 190.61 166.366 190.989C166.029 191.364 165.598 191.655 165.071 191.864C164.545 192.068 163.942 192.17 163.264 192.17ZM164.253 182.227L163.099 180.773L161.946 182.227H160.145V182.148L162.298 179.693H163.906L166.054 182.148V182.227H164.253ZM163.099 195.142C162.77 195.142 162.488 195.032 162.253 194.812C162.022 194.593 161.906 194.33 161.906 194.023C161.906 193.716 162.022 193.453 162.253 193.233C162.488 193.013 162.768 192.903 163.094 192.903C163.423 192.903 163.704 193.013 163.935 193.233C164.17 193.453 164.287 193.716 164.287 194.023C164.287 194.33 164.17 194.593 163.935 194.812C163.704 195.032 163.425 195.142 163.099 195.142ZM168.885 192V183.273H170.851V184.756H170.953C171.135 184.256 171.436 183.866 171.857 183.585C172.277 183.301 172.779 183.159 173.362 183.159C173.953 183.159 174.451 183.303 174.857 183.591C175.266 183.875 175.554 184.263 175.72 184.756H175.811C176.004 184.271 176.33 183.884 176.788 183.597C177.25 183.305 177.798 183.159 178.43 183.159C179.233 183.159 179.889 183.413 180.396 183.92C180.904 184.428 181.158 185.169 181.158 186.142V192H179.095V186.46C179.095 185.919 178.951 185.523 178.663 185.273C178.375 185.019 178.023 184.892 177.607 184.892C177.11 184.892 176.722 185.047 176.442 185.358C176.165 185.665 176.027 186.064 176.027 186.557V192H174.01V186.375C174.01 185.924 173.874 185.564 173.601 185.295C173.332 185.027 172.98 184.892 172.544 184.892C172.249 184.892 171.98 184.968 171.737 185.119C171.495 185.267 171.302 185.477 171.158 185.75C171.014 186.019 170.942 186.333 170.942 186.693V192H168.885ZM189.27 186.886V192H187.213V183.273H189.179V184.756H189.281C189.482 184.267 189.802 183.879 190.241 183.591C190.685 183.303 191.232 183.159 191.884 183.159C192.486 183.159 193.01 183.288 193.457 183.545C193.908 183.803 194.257 184.176 194.503 184.665C194.753 185.153 194.876 185.746 194.872 186.443V192H192.815V186.761C192.815 186.178 192.664 185.722 192.361 185.392C192.062 185.062 191.647 184.898 191.116 184.898C190.757 184.898 190.437 184.977 190.156 185.136C189.88 185.292 189.662 185.517 189.503 185.812C189.348 186.108 189.27 186.466 189.27 186.886ZM200.759 195.455C200.02 195.455 199.385 195.354 198.855 195.153C198.325 194.956 197.899 194.691 197.577 194.358C197.255 194.025 197.031 193.655 196.906 193.25L198.759 192.801C198.842 192.972 198.963 193.14 199.122 193.307C199.281 193.477 199.495 193.617 199.764 193.727C200.037 193.841 200.38 193.898 200.793 193.898C201.376 193.898 201.859 193.756 202.241 193.472C202.624 193.191 202.815 192.729 202.815 192.085V190.432H202.713C202.607 190.644 202.452 190.862 202.247 191.085C202.046 191.309 201.779 191.496 201.446 191.648C201.116 191.799 200.702 191.875 200.202 191.875C199.531 191.875 198.923 191.718 198.378 191.403C197.836 191.085 197.404 190.612 197.082 189.983C196.764 189.35 196.605 188.559 196.605 187.608C196.605 186.65 196.764 185.841 197.082 185.182C197.404 184.519 197.838 184.017 198.384 183.676C198.929 183.331 199.537 183.159 200.207 183.159C200.719 183.159 201.139 183.246 201.469 183.42C201.802 183.591 202.067 183.797 202.264 184.04C202.461 184.278 202.611 184.504 202.713 184.716H202.827V183.273H204.855V192.142C204.855 192.888 204.677 193.506 204.321 193.994C203.965 194.483 203.478 194.848 202.861 195.091C202.243 195.333 201.543 195.455 200.759 195.455ZM200.776 190.261C201.211 190.261 201.582 190.155 201.889 189.943C202.196 189.731 202.429 189.426 202.588 189.028C202.747 188.631 202.827 188.153 202.827 187.597C202.827 187.047 202.747 186.566 202.588 186.153C202.433 185.741 202.202 185.42 201.895 185.193C201.592 184.962 201.219 184.847 200.776 184.847C200.317 184.847 199.935 184.966 199.628 185.205C199.321 185.443 199.09 185.771 198.935 186.188C198.779 186.6 198.702 187.07 198.702 187.597C198.702 188.131 198.779 188.598 198.935 189C199.094 189.398 199.327 189.708 199.634 189.932C199.944 190.152 200.325 190.261 200.776 190.261ZM209.474 192.176C208.921 192.176 208.423 192.078 207.98 191.881C207.541 191.68 207.192 191.384 206.935 190.994C206.681 190.604 206.554 190.123 206.554 189.551C206.554 189.059 206.645 188.652 206.827 188.33C207.009 188.008 207.257 187.75 207.571 187.557C207.885 187.364 208.24 187.218 208.634 187.119C209.031 187.017 209.442 186.943 209.866 186.898C210.378 186.845 210.793 186.797 211.111 186.756C211.429 186.71 211.66 186.642 211.804 186.551C211.952 186.456 212.026 186.311 212.026 186.114V186.08C212.026 185.652 211.899 185.32 211.645 185.085C211.391 184.85 211.026 184.733 210.548 184.733C210.045 184.733 209.645 184.843 209.349 185.062C209.058 185.282 208.861 185.542 208.759 185.841L206.838 185.568C206.99 185.038 207.24 184.595 207.588 184.239C207.937 183.879 208.363 183.61 208.866 183.432C209.37 183.25 209.927 183.159 210.537 183.159C210.957 183.159 211.376 183.208 211.793 183.307C212.209 183.405 212.59 183.568 212.935 183.795C213.279 184.019 213.556 184.324 213.764 184.71C213.976 185.097 214.082 185.58 214.082 186.159V192H212.105V190.801H212.037C211.912 191.044 211.736 191.271 211.509 191.483C211.285 191.691 211.003 191.86 210.662 191.989C210.325 192.114 209.929 192.176 209.474 192.176ZM210.009 190.665C210.421 190.665 210.779 190.583 211.082 190.42C211.385 190.254 211.618 190.034 211.781 189.761C211.948 189.489 212.031 189.191 212.031 188.869V187.841C211.967 187.894 211.857 187.943 211.702 187.989C211.55 188.034 211.38 188.074 211.19 188.108C211.001 188.142 210.813 188.172 210.628 188.199C210.442 188.225 210.281 188.248 210.145 188.267C209.838 188.309 209.563 188.377 209.321 188.472C209.079 188.566 208.887 188.699 208.747 188.869C208.607 189.036 208.537 189.252 208.537 189.517C208.537 189.896 208.675 190.182 208.952 190.375C209.228 190.568 209.58 190.665 210.009 190.665ZM217.116 195.273C216.836 195.273 216.577 195.25 216.338 195.205C216.103 195.163 215.916 195.114 215.776 195.057L216.253 193.455C216.552 193.542 216.819 193.583 217.054 193.58C217.289 193.576 217.495 193.502 217.673 193.358C217.855 193.218 218.009 192.983 218.134 192.653L218.31 192.182L215.145 183.273H217.327L219.338 189.864H219.429L221.446 183.273H223.634L220.139 193.057C219.976 193.519 219.76 193.915 219.491 194.244C219.223 194.578 218.893 194.831 218.503 195.006C218.116 195.184 217.654 195.273 217.116 195.273Z" fill="#131517"/>
        <path d="M245.62 181.953L249.667 186L245.62 190.047" stroke="#131517" stroke-width="1.5" stroke-miterlimit="10" stroke-linecap="round" stroke-linejoin="round"/>
        <path d="M238.333 186H249.553" stroke="#131517" stroke-width="1.5" stroke-miterlimit="10" stroke-linecap="round" stroke-linejoin="round"/>
    </g>
    <defs>
        <linearGradient id="paint0_linear_115_1314" x1="100.378" y1="0" x2="100.378" y2="275.319" gradientUnits="userSpaceOnUse">
            <stop stop-color="white" stop-opacity="0"/>
            <stop offset="0.53125" stop-color="white"/>
            <stop offset="1" stop-color="white" stop-opacity="0"/>
        </linearGradient>
        <linearGradient id="paint1_linear_115_1314" x1="146.684" y1="0" x2="146.684" y2="275.319" gradientUnits="userSpaceOnUse">
            <stop stop-color="white" stop-opacity="0"/>
            <stop offset="0.53125" stop-color="white"/>
            <stop offset="1" stop-color="white" stop-opacity="0"/>
        </linearGradient>
        <linearGradient id="paint2_linear_115_1314" x1="192.676" y1="0" x2="192.676" y2="275.319" gradientUnits="userSpaceOnUse">
            <stop stop-color="white" stop-opacity="0"/>
            <stop offset="0.53125" stop-color="white"/>
            <stop offset="1" stop-color="white" stop-opacity="0"/>
        </linearGradient>
        <linearGradient id="paint3_linear_115_1314" x1="238.982" y1="0" x2="238.982" y2="275.319" gradientUnits="userSpaceOnUse">
            <stop stop-color="white" stop-opacity="0"/>
            <stop offset="0.53125" stop-color="white"/>
            <stop offset="1" stop-color="white" stop-opacity="0"/>
        </linearGradient>
        <linearGradient id="paint4_linear_115_1314" x1="395.987" y1="33.576" x2="43.1758" y2="33.576" gradientUnits="userSpaceOnUse">
            <stop stop-color="white" stop-opacity="0"/>
            <stop offset="0.53125" stop-color="white"/>
            <stop offset="1" stop-color="white" stop-opacity="0"/>
        </linearGradient>
        <linearGradient id="paint5_linear_115_1314" x1="395.987" y1="96.578" x2="43.1758" y2="96.578" gradientUnits="userSpaceOnUse">
            <stop stop-color="white" stop-opacity="0"/>
            <stop offset="0.53125" stop-color="white"/>
            <stop offset="1" stop-color="white" stop-opacity="0"/>
        </linearGradient>
        <linearGradient id="paint6_linear_115_1314" x1="395.987" y1="159.58" x2="43.1758" y2="159.58" gradientUnits="userSpaceOnUse">
            <stop stop-color="white" stop-opacity="0"/>
            <stop offset="0.53125" stop-color="white"/>
            <stop offset="1" stop-color="white" stop-opacity="0"/>
        </linearGradient>
        <linearGradient id="paint7_linear_115_1314" x1="395.987" y1="222.582" x2="43.1758" y2="222.582" gradientUnits="userSpaceOnUse">
            <stop stop-color="white" stop-opacity="0"/>
            <stop offset="0.53125" stop-color="white"/>
            <stop offset="1" stop-color="white" stop-opacity="0"/>
        </linearGradient>
        <linearGradient id="paint8_linear_115_1314" x1="115.313" y1="95.763" x2="103.028" y2="85.3677" gradientUnits="userSpaceOnUse">
            <stop stop-color="white" stop-opacity="0.22"/>
            <stop offset="1" stop-color="white" stop-opacity="0"/>
        </linearGradient>
        <linearGradient id="paint9_linear_115_1314" x1="115.313" y1="95.763" x2="101.768" y2="83.1626" gradientUnits="userSpaceOnUse">
            <stop stop-color="white" stop-opacity="0.62"/>
            <stop offset="1" stop-color="white" stop-opacity="0"/>
        </linearGradient>
        <linearGradient id="paint10_linear_115_1314" x1="115.313" y1="287.919" x2="103.028" y2="277.524" gradientUnits="userSpaceOnUse">
            <stop stop-color="white" stop-opacity="0.22"/>
            <stop offset="1" stop-color="white" stop-opacity="0"/>
        </linearGradient>
        <linearGradient id="paint11_linear_115_1314" x1="115.313" y1="287.919" x2="101.768" y2="275.319" gradientUnits="userSpaceOnUse">
            <stop stop-color="white" stop-opacity="0.62"/>
            <stop offset="1" stop-color="white" stop-opacity="0"/>
        </linearGradient>
        <linearGradient id="paint12_linear_115_1314" x1="304.004" y1="287.604" x2="291.719" y2="277.209" gradientUnits="userSpaceOnUse">
            <stop stop-color="white" stop-opacity="0.22"/>
            <stop offset="1" stop-color="white" stop-opacity="0"/>
        </linearGradient>
        <linearGradient id="paint13_linear_115_1314" x1="304.004" y1="287.604" x2="290.459" y2="275.004" gradientUnits="userSpaceOnUse">
            <stop stop-color="white" stop-opacity="0.62"/>
            <stop offset="1" stop-color="white" stop-opacity="0"/>
        </linearGradient>
        <linearGradient id="paint14_linear_115_1314" x1="304.004" y1="96.0781" x2="291.719" y2="85.6827" gradientUnits="userSpaceOnUse">
            <stop stop-color="white" stop-opacity="0.22"/>
            <stop offset="1" stop-color="white" stop-opacity="0"/>
        </linearGradient>
        <linearGradient id="paint15_linear_115_1314" x1="304.004" y1="96.0781" x2="290.459" y2="83.4777" gradientUnits="userSpaceOnUse">
            <stop stop-color="white" stop-opacity="0.62"/>
            <stop offset="1" stop-color="white" stop-opacity="0"/>
        </linearGradient>
        <linearGradient id="paint16_linear_115_1314" x1="131.688" y1="207.152" x2="135.243" y2="207.024" gradientUnits="userSpaceOnUse">
            <stop stop-color="#DEFEFF"/>
            <stop offset="0.510417" stop-color="#2EE4FF"/>
            <stop offset="1" stop-color="#A2FF00"/>
        </linearGradient>
        <linearGradient id="paint17_linear_115_1314" x1="92.0854" y1="144.945" x2="93.863" y2="144.881" gradientUnits="userSpaceOnUse">
            <stop stop-color="#DEFEFF"/>
            <stop offset="0.510417" stop-color="#2EE4FF"/>
            <stop offset="1" stop-color="#A2FF00"/>
        </linearGradient>
        <linearGradient id="paint18_linear_115_1314" x1="63.6072" y1="26.1377" x2="65.3847" y2="26.0735" gradientUnits="userSpaceOnUse">
            <stop stop-color="#DEFEFF"/>
            <stop offset="0.510417" stop-color="#2EE4FF"/>
            <stop offset="1" stop-color="#A2FF00"/>
        </linearGradient>
        <linearGradient id="paint19_linear_115_1314" x1="129.908" y1="34.1472" x2="131.686" y2="34.0831" gradientUnits="userSpaceOnUse">
            <stop stop-color="#DEFEFF"/>
            <stop offset="0.510417" stop-color="#2EE4FF"/>
            <stop offset="1" stop-color="#A2FF00"/>
        </linearGradient>
        <linearGradient id="paint20_linear_115_1314" x1="249.16" y1="134.711" x2="250.938" y2="134.647" gradientUnits="userSpaceOnUse">
            <stop stop-color="#DEFEFF"/>
            <stop offset="0.510417" stop-color="#2EE4FF"/>
            <stop offset="1" stop-color="#A2FF00"/>
        </linearGradient>
        <linearGradient id="paint21_linear_115_1314" x1="56.4878" y1="155.803" x2="63.5981" y2="155.546" gradientUnits="userSpaceOnUse">
            <stop stop-color="#DEFEFF"/>
            <stop offset="0.510417" stop-color="#2EE4FF"/>
            <stop offset="1" stop-color="#A2FF00"/>
        </linearGradient>
        <linearGradient id="paint22_linear_115_1314" x1="281.198" y1="28.9857" x2="288.309" y2="28.729" gradientUnits="userSpaceOnUse">
            <stop stop-color="#DEFEFF"/>
            <stop offset="0.510417" stop-color="#2EE4FF"/>
            <stop offset="1" stop-color="#A2FF00"/>
        </linearGradient>
        <linearGradient id="paint23_linear_115_1314" x1="20" y1="49.9882" x2="25.3327" y2="49.7957" gradientUnits="userSpaceOnUse">
            <stop stop-color="#DEFEFF"/>
            <stop offset="0.510417" stop-color="#2EE4FF"/>
            <stop offset="1" stop-color="#A2FF00"/>
        </linearGradient>
        <linearGradient id="paint24_linear_115_1314" x1="301.222" y1="156.336" x2="306.555" y2="156.144" gradientUnits="userSpaceOnUse">
            <stop stop-color="#DEFEFF"/>
            <stop offset="0.510417" stop-color="#2EE4FF"/>
            <stop offset="1" stop-color="#A2FF00"/>
        </linearGradient>
        <linearGradient id="paint25_linear_115_1314" x1="104.5" y1="36.4" x2="232.319" y2="8.29232" gradientUnits="userSpaceOnUse">
            <stop stop-color="#DEFEFF"/>
            <stop offset="0.510417" stop-color="#2EE4FF"/>
            <stop offset="1" stop-color="#A2FF00"/>
        </linearGradient>
        <linearGradient id="paint26_linear_115_1314" x1="67" y1="171.6" x2="270.96" y2="139.538" gradientUnits="userSpaceOnUse">
            <stop stop-color="#DEFEFF"/>
            <stop offset="0.510417" stop-color="#2EE4FF"/>
            <stop offset="1" stop-color="#A2FF00"/>
        </linearGradient>
        <clipPath id="clip0_115_1314">
            <rect width="343" height="242" rx="24" fill="white"/>
        </clipPath>
    </defs>
</svg>
