<svg width="24" height="24" viewBox="0 0 24 24" fill="none" xmlns="http://www.w3.org/2000/svg">
    <rect width="24" height="24" rx="12" fill="white"/>
    <g clip-path="url(#clip0_65_1757)">
        <path d="M18.6668 8.00008C18.6668 7.26675 18.0668 6.66675 17.3335 6.66675H6.66683C5.9335 6.66675 5.3335 7.26675 5.3335 8.00008V16.0001C5.3335 16.7334 5.9335 17.3334 6.66683 17.3334H17.3335C18.0668 17.3334 18.6668 16.7334 18.6668 16.0001V8.00008ZM17.3335 8.00008L12.0002 11.3334L6.66683 8.00008H17.3335ZM17.3335 16.0001H6.66683V9.33341L12.0002 12.6667L17.3335 9.33341V16.0001Z" fill="#131517"/>
    </g>
    <defs>
        <clipPath id="clip0_65_1757">
            <rect width="16" height="16" fill="white" transform="translate(4 4)"/>
        </clipPath>
    </defs>
</svg>
