<svg width="18" height="21" viewBox="0 0 18 21" fill="none" xmlns="http://www.w3.org/2000/svg">
<path fill-rule="evenodd" clip-rule="evenodd" d="M2.1579 0C1.05333 0 0.157898 0.89543 0.157898 2V19C0.157898 20.1046 1.05333 21 2.1579 21H15.8421C16.9467 21 17.8421 20.1046 17.8421 19V2C17.8421 0.895431 16.9467 0 15.8421 0H2.1579ZM5.13143 13.1579C4.82622 13.1579 4.5788 13.4053 4.5788 13.7105C4.5788 14.0157 4.82622 14.2632 5.13143 14.2632H12.8683C13.1735 14.2632 13.4209 14.0157 13.4209 13.7105C13.4209 13.4053 13.1735 13.1579 12.8683 13.1579H5.13143ZM10.1049 4.31578C10.1049 3.7635 9.65719 3.31578 9.10491 3.31578H8.89438C8.3421 3.31578 7.89438 3.7635 7.89438 4.31578V5.52631H6.68385C6.13157 5.52631 5.68385 5.97402 5.68385 6.52631V6.73684C5.68385 7.28912 6.13157 7.73684 6.68385 7.73684H7.89438V8.94736C7.89438 9.49965 8.3421 9.94736 8.89438 9.94736H9.10491C9.65719 9.94736 10.1049 9.49965 10.1049 8.94736V7.73684H11.3154C11.8677 7.73684 12.3154 7.28912 12.3154 6.73684V6.52631C12.3154 5.97402 11.8677 5.52631 11.3154 5.52631H10.1049V4.31578ZM4.02632 15.4737C3.72111 15.4737 3.47369 15.7211 3.47369 16.0263C3.47369 16.3315 3.72111 16.5789 4.02632 16.5789H13.9737C14.2789 16.5789 14.5263 16.3315 14.5263 16.0263C14.5263 15.7211 14.2789 15.4737 13.9737 15.4737H4.02632Z" fill="#737678"/>
</svg>
