<svg width="46" height="46" viewBox="0 0 46 46" fill="none" xmlns="http://www.w3.org/2000/svg">
<circle cx="23" cy="23" r="22.5" fill="#F1F0F0" stroke="#C4C4C4"/>
<path fill-rule="evenodd" clip-rule="evenodd" d="M31.1655 27.0684L31.1655 18.9316C31.1649 18.3304 30.6584 17.8431 30.0335 17.8425L27.8861 17.8425L27.8861 28.1575L30.0335 28.1575C30.6584 28.1567 31.1649 27.6696 31.1655 27.0684ZM18.1149 28.1575L15.9675 28.1575C15.3426 28.1567 14.8361 27.6696 14.8355 27.0684L14.8355 18.9316C14.8361 18.3304 15.3426 17.8433 15.9675 17.8425L18.1149 17.8425L18.1149 28.1575ZM13.3055 25.853L13.8462 25.853L13.8462 20.4031L13.3055 20.4031C12.6806 20.4039 12.1741 20.891 12.1735 21.4924L12.1735 24.7641C12.1742 25.3653 12.6808 25.8525 13.3055 25.853ZM26.8968 24.8479L19.1029 24.8479L19.1029 21.1522L26.8968 21.1522L26.8968 24.8479ZM33.8267 21.4924L33.8267 24.7639C33.8259 25.3651 33.3196 25.8524 32.6947 25.853L32.1539 25.853L32.1539 20.4031L32.6947 20.4031C33.3196 20.4039 33.8261 20.891 33.8267 21.4924Z" fill="#737678"/>
</svg>
