<svg width="19" height="18" viewBox="0 0 19 18" fill="none" xmlns="http://www.w3.org/2000/svg">
<rect x="0.218018" width="18" height="18" rx="9" fill="white"/>
<g clip-path="url(#clip0_2644_9555)">
<path d="M13.0534 9.87932C12.9356 8.34532 12.2214 7.38403 11.5913 6.53574C11.0078 5.75041 10.5039 5.07224 10.5039 4.07183C10.5039 3.99147 10.4589 3.91803 10.3876 3.8812C10.316 3.84416 10.23 3.85023 10.1649 3.89752C9.21865 4.57465 8.4291 5.7159 8.15329 6.80482C7.96182 7.56293 7.93649 8.41519 7.93293 8.97808C7.05905 8.79143 6.86109 7.48426 6.859 7.47001C6.84916 7.40221 6.80773 7.34321 6.74747 7.31099C6.68658 7.27919 6.615 7.27688 6.55326 7.30743C6.50744 7.32961 5.42846 7.87785 5.36568 10.0668C5.36128 10.1396 5.36108 10.2127 5.36108 10.2857C5.36108 12.4123 7.09147 14.1426 9.21823 14.1426C9.22116 14.1428 9.22429 14.1432 9.2268 14.1426C9.22765 14.1426 9.22847 14.1426 9.22952 14.1426C11.351 14.1365 13.0754 12.4085 13.0754 10.2857C13.0754 10.1788 13.0534 9.87932 13.0534 9.87932ZM9.21823 13.714C8.50924 13.714 7.93251 13.0997 7.93251 12.3445C7.93251 12.3188 7.93231 12.2928 7.93418 12.261C7.94276 11.9425 8.00325 11.7251 8.06958 11.5805C8.19389 11.8475 8.41612 12.093 8.77711 12.093C8.89555 12.093 8.9914 11.9971 8.9914 11.8787C8.9914 11.5736 8.99769 11.2217 9.07364 10.904C9.14124 10.6224 9.30278 10.3227 9.50745 10.0825C9.59848 10.3943 9.77595 10.6466 9.94922 10.8929C10.1972 11.2453 10.4535 11.6096 10.4985 12.2309C10.5012 12.2677 10.504 12.3047 10.504 12.3445C10.5039 13.0997 9.92722 13.714 9.21823 13.714Z" fill="#FD382A"/>
</g>
<defs>
<clipPath id="clip0_2644_9555">
<rect width="10.2857" height="10.2857" fill="white" transform="translate(4.07532 3.85718)"/>
</clipPath>
</defs>
</svg>
