<svg width="20" height="20" viewBox="0 0 20 20" fill="none" xmlns="http://www.w3.org/2000/svg">
<path d="M16.8709 2.38461H3.06503C1.92131 2.38461 0.994141 3.31448 0.994141 4.46154V16.9231C0.994141 18.0701 1.92131 19 3.06503 19H16.8709C18.0146 19 18.9418 18.0701 18.9418 16.9231V4.46154C18.9418 3.31448 18.0146 2.38461 16.8709 2.38461Z" stroke="#00C2C5" stroke-width="1.5" stroke-linejoin="round"/>
<path d="M18.9418 5.84615H0.994141M4.44562 1V2.38462V1ZM15.4903 1V2.38462V1Z" stroke="#00C2C5" stroke-width="1.5" stroke-linecap="round" stroke-linejoin="round"/>
<rect x="1" y="6" width="18" height="13" fill="#00C2C5"/>
<line x1="3.5" y1="12" x2="5.5" y2="12" stroke="white" stroke-width="2" stroke-linecap="round"/>
<line x1="3.5" y1="8" x2="5.5" y2="8" stroke="white" stroke-width="2" stroke-linecap="round"/>
<line x1="9.5" y1="8" x2="11.5" y2="8" stroke="white" stroke-width="2" stroke-linecap="round"/>
<line x1="15.5" y1="8" x2="17.5" y2="8" stroke="white" stroke-width="2" stroke-linecap="round"/>
</svg>
