<svg width="25" height="25" viewBox="0 0 25 25" fill="none" xmlns="http://www.w3.org/2000/svg">
<path d="M8.8178 5.48894C6.71447 5.53499 4.43097 7.73794 4.43097 10.9935C4.43097 12.6999 4.63698 13.8593 4.77327 14.6266C4.80751 14.8214 4.83797 14.9895 4.8579 15.1338C4.90144 15.4494 5.17092 15.684 5.48896 15.684H10.8292C11.2157 15.684 11.5093 15.344 11.4615 14.9677C11.3532 14.1026 11.5499 12.8934 11.739 11.7235C11.9058 10.696 12.0782 9.63369 12.0782 8.67405C12.0782 6.80851 10.5043 5.43486 8.8178 5.48894V5.48894ZM16.6138 1.62284C14.6599 1.61872 13.3527 3.19303 13.3527 4.85044C13.3527 5.81008 13.5251 6.87241 13.6919 7.89985C13.8811 9.06984 14.0777 10.279 13.9694 11.1441C13.9464 11.3252 14.003 11.5075 14.1238 11.645C14.2451 11.782 14.4188 11.8603 14.6017 11.8603H19.942C20.26 11.8603 20.5295 11.6257 20.5731 11.3102C20.593 11.1659 20.6235 10.9978 20.6577 10.803C20.794 10.0357 21 8.87628 21 7.16984C21 3.90762 18.7062 1.66872 16.6138 1.62284V1.62284ZM11.1733 16.9585H5.89656C5.5029 16.9585 5.2047 17.312 5.26736 17.6985L5.75092 20.6933C5.98722 22.2002 7.31011 23.3768 8.89121 23.3768C10.7585 23.3768 12.0594 21.8105 12.0782 20.0511C12.0639 19.0447 11.9357 18.1976 11.7994 17.4769C11.7428 17.1764 11.4795 16.9585 11.1733 16.9585V16.9585ZM19.5344 13.1349H14.2576C13.9514 13.1349 13.6882 13.3527 13.6316 13.6533C13.4946 14.3759 13.3665 15.1824 13.3527 16.2391C13.3703 17.959 14.6946 19.5113 16.5397 19.5113C18.1199 19.5113 19.4448 18.3318 19.6781 16.8322L20.1629 13.8754C20.2267 13.4889 19.9284 13.1349 19.5344 13.1349V13.1349Z" fill="#27C9CC"/>
</svg>
