<svg width="28" height="28" viewBox="0 0 28 28" fill="none" xmlns="http://www.w3.org/2000/svg">
<circle opacity="0.3" cx="14" cy="14" r="14" fill="black"/>
<path fill-rule="evenodd" clip-rule="evenodd" d="M7.46967 7.46966C7.76256 7.17677 8.23744 7.17677 8.53033 7.46966L20.53 19.4693C20.8229 19.7622 20.8229 20.2371 20.53 20.53C20.2371 20.8229 19.7622 20.8229 19.4693 20.53L7.46967 8.53032C7.17678 8.23743 7.17678 7.76255 7.46967 7.46966Z" fill="white"/>
<path fill-rule="evenodd" clip-rule="evenodd" d="M20.5303 7.47003C20.8232 7.76292 20.8232 8.23779 20.5303 8.53069L8.53068 20.5303C8.23779 20.8232 7.76292 20.8232 7.47002 20.5303C7.17713 20.2374 7.17713 19.7626 7.47002 19.4697L19.4697 7.47003C19.7626 7.17713 20.2374 7.17713 20.5303 7.47003Z" fill="white"/>
</svg>
