<svg width="60" height="27" viewBox="0 0 60 27" fill="none" xmlns="http://www.w3.org/2000/svg">
<path d="M15.033 17.5725H20.0817C20.1369 18.238 20.3312 18.885 20.6524 19.4731C20.9736 20.0612 21.4147 20.5777 21.9482 20.9901C22.4817 21.4026 23.096 21.7022 23.7526 21.8701C24.4093 22.038 25.094 22.0707 25.7641 21.966C29.1579 21.966 30.854 20.8083 30.8523 18.4928C30.8693 18.09 30.7741 17.6902 30.577 17.3367C30.38 16.9832 30.0886 16.6894 29.7343 16.4869C27.9812 15.7014 26.1433 15.1137 24.2558 14.7351C18.7586 13.3679 16.0101 10.8255 16.0101 7.1079C15.9647 6.08837 16.1791 5.07385 16.6336 4.15663C17.0882 3.23941 17.7686 2.4486 18.6129 1.85613C20.6351 0.543356 23.0293 -0.102119 25.4491 0.0131375C31.8801 0.0131375 35.1882 2.58635 35.3735 7.73276L30.1556 7.95037C30.0969 7.40244 29.9277 6.87154 29.6579 6.38876C29.3881 5.90599 29.0231 5.48104 28.5844 5.1388C28.1456 4.79657 27.6419 4.54391 27.1027 4.39565C26.5635 4.24738 25.9996 4.20649 25.4442 4.27534C22.7339 4.27534 21.0625 5.11051 21.0625 6.7675C21.0753 7.06549 21.1511 7.35758 21.2851 7.6251C21.4191 7.89261 21.6083 8.12967 21.8407 8.32115C23.3308 9.20442 24.9772 9.80251 26.693 10.0839C31.0273 11.1853 33.6857 12.4067 34.6682 13.748C35.6654 15.1222 36.1825 16.7778 36.1419 18.4661C36.1419 23.7057 32.6942 26.3295 25.7987 26.3376C19.3298 26.3093 15.7412 23.3876 15.033 17.5725Z" fill="white"/>
<path d="M58.8884 0.0483164L52.6106 0L41.9253 11.6958V0H36.6661V26.3376H41.919L41.848 19.0917L58.8884 0.0483164Z" fill="white"/>
<path d="M47.7778 15.1821L53.5625 26.3379H60L51.0453 10.9743L47.7778 15.1821Z" fill="white"/>
<path d="M6.67187 8.49216V26.3366H11.1108L11.0353 3.2912C9.99792 5.45149 8.49015 7.24951 6.66632 8.50127L6.67187 8.49216Z" fill="white"/>
<path d="M11.1111 0H7.16848C6.53213 1.42366 5.55713 2.69616 4.316 3.72278C3.07488 4.74939 1.59962 5.50369 0 5.92955V9.87662C4.02844 8.34276 10.2965 4.50758 11.1111 0Z" fill="white"/>
</svg>
