<svg width="12" height="12" viewBox="0 0 12 12" fill="none" xmlns="http://www.w3.org/2000/svg">
<g filter="url(#filter0_d_7322_22283)">
<path d="M5.99983 2C3.79098 2 2 3.79098 2 5.99983C2 8.20868 3.79098 10 5.99983 10C8.20868 10 10 8.20868 10 5.99983C10 3.79098 8.20868 2 5.99983 2ZM6.83251 8.1992C6.62662 8.28047 6.46273 8.34209 6.33981 8.38476C6.21723 8.42743 6.07467 8.44876 5.91247 8.44876C5.66324 8.44876 5.46921 8.38781 5.33105 8.26624C5.19289 8.14468 5.12415 7.9906 5.12415 7.80334C5.12415 7.73054 5.12923 7.65604 5.13939 7.58019C5.14988 7.50434 5.16648 7.41901 5.18916 7.32317L5.44686 6.41295C5.46954 6.32559 5.48919 6.24262 5.50476 6.16542C5.52034 6.08753 5.52779 6.01608 5.52779 5.95107C5.52779 5.83526 5.50375 5.75399 5.456 5.70828C5.40758 5.66256 5.31649 5.64021 5.1807 5.64021C5.11433 5.64021 5.04593 5.65003 4.97583 5.67069C4.90641 5.69202 4.84614 5.71132 4.7967 5.73029L4.86476 5.4499C5.0334 5.38116 5.19492 5.32224 5.34899 5.27348C5.50307 5.22404 5.64868 5.19966 5.78582 5.19966C6.03335 5.19966 6.22434 5.25994 6.35877 5.37913C6.49253 5.49867 6.55992 5.65409 6.55992 5.84508C6.55992 5.8847 6.55517 5.95445 6.54603 6.05401C6.53689 6.1539 6.51962 6.24499 6.49456 6.32863L6.23822 7.23615C6.21723 7.30895 6.1986 7.39225 6.18167 7.48538C6.16508 7.5785 6.15695 7.64961 6.15695 7.69735C6.15695 7.8179 6.1837 7.90019 6.23788 7.94387C6.29139 7.98756 6.38519 8.00957 6.51793 8.00957C6.58057 8.00957 6.65067 7.99839 6.7299 7.97672C6.80847 7.95505 6.86535 7.93575 6.90125 7.91915L6.83251 8.1992ZM6.78713 4.51564C6.6676 4.62671 6.52368 4.68224 6.35539 4.68224C6.18743 4.68224 6.0425 4.62671 5.92195 4.51564C5.80207 4.40457 5.74146 4.26946 5.74146 4.11166C5.74146 3.9542 5.80241 3.81875 5.92195 3.70667C6.0425 3.59424 6.18743 3.53837 6.35539 3.53837C6.52368 3.53837 6.66794 3.59424 6.78713 3.70667C6.90667 3.81875 6.9666 3.9542 6.9666 4.11166C6.9666 4.2698 6.90667 4.40457 6.78713 4.51564Z" fill="white"/>
</g>
<defs>
<filter id="filter0_d_7322_22283" x="0" y="0" width="12" height="12" filterUnits="userSpaceOnUse" color-interpolation-filters="sRGB">
<feFlood flood-opacity="0" result="BackgroundImageFix"/>
<feColorMatrix in="SourceAlpha" type="matrix" values="0 0 0 0 0 0 0 0 0 0 0 0 0 0 0 0 0 0 127 0" result="hardAlpha"/>
<feOffset/>
<feGaussianBlur stdDeviation="1"/>
<feColorMatrix type="matrix" values="0 0 0 0 0 0 0 0 0 0 0 0 0 0 0 0 0 0 0.15 0"/>
<feBlend mode="normal" in2="BackgroundImageFix" result="effect1_dropShadow_7322_22283"/>
<feBlend mode="normal" in="SourceGraphic" in2="effect1_dropShadow_7322_22283" result="shape"/>
</filter>
</defs>
</svg>
