<svg width="30" height="30" viewBox="0 0 30 30" fill="none" xmlns="http://www.w3.org/2000/svg">
<circle cx="15" cy="15" r="15" fill="#6BC8B2"/>
<path d="M11.6928 10.0083C10.0561 10.0441 8.2793 11.7583 8.2793 14.2914C8.2793 15.6192 8.4396 16.5214 8.54564 17.1185C8.57229 17.2701 8.59599 17.4008 8.6115 17.5131C8.64538 17.7587 8.85507 17.9412 9.10254 17.9412H13.2579C13.5586 17.9412 13.7871 17.6767 13.7499 17.3838C13.6656 16.7107 13.8186 15.7699 13.9658 14.8595C14.0956 14.06 14.2297 13.2334 14.2297 12.4867C14.2297 11.0351 13.0051 9.9662 11.6928 10.0083ZM17.7589 7.00001C16.2386 6.9968 15.2215 8.2218 15.2215 9.51145C15.2215 10.2582 15.3556 11.0848 15.4854 11.8843C15.6326 12.7946 15.7856 13.7355 15.7013 14.4086C15.6834 14.5496 15.7275 14.6914 15.8214 14.7984C15.9159 14.905 16.051 14.966 16.1933 14.966H20.3487C20.5961 14.966 20.8058 14.7834 20.8397 14.5379C20.8552 14.4256 20.879 14.2948 20.9056 14.1433C21.0116 13.5462 21.1719 12.644 21.1719 11.3162C21.1719 8.77783 19.3871 7.03571 17.7589 7.00001ZM13.5256 18.933H9.4197C9.11338 18.933 8.88135 19.208 8.93011 19.5087L9.30637 21.8391C9.49024 23.0116 10.5196 23.9271 11.7499 23.9271C13.2029 23.9271 14.2151 22.7084 14.2297 21.3393C14.2186 20.5563 14.1189 19.8971 14.0128 19.3363C13.9687 19.1025 13.7639 18.933 13.5256 18.933ZM20.0315 15.9578H15.9256C15.6873 15.9578 15.4825 16.1272 15.4384 16.3611C15.3319 16.9233 15.2321 17.5509 15.2215 18.3732C15.2352 19.7115 16.2656 20.9193 17.7013 20.9193C18.9309 20.9193 19.9618 20.0015 20.1434 18.8346L20.5206 16.534C20.5702 16.2332 20.3381 15.9578 20.0315 15.9578Z" fill="white"/>
</svg>
