<svg width="68" height="68" viewBox="0 0 68 68" fill="none" xmlns="http://www.w3.org/2000/svg">
<circle cx="34" cy="34" r="34" fill="black" fill-opacity="0.5"/>
<path d="M26.4297 18.1875C25.902 18.1884 25.3837 18.3268 24.9258 18.5888C23.8945 19.1732 23.2534 20.3075 23.2534 21.539V46.4609C23.2534 47.6958 23.8945 48.8268 24.9258 49.4111C25.3946 49.6806 25.9273 49.8192 26.468 49.8124C27.0088 49.8056 27.5378 49.6536 27.9997 49.3725L49.2994 36.6228C49.7433 36.3444 50.1092 35.9579 50.3629 35.4995C50.6165 35.041 50.7496 34.5256 50.7496 34.0017C50.7496 33.4777 50.6165 32.9624 50.3629 32.5039C50.1092 32.0455 49.7433 31.6589 49.2994 31.3806L27.9963 18.6275C27.5236 18.3417 26.9821 18.1896 26.4297 18.1875Z" fill="white"/>
</svg>
