<svg width="32" height="32" viewBox="0 0 32 32" fill="none" xmlns="http://www.w3.org/2000/svg">
<path d="M0 16C0 7.16344 7.16344 0 16 0C24.8366 0 32 7.16344 32 16C32 24.8366 24.8366 32 16 32C7.16344 32 0 24.8366 0 16Z" fill="#F4EADE"/>
<path d="M16.1614 16.9732C16.7474 16.9979 17.0843 17.1894 17.3551 17.3433C17.611 17.4887 17.7959 17.5937 18.2189 17.5937C18.6419 17.5937 18.8268 17.4887 19.0827 17.3433C19.3535 17.1894 19.6904 16.9979 20.2764 16.9732L20.5716 16.9607L18.6876 13.4145V11.4375H21.9689C22.1465 11.4375 22.3088 11.3372 22.3881 11.1784C22.4676 11.0196 22.4504 10.8296 22.3439 10.6875L21.6173 9.71875L22.3439 8.75C22.4504 8.60797 22.4676 8.41794 22.3881 8.25912C22.3088 8.10031 22.1465 8 21.9689 8H18.2189C17.96 8 17.7501 8.20987 17.7501 8.46875V10.9687V13.4145L15.8662 16.9607L16.1614 16.9732Z" fill="#F58737"/>
<path d="M11.8899 18.7695C12.0915 18.9083 12.2246 19 12.5315 19C12.8384 19 12.9715 18.9083 13.1731 18.7695C13.3664 18.6364 13.607 18.4707 13.985 18.4039L14.0435 18.3935L14.1924 18.1133L12.9436 15.808C12.8617 15.6567 12.7035 15.5625 12.5315 15.5625C12.3595 15.5625 12.2013 15.6567 12.1193 15.808L10.7451 18.345L11.078 18.4039C11.456 18.4707 11.6966 18.6364 11.8899 18.7695Z" fill="#F58737"/>
<path d="M12.5312 19.9375C11.9328 19.9375 11.6141 19.718 11.358 19.5416C11.2035 19.4352 11.0918 19.3584 10.9144 19.327L10.2743 19.2137L8.05659 23.308C7.9779 23.4532 7.98149 23.6291 8.06602 23.7711C8.15055 23.913 8.30355 24 8.46874 24H11.0649L13.3073 19.7789C13.1101 19.8695 12.864 19.9375 12.5312 19.9375Z" fill="#F58737"/>
<path d="M23.9452 23.3114L21.059 17.8784L20.3159 17.9099C19.9564 17.925 19.7841 18.0229 19.5457 18.1584C19.2534 18.3245 18.8896 18.5313 18.2188 18.5313C17.548 18.5313 17.1842 18.3245 16.8918 18.1584C16.6534 18.0229 16.4812 17.925 16.1216 17.9099L15.3785 17.8784L12.1265 24H23.5313C23.6958 24 23.8483 23.9138 23.933 23.7728C24.0178 23.6318 24.0224 23.4566 23.9452 23.3114Z" fill="#F58737"/>
</svg>
