<svg width="14" height="14" viewBox="0 0 14 14" fill="none" xmlns="http://www.w3.org/2000/svg">
<circle cx="7" cy="7" r="7" transform="rotate(-180 7 7)" fill="#C4C4C4"/>
<path d="M10 8L7 5L4 8" stroke="white" stroke-linecap="round" stroke-linejoin="round"/>
</svg>
