<svg width="26" height="26" viewBox="0 0 26 26" fill="none" xmlns="http://www.w3.org/2000/svg">
<circle cx="13" cy="13" r="13" fill="#EB5757" fill-opacity="0.2"/>
<g clip-path="url(#clip0_9048_27067)">
<path d="M19.7755 10.084C19.7364 10.25 19.7085 10.4191 19.6561 10.5813C19.4219 11.3058 19.0263 11.6898 18.195 12.0091C18.195 12.0545 18.195 12.1031 18.195 12.1517C18.195 13.6805 18.1952 15.2093 18.1949 16.7382C18.1946 18.0674 17.2628 19.1064 15.857 19.346C14.4139 19.5918 12.9383 18.6525 12.664 17.3134C12.6552 17.2703 12.6447 17.2274 12.6335 17.1782C12.5743 17.1782 12.522 17.1782 12.4697 17.1782C10.8322 17.1782 9.19468 17.1784 7.55715 17.1782C6.78718 17.1781 6.28823 16.7152 6.28816 16.0009C6.28791 14.0929 6.28788 12.185 6.28819 10.277C6.2883 9.57048 6.78901 9.10572 7.55015 9.10562C9.60913 9.10533 11.6681 9.10526 13.7271 9.10565C14.4789 9.10581 14.9808 9.5727 14.981 10.2722C14.9815 12.1842 14.9815 14.0963 14.981 16.0083C14.9809 16.7134 14.4786 17.1776 13.7171 17.1782C13.6305 17.1783 13.5439 17.1782 13.4469 17.1782C13.5002 17.4489 13.6124 17.6824 13.7842 17.886C14.2985 18.4953 14.9768 18.7568 15.7936 18.6043C16.6318 18.4477 17.1584 17.9557 17.3608 17.179C17.3904 17.0654 17.4025 16.9451 17.4027 16.8278C17.4055 15.246 17.4046 13.6642 17.4047 12.0824C17.4047 12.0581 17.4047 12.034 17.4047 12.0017C17.0983 11.9225 16.8222 11.7939 16.5925 11.5918C15.979 11.0519 15.7456 10.3771 15.8108 9.60998C15.8602 9.03018 16.0987 8.52181 16.5586 8.11497C17.323 7.43892 18.4481 7.48625 19.1443 8.2232C19.4842 8.58303 19.6718 9.00682 19.7485 9.47654C19.755 9.5163 19.7664 9.55534 19.7755 9.59471C19.7755 9.75786 19.7755 9.92095 19.7755 10.084ZM10.6298 15.7103C12.1529 15.7124 13.3968 14.5625 13.4005 13.1492C13.4041 11.7344 12.1673 10.5778 10.6458 10.5734C9.11641 10.5689 7.86941 11.7215 7.86874 13.1404C7.86807 14.5543 9.10793 15.7083 10.6298 15.7103Z" fill="#EB5757"/>
<path d="M6.28918 8.73193C6.30273 8.37934 6.44597 8.10392 6.7217 7.88973C6.93419 7.72465 7.18352 7.63893 7.46045 7.63874C9.57631 7.63721 11.6921 7.63554 13.808 7.63936C14.4126 7.64047 14.9048 8.06358 14.9751 8.6225C14.9789 8.653 14.9756 8.68428 14.9756 8.68578C14.7141 8.59412 14.454 8.49089 14.1851 8.41385C14.05 8.37513 13.8991 8.37321 13.7553 8.37305C11.6746 8.37067 9.59387 8.37187 7.51313 8.37102C7.09808 8.37086 6.71656 8.47031 6.37143 8.68617C6.35042 8.69931 6.32804 8.7104 6.28918 8.73193Z" fill="#EB5757"/>
<path d="M12.6102 13.1399C12.6109 14.1508 11.7245 14.9754 10.6364 14.9763C9.54833 14.9771 8.65966 14.1532 8.65906 13.1431C8.65846 12.132 9.54467 11.3076 10.6329 11.3071C11.722 11.3065 12.6095 12.1291 12.6102 13.1399ZM11.0241 12.0497C10.7576 12.0497 10.5018 12.0497 10.25 12.0497C10.25 12.5404 10.25 13.0224 10.25 13.502C10.5132 13.502 10.7658 13.502 11.0241 13.502C11.0241 13.0163 11.0241 12.5373 11.0241 12.0497Z" fill="#EB5757"/>
</g>
<defs>
<clipPath id="clip0_9048_27067">
<rect width="14" height="13" fill="white" transform="translate(6 7)"/>
</clipPath>
</defs>
</svg>
