<svg width="12" height="12" viewBox="0 0 12 12" fill="none" xmlns="http://www.w3.org/2000/svg">
<path d="M12 2.5714C12 2.11674 11.8194 1.6807 11.4979 1.35921C11.1764 1.03772 10.7404 0.857107 10.2857 0.857107H9.85714V0.440587C9.85714 0.209962 9.67982 0.0120145 9.4492 0.000496603C9.39125 -0.00229534 9.33334 0.00670665 9.27897 0.0269572C9.22461 0.0472077 9.17492 0.0782851 9.13292 0.118306C9.09092 0.158327 9.05749 0.206459 9.03464 0.259784C9.01179 0.31311 9.00001 0.370519 9 0.428534V0.857107H3V0.440587C3 0.209962 2.82268 0.0120145 2.59205 0.000496603C2.53411 -0.00229534 2.4762 0.00670665 2.42183 0.0269572C2.36747 0.0472077 2.31778 0.0782851 2.27578 0.118306C2.23378 0.158327 2.20034 0.206459 2.17749 0.259784C2.15465 0.31311 2.14286 0.370519 2.14286 0.428534V0.857107H1.71429C1.25963 0.857107 0.823594 1.03772 0.502103 1.35921C0.180612 1.6807 0 2.11674 0 2.5714V2.89283C0 2.92124 0.0112883 2.9485 0.0313814 2.96859C0.0514746 2.98868 0.0787268 2.99997 0.107143 2.99997H11.8929C11.9213 2.99997 11.9485 2.98868 11.9686 2.96859C11.9887 2.9485 12 2.92124 12 2.89283V2.5714ZM0 10.2857C0 10.7404 0.180612 11.1764 0.502103 11.4979C0.823594 11.8194 1.25963 12 1.71429 12H10.2857C10.7404 12 11.1764 11.8194 11.4979 11.4979C11.8194 11.1764 12 10.7404 12 10.2857V3.96426C12 3.93584 11.9887 3.90859 11.9686 3.8885C11.9485 3.8684 11.9213 3.85712 11.8929 3.85712H0.107143C0.0787268 3.85712 0.0514746 3.8684 0.0313814 3.8885C0.0112883 3.90859 0 3.93584 0 3.96426V10.2857Z" fill="#737678"/>
</svg>
