<svg width="38" height="38" viewBox="0 0 38 38" fill="none" xmlns="http://www.w3.org/2000/svg">
<circle cx="19" cy="19" r="19" fill="#00C2C5"/>
<g clip-path="url(#clip0_10183_30438)">
<path d="M29.6631 13.7446C29.6044 14 29.5626 14.2601 29.484 14.5097C29.1327 15.6242 28.5393 16.2151 27.2923 16.7063C27.2923 16.7762 27.2923 16.8509 27.2923 16.9257C27.2923 19.2777 27.2926 21.6297 27.2922 23.9818C27.2918 26.0267 25.8941 27.6253 23.7853 27.9938C21.6206 28.372 19.4072 26.9269 18.9958 24.8668C18.9825 24.8004 18.9668 24.7344 18.9501 24.6588C18.8612 24.6588 18.7829 24.6588 18.7044 24.6588C16.2481 24.6588 13.7918 24.6591 11.3355 24.6587C10.1806 24.6586 9.43216 23.9465 9.43205 22.8475C9.43168 19.9122 9.43163 16.9768 9.43211 14.0415C9.43226 12.9546 10.1833 12.2395 11.325 12.2394C14.4135 12.2389 17.502 12.2388 20.5905 12.2394C21.7181 12.2397 22.4711 12.958 22.4713 14.0341C22.4721 16.9757 22.472 19.9173 22.4714 22.859C22.4711 23.9437 21.7177 24.6578 20.5755 24.6588C20.4456 24.6589 20.3156 24.6588 20.1701 24.6588C20.25 25.0752 20.4184 25.4345 20.6761 25.7477C21.4475 26.685 22.465 27.0874 23.6901 26.8527C24.9475 26.6118 25.7374 25.8549 26.041 24.66C26.0854 24.4851 26.1036 24.3001 26.1039 24.1197C26.108 21.6861 26.1067 19.2526 26.1068 16.819C26.1068 16.7817 26.1068 16.7446 26.1068 16.6948C25.6473 16.573 25.2331 16.3752 24.8885 16.0643C23.9683 15.2337 23.6181 14.1956 23.7161 13.0153C23.7901 12.1233 24.1478 11.3412 24.8378 10.7153C25.9844 9.67524 27.672 9.74805 28.7163 10.8818C29.2262 11.4354 29.5075 12.0874 29.6225 12.81C29.6323 12.8712 29.6494 12.9313 29.6631 12.9918C29.6631 13.2428 29.6631 13.4937 29.6631 13.7446ZM15.9445 22.4005C18.2291 22.4036 20.095 20.6346 20.1005 18.4602C20.106 16.2836 18.2508 14.5043 15.9686 14.4975C13.6744 14.4906 11.8039 16.2639 11.8029 18.4467C11.8019 20.6219 13.6617 22.3974 15.9445 22.4005Z" fill="white"/>
<path d="M9.43372 11.6645C9.45404 11.1221 9.66889 10.6983 10.0825 10.3688C10.4012 10.1148 10.7752 9.98297 11.1906 9.98266C14.3644 9.98031 17.5381 9.97775 20.7119 9.98362C21.6189 9.98532 22.3572 10.6363 22.4626 11.4961C22.4683 11.5431 22.4633 11.5912 22.4633 11.5935C22.0711 11.4525 21.6809 11.2937 21.2776 11.1751C21.075 11.1156 20.8486 11.1126 20.6329 11.1124C17.5118 11.1087 14.3907 11.1106 11.2696 11.1093C10.6471 11.109 10.0748 11.262 9.55708 11.5941C9.52557 11.6143 9.49199 11.6314 9.43372 11.6645Z" fill="white"/>
<path d="M18.9151 18.446C18.9162 20.0012 17.5866 21.2699 15.9544 21.2712C14.3223 21.2725 12.9893 20.005 12.9884 18.4509C12.9875 16.8953 14.3168 15.6271 15.9491 15.6263C17.5828 15.6254 18.9141 16.891 18.9151 18.446ZM16.5359 16.7687C16.1362 16.7687 15.7525 16.7687 15.3747 16.7687C15.3747 17.5238 15.3747 18.2652 15.3747 19.0031C15.7696 19.0031 16.1486 19.0031 16.5359 19.0031C16.5359 18.2559 16.5359 17.5189 16.5359 16.7687Z" fill="white"/>
</g>
<defs>
<clipPath id="clip0_10183_30438">
<rect width="21" height="20" fill="white" transform="translate(9 9)"/>
</clipPath>
</defs>
</svg>
