<svg width="24" height="24" viewBox="0 0 24 24" fill="none" xmlns="http://www.w3.org/2000/svg">
<path fill-rule="evenodd" clip-rule="evenodd" d="M12.5 2C7.23582 2 2.96838 6.26744 2.96838 11.5316V14.2253C2.96838 15.4262 3.19048 16.5753 3.59584 17.6336C3.59725 17.8067 3.65179 17.9809 3.76323 18.1303C4.04172 18.5036 4.5701 18.5804 4.94339 18.3019L5.48613 17.897C5.53072 17.8759 5.57381 17.8578 5.6155 17.8424C5.61001 17.8325 5.60454 17.8226 5.59909 17.8127L9.18464 15.1378V19.6848C9.18464 20.7894 10.0801 21.6848 11.1846 21.6848H13.8153C14.9199 21.6848 15.8153 20.7894 15.8153 19.6848V14.7741L19.605 17.416C19.5673 17.4946 19.5284 17.5725 19.4883 17.6496L19.6419 17.5004C19.7278 17.5838 19.8641 17.6697 20.041 17.72L20.1977 17.8293C20.5798 18.0956 21.1054 18.0018 21.3717 17.6198C21.4432 17.5173 21.4887 17.4045 21.5097 17.2892C21.5183 17.2821 21.527 17.275 21.5357 17.2677C21.8573 16.3123 22.0315 15.2891 22.0315 14.2253V11.5316C22.0315 6.26744 17.7641 2 12.5 2ZM20.1803 15.7612C20.307 15.2005 20.3739 14.6171 20.3739 14.0181V11.5316C20.3739 7.18294 16.8486 3.65767 12.5 3.65767C8.15132 3.65767 4.62605 7.18294 4.62605 11.5316V14.0181C4.62605 14.7769 4.73339 15.5106 4.93371 16.205L9.60349 12.7211C9.96936 12.2495 10.5416 11.946 11.1846 11.946H13.8153C14.2225 11.946 14.6013 12.0677 14.9172 12.2767C15.084 12.2765 15.2524 12.3257 15.3995 12.4283L20.1803 15.7612ZM14.572 9.3559C14.572 10.6719 13.5052 11.7388 12.1891 11.7388C10.8731 11.7388 9.80624 10.6719 9.80624 9.3559C9.80624 8.03986 10.8731 6.973 12.1891 6.973C13.5052 6.973 14.572 8.03986 14.572 9.3559Z" fill="#27C9CC"/>
</svg>
