<svg width="22" height="22" viewBox="0 0 22 22" fill="none" xmlns="http://www.w3.org/2000/svg">
<path fill-rule="evenodd" clip-rule="evenodd" d="M2.75 0H19.25C20.7662 0 22 1.23384 22 2.75V19.25C22 20.7662 20.7662 22 19.25 22H2.75C1.23384 22 0 20.7662 0 19.25V2.75C0 1.23384 1.23384 0 2.75 0ZM19.25 20.1666C19.7561 20.1666 20.1666 19.7561 20.1666 19.25V2.75C20.1666 2.24394 19.7561 1.83339 19.25 1.83339H2.75C2.24394 1.83339 1.83339 2.24394 1.83339 2.75V13.75H6.875C7.634 13.75 8.25 14.366 8.25 15.125V20.1666H19.25ZM15.5832 12.8334L10.0832 12.8334C9.57633 12.8334 9.16645 12.4235 9.16645 11.9166V6.41661C9.16645 6.04634 9.38918 5.71082 9.73209 5.56966C9.84573 5.52199 9.9649 5.5 10.0832 5.5C10.3216 5.5 10.5562 5.59349 10.7313 5.76855L12.8332 7.8705L16.7684 3.93533C16.9472 3.75658 17.1818 3.66661 17.4165 3.66661C17.6511 3.66661 17.8859 3.75658 18.0645 3.93533C18.423 4.29369 18.423 4.87293 18.0645 5.23145L14.1293 9.16661L16.2313 11.2686C16.4935 11.5307 16.5722 11.9248 16.4302 12.2677C16.289 12.6107 15.9535 12.8334 15.5832 12.8334Z" fill="white"/>
</svg>
