<svg width="63" height="77" viewBox="0 0 63 77" fill="none" xmlns="http://www.w3.org/2000/svg">
<path d="M36.9718 40.65V41V53.42V53.9422L36.4888 53.7437L32.184 51.9752C32.1833 51.9749 32.1827 51.9747 32.1821 51.9744C31.7371 51.7979 31.2458 51.7994 30.8198 51.9737L36.9718 40.65ZM36.9718 40.65H36.6218H26.3783H26.0283V41V53.42V53.9422L26.5113 53.7437L30.8194 51.9739L36.9718 40.65ZM62.6207 38.435V38.4633L62.6252 38.4913C62.6393 38.5775 62.65 38.6595 62.65 38.735V74.75C62.65 75.8094 61.8172 76.65 60.8018 76.65H2.18369C1.17067 76.65 0.337626 75.8127 0.350139 74.724H0.350162V74.72V38.705C0.350162 38.6443 0.360485 38.5653 0.376111 38.4534L0.379471 38.4293V38.405C0.379471 38.3932 0.379483 38.3855 0.379627 38.3784C0.379711 38.3743 0.379825 38.3713 0.37994 38.3691L0.381004 38.3658L0.384131 38.353C0.387711 38.3384 0.394141 38.318 0.406233 38.2809L0.407742 38.2762C0.415892 38.2512 0.427195 38.2166 0.436809 38.1811C0.45301 38.1369 0.465156 38.0954 0.474052 38.065L0.475251 38.0609C0.486866 38.0213 0.493813 37.9984 0.502009 37.9774L0.526016 37.916V37.9077L6.35887 24.4744C6.65638 23.7892 7.32359 23.35 8.0455 23.35H54.94C55.6602 23.35 56.3297 23.7879 56.6424 24.477C56.6427 24.4777 56.6431 24.4785 56.6434 24.4792L62.4741 37.9077V37.916L62.4982 37.9774C62.5044 37.9933 62.5105 38.0148 62.5226 38.0601L62.5241 38.0657C62.5327 38.0983 62.5455 38.1464 62.5632 38.1953C62.5734 38.2333 62.5857 38.2705 62.5939 38.2959C62.606 38.333 62.6125 38.3534 62.616 38.368L62.6192 38.3809L62.6195 38.382C62.6196 38.3827 62.6196 38.3835 62.6197 38.3844C62.6201 38.3896 62.6204 38.3964 62.6205 38.4052C62.6207 38.4142 62.6207 38.4234 62.6207 38.435ZM9.46699 27.15H9.23716L9.14582 27.3609L5.24771 36.3609L5.03587 36.85H5.56888H57.4166H57.9504L57.7376 36.3605L53.8248 27.3605L53.7333 27.15H53.5039H9.46699ZM58.6036 72.85H58.9536V72.5V41V40.65H58.6036H41.0182H40.6682V41V56.75C40.6682 57.3847 40.3585 57.9677 39.8511 58.3227C39.5422 58.5377 39.1867 58.65 38.82 58.65C38.5939 58.65 38.358 58.6017 38.1222 58.5221L31.6256 55.8562L31.4931 55.8018L31.3605 55.8559L24.8539 58.5109L24.8539 58.5109L24.8498 58.5126C24.2895 58.7495 23.6398 58.676 23.135 58.3231C22.6272 57.9682 22.3173 57.3849 22.3173 56.75V41V40.65H21.9673H4.38187H4.03187V41V72.5V72.85H4.38187H58.6036ZM12.9579 8.98065L15.6941 6.24442L21.6615 12.2119L18.9253 14.9481L12.9579 8.98065ZM42.0399 12.2153L48.0073 6.24782L50.7436 8.98406L44.7761 14.9515L42.0399 12.2153ZM29.9203 0.35H33.7906V8.79062H29.9203V0.35Z" fill="#00C2C5" stroke="white" stroke-width="0.7"/>
</svg>
