<svg width="24" height="24" viewBox="0 0 24 24" fill="none" xmlns="http://www.w3.org/2000/svg">
<path d="M12 24C18.6274 24 24 18.6274 24 12C24 5.37258 18.6274 0 12 0C5.37258 0 0 5.37258 0 12C0 18.6274 5.37258 24 12 24Z" fill="white"/>
<path d="M15.0166 12.4694H12.8754V20.314H9.6312V12.4694H8.08826V9.71254H9.6312V7.92852C9.6312 6.65275 10.2372 4.65503 12.9043 4.65503L15.3073 4.66508V7.34111H13.5637C13.2777 7.34111 12.8756 7.48401 12.8756 8.09258V9.7151H15.3001L15.0166 12.4694Z" fill="#417CD6"/>
</svg>
