<svg width="21" height="14" viewBox="0 0 21 14" fill="none" xmlns="http://www.w3.org/2000/svg">
<path d="M16.211 5.05621H4.62299C4.0707 5.05621 3.62299 5.50459 3.62299 6.05769C3.62299 6.6108 4.0707 7.05917 4.62299 7.05917H16.211C16.7633 7.05917 17.211 6.6108 17.211 6.05769C17.211 5.50459 16.7633 5.05621 16.211 5.05621Z" fill="#232930"/>
<path d="M13.494 11.0651H7.341C6.78872 11.0651 6.341 11.5135 6.341 12.0666C6.341 12.6197 6.78872 13.0681 7.341 13.0681H13.494C14.0463 13.0681 14.494 12.6197 14.494 12.0666C14.494 11.5135 14.0463 11.0651 13.494 11.0651Z" fill="#232930"/>
<path d="M19.834 0.0488281H0.999999C0.447715 0.0488281 0 0.497205 0 1.05031C0 1.60341 0.447715 2.05178 0.999999 2.05178H19.834C20.3863 2.05178 20.834 1.60341 20.834 1.05031C20.834 0.497205 20.3863 0.0488281 19.834 0.0488281Z" fill="#232930"/>
</svg>
