<svg width="38" height="38" viewBox="0 0 38 38" fill="none" xmlns="http://www.w3.org/2000/svg">
<circle cx="19" cy="19" r="19" fill="#00C2C5"/>
<path fill-rule="evenodd" clip-rule="evenodd" d="M11 10C9.89543 10 9 10.8954 9 12V26C9 27.1046 9.89543 28 11 28H26C27.1046 28 28 27.1046 28 26V12C28 10.8954 27.1046 10 26 10H11ZM14.5 13C14.2239 13 14 13.2239 14 13.5V15.5C14 15.7761 14.2239 16 14.5 16H22.5C22.7761 16 23 15.7761 23 15.5V13.5C23 13.2239 22.7761 13 22.5 13H14.5Z" fill="white"/>
</svg>
