<svg width="12" height="17" viewBox="0 0 12 17" fill="none" xmlns="http://www.w3.org/2000/svg">
<path d="M7.2704 14.3866L3.90054 13.488C3.18382 13.2969 2.44436 13.2 1.7027 13.2C0.763815 13.2 0 13.9638 0 14.9027C0 15.8415 0.763815 16.6053 1.7027 16.6053H6.97967C7.60189 16.6053 8.10809 16.0991 8.10809 15.4769C8.10809 14.9665 7.76363 14.5181 7.2704 14.3866Z" fill="#00C2C5"/>
<path d="M6.00002 7.53831C7.07473 7.53831 7.94596 6.66708 7.94596 5.59237C7.94596 4.51765 7.07473 3.64642 6.00002 3.64642C4.92531 3.64642 4.05408 4.51765 4.05408 5.59237C4.05408 6.66708 4.92531 7.53831 6.00002 7.53831Z" fill="#00C2C5"/>
<path d="M3.0811 9.97071V12.3276C3.44142 12.3804 6.00001 13.0409 6.00001 13.0409C6.00001 13.0409 8.55857 12.3804 8.91892 12.3276V9.97071L11.2828 5.39078C11.6082 4.76026 11.5996 3.98231 11.1918 3.32578C11.0377 3.07783 10.8259 2.87085 10.5819 2.71066L6.25327 0.0711242C6.09773 -0.0237081 5.90226 -0.0237081 5.74671 0.0711242L1.41816 2.71066C1.17411 2.87082 0.962323 3.07783 0.80827 3.32578C0.4004 3.98231 0.391838 4.76026 0.717265 5.39078L3.0811 9.97071ZM5.0643 2.82716C5.6453 2.47423 6.00001 1.84375 6.00001 1.164C6.00001 1.84375 6.35472 2.47423 6.93572 2.82716L9.48354 4.37477L8.91792 5.53426C8.91831 5.55359 8.91892 5.57289 8.91892 5.59231C8.91892 7.2018 7.6095 8.51123 6.00001 8.51123C4.39052 8.51123 3.0811 7.2018 3.0811 5.59231C3.0811 5.57289 3.08171 5.55359 3.0821 5.53423L2.51648 4.37474L5.0643 2.82716Z" fill="#00C2C5"/>
<path d="M10.2973 13.2C9.55563 13.2 8.81617 13.2969 8.09941 13.488L7.836 13.5582C8.58282 13.8917 9.08108 14.6393 9.08108 15.4769C9.08108 15.8921 8.95959 16.2791 8.75101 16.6053H10.2973C11.2362 16.6053 12 15.8415 12 14.9027C12 13.9638 11.2362 13.2 10.2973 13.2Z" fill="#00C2C5"/>
</svg>
