<svg width="28" height="28" viewBox="0 0 28 28" fill="none" xmlns="http://www.w3.org/2000/svg">
<rect width="28" height="28" rx="14" fill="black" fill-opacity="0.4"/>
<path d="M6.5 9.62502H15.3574C15.4867 9.99045 15.7262 10.3068 16.0427 10.5306C16.3592 10.7543 16.7374 10.8745 17.125 10.8745C17.5126 10.8745 17.8908 10.7543 18.2073 10.5306C18.5238 10.3068 18.7633 9.99045 18.8926 9.62502H21.5C21.6658 9.62502 21.8247 9.55917 21.9419 9.44196C22.0592 9.32475 22.125 9.16578 22.125 9.00002C22.125 8.83426 22.0592 8.67528 21.9419 8.55807C21.8247 8.44086 21.6658 8.37502 21.5 8.37502H18.8926C18.7633 8.00958 18.5238 7.69321 18.2073 7.46945C17.8908 7.2457 17.5126 7.12555 17.125 7.12555C16.7374 7.12555 16.3592 7.2457 16.0427 7.46945C15.7262 7.69321 15.4867 8.00958 15.3574 8.37502H6.5C6.33424 8.37502 6.17527 8.44086 6.05806 8.55807C5.94085 8.67528 5.875 8.83426 5.875 9.00002C5.875 9.16578 5.94085 9.32475 6.05806 9.44196C6.17527 9.55917 6.33424 9.62502 6.5 9.62502ZM21.5 18.375H18.8926C18.7633 18.0096 18.5238 17.6932 18.2073 17.4695C17.8908 17.2457 17.5126 17.1255 17.125 17.1255C16.7374 17.1255 16.3592 17.2457 16.0427 17.4695C15.7262 17.6932 15.4867 18.0096 15.3574 18.375H6.5C6.33424 18.375 6.17527 18.4409 6.05806 18.5581C5.94085 18.6753 5.875 18.8343 5.875 19C5.875 19.1658 5.94085 19.3247 6.05806 19.442C6.17527 19.5592 6.33424 19.625 6.5 19.625H15.3574C15.4867 19.9904 15.7262 20.3068 16.0427 20.5306C16.3592 20.7543 16.7374 20.8745 17.125 20.8745C17.5126 20.8745 17.8908 20.7543 18.2073 20.5306C18.5238 20.3068 18.7633 19.9904 18.8926 19.625H21.5C21.6658 19.625 21.8247 19.5592 21.9419 19.442C22.0592 19.3247 22.125 19.1658 22.125 19C22.125 18.8343 22.0592 18.6753 21.9419 18.5581C21.8247 18.4409 21.6658 18.375 21.5 18.375ZM21.5 13.375H12.6426C12.5133 13.0096 12.2738 12.6932 11.9573 12.4695C11.6408 12.2457 11.2626 12.1255 10.875 12.1255C10.4874 12.1255 10.1092 12.2457 9.7927 12.4695C9.47616 12.6932 9.23675 13.0096 9.10742 13.375H6.5C6.33424 13.375 6.17527 13.4409 6.05806 13.5581C5.94085 13.6753 5.875 13.8343 5.875 14C5.875 14.1658 5.94085 14.3247 6.05806 14.442C6.17527 14.5592 6.33424 14.625 6.5 14.625H9.10742C9.23675 14.9904 9.47616 15.3068 9.7927 15.5306C10.1092 15.7543 10.4874 15.8745 10.875 15.8745C11.2626 15.8745 11.6408 15.7543 11.9573 15.5306C12.2738 15.3068 12.5133 14.9904 12.6426 14.625H21.5C21.6658 14.625 21.8247 14.5592 21.9419 14.442C22.0592 14.3247 22.125 14.1658 22.125 14C22.125 13.8343 22.0592 13.6753 21.9419 13.5581C21.8247 13.4409 21.6658 13.375 21.5 13.375Z" fill="white"/>
</svg>
