<svg width="128" height="72" viewBox="0 0 128 72" fill="none" xmlns="http://www.w3.org/2000/svg">
<path d="M0.5 8C0.5 3.85787 3.85786 0.5 8 0.5H120C124.142 0.5 127.5 3.85786 127.5 8V53.9668C127.5 58.109 124.142 61.4668 120 61.4668H21.8886C21.2789 61.4668 20.7299 61.8358 20.4997 62.4003L17.1654 70.5757C16.9971 70.9881 16.4142 70.9913 16.2415 70.5807L12.7947 62.3853C12.5606 61.8288 12.0158 61.4668 11.412 61.4668H8C3.85786 61.4668 0.5 58.109 0.5 53.9668V8Z" fill="black" fill-opacity="0.6" stroke="white"/>
</svg>
