<svg width="19" height="16" viewBox="0 0 19 16" fill="none" xmlns="http://www.w3.org/2000/svg">
<path d="M5.1493 13.8748C4.72276 14.2029 4.19553 14.4059 3.61701 14.4059C2.22286 14.4059 1.0884 13.2714 1.0884 11.8773C1.0884 10.4828 2.22286 9.34834 3.61701 9.34834C4.66922 9.34834 5.57164 9.99531 5.95213 10.9115L6.74395 10.0903C6.12039 9.0019 4.96118 8.25998 3.61701 8.25998C1.61908 8.25998 0 9.87942 0 11.8773C0 13.8748 1.61908 15.4943 3.61701 15.4943C4.55699 15.4943 5.40511 15.1269 6.04849 14.5388C5.80157 14.4559 5.56736 14.3244 5.36722 14.1317C5.28465 14.0519 5.2134 13.9648 5.1493 13.8748Z" fill="#00C2C5"/>
<path d="M10.6415 8.28759L8.72625 7.17513C9.5804 6.64053 9.26368 6.83852 10.1179 6.30389L10.091 6.57599C10.0449 7.03909 10.3862 7.46288 10.8158 7.54995C10.8261 7.55206 14.1781 8.12179 14.3003 8.12179C14.7358 8.12179 15.1202 7.80718 15.1938 7.36325C15.276 6.86901 14.942 6.40199 14.4477 6.32022L11.98 5.91026L12.0974 4.73265C12.2156 3.98013 12.267 3.74417 11.986 3.29523L11.6328 2.7305C11.1765 2.00169 10.2142 1.77883 9.48367 2.23623L5.61763 4.65675C4.6681 5.25127 4.20504 6.50482 4.98025 7.42695C5.2831 7.78729 8.22762 9.59674 8.22762 9.59674L5.84289 12.0704C5.42552 12.503 5.43793 13.1921 5.87087 13.6091C6.08204 13.8128 6.35415 13.9141 6.62622 13.9141C6.91147 13.9141 7.19631 13.8029 7.40959 13.5811L10.8781 9.98398C11.3675 9.47765 11.2527 8.64256 10.6415 8.28759Z" fill="#00C2C5"/>
<path d="M14.7046 3.34659C15.5525 2.81551 15.8094 1.69804 15.2786 0.850575C14.7479 0.00238153 13.6304 -0.254483 12.7826 0.276269C11.9351 0.80702 11.6783 1.92409 12.2087 2.77156C12.7393 3.61979 13.8568 3.87702 14.7046 3.34659Z" fill="#00C2C5"/>
<path d="M14.4084 8.25998C12.3897 8.25998 10.7914 9.92552 10.7914 11.8773C10.7914 13.8748 12.4105 15.4943 14.4084 15.4943C16.4059 15.4943 18.0254 13.8748 18.0254 11.8773C18.0254 9.87942 16.4059 8.25998 14.4084 8.25998ZM14.4084 14.4059C13.0142 14.4059 11.8798 13.2714 11.8798 11.8773C11.8798 10.4828 13.0143 9.34834 14.4084 9.34834C15.8026 9.34834 16.937 10.4828 16.937 11.8773C16.9371 13.2714 15.8026 14.4059 14.4084 14.4059Z" fill="#00C2C5"/>
</svg>
