<svg width="13" height="20" viewBox="0 0 13 20" fill="none" xmlns="http://www.w3.org/2000/svg">
<path d="M12.7739 10.0352C12.5236 9.84663 12.1678 9.89701 11.9797 10.1471L9.85104 12.9755C9.80895 13.0317 9.77739 13.0949 9.75829 13.1624L8.88185 16.262L7.53688 16.4542C7.46708 16.4642 7.3998 16.4869 7.33832 16.5218L3.44485 18.7202C3.17209 18.8742 3.07599 19.2201 3.22995 19.4928C3.33408 19.6775 3.52627 19.7811 3.72427 19.7811C3.81869 19.7811 3.91451 19.7576 4.00253 19.7077L7.80296 17.5619L9.40742 17.3326C9.62925 17.3011 9.81173 17.1415 9.87293 16.9255L10.8211 13.5732L12.8858 10.8295C13.0744 10.5791 13.024 10.2235 12.7739 10.0352Z" fill="#00C2C5"/>
<path d="M0.834752 18.1899C1.2528 18.256 1.64953 18.0434 1.84023 17.6925L3.50107 14.1357C3.53668 14.0542 3.56791 13.9675 3.57859 13.872C3.58297 13.8297 3.58777 13.7805 3.58777 13.7386L3.57636 11.037L6.12697 12.1509L6.54025 14.7907C6.62216 15.1765 6.93775 15.4854 7.34989 15.5493C7.88695 15.6272 8.38695 15.2584 8.46927 14.7261C8.48249 14.635 8.48249 14.5439 8.47331 14.4575L7.96997 11.27C7.90939 10.9635 7.70547 10.6972 7.41858 10.5639L5.13908 9.54924L6.59165 7.02069L7.3102 7.93543C7.38365 8.01733 7.47916 8.08863 7.58792 8.13051L10.3314 8.93392C10.698 9.01179 11.0716 8.82151 11.2123 8.47069C11.3725 8.07027 11.1814 7.62022 10.7891 7.45787L10.7487 7.44685L8.36486 6.74374L7.0394 5.15195C6.77967 4.84004 6.27199 4.44589 5.90572 4.27175L5.30508 3.98558C5.16916 3.92093 5.01853 3.89961 4.87162 3.91543C4.49729 3.89377 2.67699 3.86876 1.88165 5.36724C0.993029 7.0409 1.56425 9.05001 1.56425 9.05001C1.56313 9.07464 1.55837 9.09849 1.55837 9.12347L1.62963 13.4939L0.120239 16.7458C0.0666096 16.8417 0.0291149 16.9545 0.0114816 17.0724C-0.0707687 17.6106 0.297686 18.1069 0.834752 18.1899Z" fill="#00C2C5"/>
<path d="M6.41317 3.84524C7.22318 3.84524 7.88261 3.18582 7.88261 2.37284C7.88261 1.56317 7.22318 0.904175 6.41317 0.904175C5.60276 0.904175 4.94373 1.56321 4.94373 2.37284C4.94373 3.18586 5.60276 3.84524 6.41317 3.84524Z" fill="#00C2C5"/>
</svg>
