<svg width="18" height="18" viewBox="0 0 18 18" fill="none" xmlns="http://www.w3.org/2000/svg">
<circle cx="9" cy="9" r="9" fill="#7C9BEA"/>
<path d="M7.20243 11.7299C7.35168 11.7299 7.47242 11.6092 7.47242 11.4599C7.47242 11.3107 7.35165 11.1899 7.20243 11.1899H6.56962C6.42037 11.1899 6.29963 11.3107 6.29963 11.4599C6.29963 11.6092 6.4204 11.7299 6.56962 11.7299H7.20243ZM4.67962 12.5399C4.67962 12.6892 4.80039 12.8099 4.94961 12.8099H8.28242C8.43167 12.8099 8.55241 12.6892 8.55241 12.5399C8.55241 12.3907 8.43164 12.2699 8.28242 12.2699H4.94961C4.80036 12.2699 4.67962 12.3907 4.67962 12.5399ZM9.37429 13.3499H3.8696C3.72035 13.3499 3.59961 13.4707 3.59961 13.6199C3.59961 13.7691 3.72038 13.8899 3.8696 13.8899H9.37429C9.52354 13.8899 9.64428 13.7691 9.64428 13.6199C9.64428 13.4707 9.52354 13.3499 9.37429 13.3499ZM10.2539 7.24145C10.603 7.24145 10.9163 7.11305 11.1596 6.86994L12.8587 5.17085C12.936 5.09358 12.9592 4.97758 12.9173 4.8766C12.8756 4.77562 12.777 4.70996 12.6678 4.70996H9.87341C9.80143 4.70996 9.73261 4.73872 9.682 4.7896L8.8161 5.66024C8.64682 5.82925 8.60964 6.0576 8.71141 6.30281C8.89887 6.75576 9.5636 7.24118 10.2539 7.24145ZM14.0057 12.1136L12.7778 11.1899H10.8785C10.7293 11.1899 10.6085 11.0692 10.6085 10.92C10.6085 10.7707 10.7293 10.6499 10.8785 10.6499H12.2037L12.1263 10.1099H10.7243C10.575 10.1099 10.4543 9.98916 10.4543 9.83994C10.4543 9.69072 10.575 9.56995 10.7243 9.56995H12.0489L11.9715 9.02994H10.57C10.4207 9.02994 10.3 8.90917 10.3 8.75995C10.3 8.6107 10.4208 8.48996 10.57 8.48996H11.8941L11.8053 7.87059C11.7868 7.7341 11.7431 7.44575 11.5804 7.2127C11.5264 7.24969 11.1072 7.78146 10.2539 7.78146C9.30571 7.78119 8.47118 7.13442 8.21253 6.50924C8.06906 6.16399 8.08994 5.81229 8.25497 5.51999C8.01686 5.49254 7.77056 5.55723 7.58817 5.73934L6.25318 7.07454L7.97157 8.79293C8.07705 8.89841 8.07705 9.06928 7.97157 9.17472C7.86609 9.28017 7.69523 9.28017 7.58978 9.17472L5.89051 7.47545C5.54331 7.99829 5.59964 8.71177 6.06022 9.17235L9.74821 12.8603C10.4121 13.5242 11.2949 13.8899 12.2341 13.8899H13.4114C13.9564 13.8899 14.3996 13.4467 14.3996 12.9017C14.3996 12.595 14.2525 12.3005 14.0057 12.1136Z" fill="white"/>
</svg>
