<svg width="22" height="22" viewBox="0 0 22 22" fill="none" xmlns="http://www.w3.org/2000/svg">
<path d="M4.93268 2.16667L17.066 2.16667V1.16667L4.93268 1.16667V2.16667ZM19.8327 4.93334L19.8327 17.0667H20.8327L20.8327 4.93334L19.8327 4.93334ZM17.066 19.8333L4.93268 19.8333L4.93268 20.8333L17.066 20.8333V19.8333ZM2.16602 17.0667L2.16602 4.93334H1.16602L1.16602 17.0667H2.16602ZM4.93268 19.8333C3.40469 19.8333 2.16602 18.5947 2.16602 17.0667H1.16602C1.16602 19.1469 2.85241 20.8333 4.93268 20.8333L4.93268 19.8333ZM19.8327 17.0667C19.8327 18.5947 18.594 19.8333 17.066 19.8333V20.8333C19.1463 20.8333 20.8327 19.1469 20.8327 17.0667H19.8327ZM17.066 2.16667C18.594 2.16667 19.8327 3.40535 19.8327 4.93334L20.8327 4.93334C20.8327 2.85307 19.1463 1.16667 17.066 1.16667V2.16667ZM4.93268 1.16667C2.85241 1.16667 1.16602 2.85307 1.16602 4.93334H2.16602C2.16602 3.40535 3.40469 2.16667 4.93268 2.16667V1.16667ZM4.93268 0.291672C2.36916 0.291672 0.291016 2.36982 0.291016 4.93334H1.29102C1.29102 2.9221 2.92145 1.29167 4.93268 1.29167V0.291672ZM17.066 0.291672L4.93268 0.291672V1.29167L17.066 1.29167V0.291672ZM21.7077 4.93334C21.7077 2.36982 19.6295 0.291672 17.066 0.291672V1.29167C19.0773 1.29167 20.7077 2.9221 20.7077 4.93334H21.7077ZM21.7077 17.0667L21.7077 4.93334H20.7077L20.7077 17.0667H21.7077ZM17.066 21.7083C19.6295 21.7083 21.7077 19.6302 21.7077 17.0667H20.7077C20.7077 19.0779 19.0773 20.7083 17.066 20.7083V21.7083ZM4.93268 21.7083L17.066 21.7083V20.7083L4.93268 20.7083V21.7083ZM0.291016 17.0667C0.291016 19.6302 2.36916 21.7083 4.93268 21.7083V20.7083C2.92145 20.7083 1.29102 19.0779 1.29102 17.0667H0.291016ZM0.291016 4.93334L0.291016 17.0667H1.29102L1.29102 4.93334H0.291016ZM3.04102 4.93334C3.04102 3.8886 3.88794 3.04167 4.93268 3.04167V2.04167C3.33566 2.04167 2.04102 3.33632 2.04102 4.93334H3.04102ZM3.04102 17.0667L3.04102 4.93334H2.04102L2.04102 17.0667H3.04102ZM4.93268 18.9583C3.88794 18.9583 3.04102 18.1114 3.04102 17.0667H2.04102C2.04102 18.6637 3.33566 19.9583 4.93268 19.9583V18.9583ZM17.066 18.9583L4.93268 18.9583V19.9583L17.066 19.9583V18.9583ZM18.9577 17.0667C18.9577 18.1114 18.1108 18.9583 17.066 18.9583V19.9583C18.663 19.9583 19.9577 18.6637 19.9577 17.0667H18.9577ZM18.9577 4.93334L18.9577 17.0667H19.9577L19.9577 4.93334H18.9577ZM17.066 3.04167C18.1108 3.04167 18.9577 3.8886 18.9577 4.93334H19.9577C19.9577 3.33632 18.663 2.04167 17.066 2.04167V3.04167ZM4.93268 3.04167L17.066 3.04167V2.04167L4.93268 2.04167V3.04167Z" fill="#BDBDBD"/>
</svg>
