<svg width="58" height="59" viewBox="0 0 58 59" fill="none" xmlns="http://www.w3.org/2000/svg">
<path fill-rule="evenodd" clip-rule="evenodd" d="M19.5675 57.7114C19.7831 57.8611 20.1693 58.0214 20.3538 58.0377C20.432 58.0446 20.5098 58.0498 20.5265 58.0496C20.5432 58.0493 20.7493 57.9989 20.9845 57.9377C21.2197 57.8764 22.132 57.6395 23.012 57.4111L27.6883 56.1972C29.3805 55.7579 31.4849 55.212 32.3649 54.9838C33.2449 54.7558 34.0348 54.5425 34.1202 54.5097C34.474 54.3742 34.82 54.0022 34.935 53.6333C35.0364 53.3084 35.0289 53.0319 34.9082 52.6538C34.7059 52.0191 34.3186 51.5256 33.6672 51.0726C33.2131 50.7567 32.8657 50.5786 31.6902 50.0588C31.2024 49.8431 30.7547 49.6402 30.6953 49.6078C30.597 49.5544 30.5708 49.5012 30.4094 49.0265C29.5577 46.5228 29.0601 43.8435 28.9552 41.1955C28.9429 40.8849 28.9372 40.6095 28.9426 40.5834C28.9495 40.5497 28.9965 40.5611 29.1013 40.6218C29.5957 40.908 30.2694 40.8971 30.8731 40.593C30.9855 40.5365 31.2362 40.4527 31.4302 40.407C31.8365 40.3113 32.0558 40.1919 32.2611 39.9546C32.3983 39.7959 32.55 39.4159 32.531 39.2782C32.5221 39.2138 32.5469 39.1962 32.7052 39.1541C32.8065 39.1271 33.0307 39.0618 33.2032 39.0088C33.4308 38.9388 33.5221 38.9225 33.5357 38.9497C33.5836 39.0447 33.8371 39.2507 34.009 39.3343C34.4919 39.5693 35.0418 39.5271 35.7053 39.2044C35.9107 39.1046 36.1314 38.9817 36.1958 38.9316C36.3939 38.7771 36.5796 38.523 36.6659 38.2881C36.74 38.0869 36.7444 38.0288 36.7091 37.7196L36.7047 37.683L36.6995 37.6396C36.684 37.5124 36.6757 37.4435 36.6982 37.3871C36.7248 37.3204 36.7944 37.271 36.9461 37.1634L37.0268 37.1058L37.198 36.9831L37.3497 37.0704C37.5251 37.1716 37.8041 37.21 37.9645 37.1552C38.1418 37.0946 39.0305 36.5309 39.2672 36.3289C39.5064 36.1246 39.6679 35.8556 39.7264 35.5643C39.7556 35.4193 39.7471 35.3047 39.682 34.9577L39.6018 34.5297L39.8328 34.1974C39.9599 34.0144 40.0671 33.8645 40.0671 33.8645C40.0671 33.8645 40.1546 33.8924 40.2579 33.9268C40.6054 34.0428 40.9358 33.9217 41.2552 33.5611C41.331 33.4757 41.4972 33.3414 41.6246 33.2627C42.0718 32.9868 42.1837 32.7896 42.1674 32.3059C42.1623 32.1558 42.1667 31.944 42.1773 31.8351C42.2011 31.5888 42.1517 31.4385 41.9832 31.244C41.8781 31.1228 41.8068 31.0801 41.6264 31.0303C41.5024 30.996 41.3991 30.9556 41.3971 30.9405C41.3858 30.8584 41.6186 30.7987 42.3468 30.6966C43.0297 30.6009 43.1512 30.5928 43.4413 30.6237C44.1596 30.7003 44.6483 30.878 45.157 31.2474C45.6554 31.6095 45.9545 31.9988 46.2782 32.7068C46.9896 34.2632 47.1131 36.4771 46.5977 38.4385C46.5383 38.6648 46.4905 38.9264 46.4915 39.0202C46.4927 39.1435 46.4437 39.3024 46.3141 39.5944C45.7225 40.9283 45.4739 42.262 45.5832 43.5149C45.6137 43.8642 45.6342 43.9606 45.7035 44.0836C45.7493 44.1651 45.817 44.3632 45.8539 44.5241C45.9291 44.8518 46.0306 45.0211 46.2412 45.1692C46.5589 45.3929 46.9581 45.3987 47.3876 45.186C49.0491 44.3633 50.954 42.9205 52.9085 41.004C53.8922 40.0395 56.9173 36.8396 57.0844 36.5868C57.2071 36.4011 57.2372 36.2281 57.2127 35.849C57.1961 35.5914 57.1812 35.5368 57.0921 35.4062C56.9719 35.2298 56.7443 35.0767 56.2697 34.8529C55.5714 34.5235 54.7391 34.3095 53.9324 34.2518C53.6105 34.2288 53.449 34.2401 52.7722 34.3334C52.0514 34.4326 51.9488 34.4549 51.5402 34.5999C50.9528 34.8086 50.3595 35.0989 49.849 35.428C49.6207 35.575 49.4272 35.6904 49.4191 35.6845C49.4109 35.6785 49.3864 35.4064 49.3646 35.0798C49.3167 34.3624 49.1161 33.1193 48.9595 32.5679C48.5352 31.0745 47.8546 29.9315 46.9376 29.1724C46.1421 28.5139 45.332 28.1589 44.4108 28.065C43.757 27.9983 42.7675 28.138 41.9987 28.4054L41.8808 28.4465L41.889 28.3069C41.8935 28.2301 41.9031 28.015 41.9104 27.8289L41.9225 27.5172C41.9249 27.5134 41.9275 27.5098 41.9302 27.5065C41.9372 27.4975 41.9454 27.4893 41.9548 27.4817L42.0933 27.4426C42.6607 27.2822 42.9885 26.388 42.7477 25.6575C42.5808 25.1514 42.1279 24.6815 41.7309 24.6026C41.5957 24.5758 41.5277 24.5426 41.5122 24.4958C41.3269 23.9408 41.2293 23.5755 41.2599 23.5508C41.2793 23.5351 41.3527 23.505 41.4232 23.484C41.6005 23.4308 41.7956 23.2043 41.8681 22.9675C41.9188 22.8022 41.9219 22.736 41.87 22.3517C41.8654 22.3058 41.859 22.2593 41.8509 22.2122C41.7865 21.7497 41.7724 21.7054 41.6251 21.4228C41.3282 20.8535 40.6423 19.98 40.3927 19.8533C40.1324 19.7213 39.807 19.7526 39.414 19.9474C39.3116 19.9983 39.2171 20.0412 39.2042 20.043C39.1691 20.0478 38.8197 19.6383 38.8121 19.5835C38.8085 19.5575 38.8634 19.4033 38.934 19.2408C40.3622 15.9539 41.0674 12.6097 40.9128 9.85786L40.9097 9.80278C40.8957 9.55707 40.8902 9.46088 40.9352 9.40741C40.9639 9.37324 41.0133 9.35638 41.0942 9.32878L41.1225 9.31905C41.4495 9.20634 42.0005 8.93094 42.2934 8.73379C43.2104 8.11664 43.5738 7.29194 43.328 6.38596C43.2415 6.06747 43.0296 5.65347 42.8347 5.42229C42.7617 5.33575 42.7 5.24916 42.6973 5.22987C42.6876 5.15914 42.9015 4.60894 43.0685 4.27552C43.2405 3.93187 43.3411 3.76615 43.6864 3.25812C43.9088 2.93072 43.9494 2.72575 43.8469 2.44802C43.6644 1.95391 43.3047 1.72314 42.8243 1.79216C42.4943 1.83958 42.2929 1.97849 42.0051 2.3573C41.7856 2.64636 41.2813 3.48742 41.2317 3.64732C41.217 3.69514 41.1937 3.7358 41.1802 3.73766C41.1514 3.74163 41.1607 3.10646 41.2013 2.29429C41.237 1.58181 41.2249 1.48947 41.0677 1.26767C40.6376 0.660681 39.5598 0.846147 39.3461 1.56391C39.29 1.7523 39.2342 2.84754 39.2289 3.86353C39.2237 4.87585 39.2209 4.93368 39.1791 4.93844C39.1581 4.94083 39.012 4.39257 38.828 3.62108C38.6546 2.89429 38.4878 2.25001 38.4575 2.18933C38.3784 2.03113 38.1705 1.85673 37.9878 1.79534C37.7969 1.73125 37.4467 1.74685 37.2516 1.82813C36.922 1.96541 36.6852 2.27746 36.6524 2.61805C36.6418 2.72598 37.049 4.5682 37.2792 5.45474C37.2976 5.52537 37.3078 5.58383 37.3018 5.58465C37.2959 5.58546 37.1602 5.54618 37.0003 5.49736C36.7386 5.41749 36.6655 5.41151 36.269 5.43766C36.0267 5.45364 35.6945 5.46163 35.5308 5.4554C35.1599 5.44132 35.1007 5.44955 34.8862 5.54496C34.5474 5.69566 34.2776 6.13026 34.2897 6.50604C34.2985 6.77718 34.3908 6.9588 34.5973 7.11101C34.8219 7.27662 35.0264 7.30796 35.6401 7.27094C35.8984 7.25535 36.17 7.24944 36.2437 7.2578C36.533 7.29066 36.6728 7.43749 36.8984 7.94542C37.0956 8.38944 37.2262 8.55529 37.5789 8.80982C37.9085 9.04772 38.2454 9.18905 38.6916 9.27638L38.9462 9.3263L38.9875 9.68333C39.0102 9.87971 39.0303 10.2889 39.0323 10.5927C39.0442 12.4248 38.7006 14.3576 37.9944 16.432C37.7808 17.0596 37.3712 18.1102 37.3091 18.1899C37.2866 18.2188 37.195 18.1712 37.0084 18.0336L36.7401 17.8358L36.7975 17.7268C37.0255 17.2932 36.8564 16.8707 36.2881 16.4543C35.8699 16.1477 35.3556 15.9986 34.9211 16.0581C34.6448 16.0958 34.4929 16.1765 34.3553 16.3587L34.2309 16.5236L34.0188 16.4439L33.8068 16.3642L33.7688 16.1242C33.6963 15.6667 33.3847 15.3592 32.7857 15.1539C32.1212 14.9263 31.4955 14.8676 31.0592 14.9919C30.5634 15.1332 30.427 15.2332 30.3123 15.5396C30.2613 15.6758 30.2327 15.7095 30.174 15.7028C30.1333 15.698 30.064 15.699 30.0201 15.7047C29.9608 15.7125 29.9119 15.6753 29.8304 15.5603C29.6234 15.2684 29.2711 15.0632 28.8332 14.9796C28.33 14.8835 27.3982 14.95 26.9953 15.1107C26.6828 15.2355 26.3374 15.4789 26.1551 15.7032L25.9912 15.9048L25.6146 15.9567C25.3739 15.9899 25.1637 15.9983 25.032 15.9798C24.8854 15.9592 24.7311 15.9682 24.4976 16.0106C24.203 16.0641 24.1423 16.0881 23.9068 16.2441C23.47 16.5337 23.1402 17.0575 23.1293 17.479C23.1259 17.6083 23.1109 17.6263 22.8688 17.7892C22.6197 17.9569 22.6074 17.9613 22.4657 17.933C22.0461 17.8492 21.2503 18.1289 20.7067 18.5514C20.2364 18.917 19.8357 19.4587 19.6521 19.9774C19.5335 20.3122 19.5209 20.4875 19.5995 20.7093L19.6626 20.8877L19.5195 21.1045C19.4409 21.2238 19.3621 21.3233 19.3444 21.3258C19.3267 21.3282 19.2429 21.2979 19.1582 21.2585C18.8531 21.1166 18.4472 21.2138 18.2414 21.478C17.9204 21.8902 17.9325 22.5108 18.2706 22.968L18.4044 23.1491L18.2782 23.4748L18.1519 23.8005L18.046 23.726C17.7957 23.5495 17.3585 23.5544 17.1143 23.7364C16.7727 23.9909 16.3779 25.1271 16.3009 26.0772C16.2822 26.3074 16.2979 26.5322 16.3677 27.039C16.4527 27.6558 16.4655 27.7095 16.5582 27.8341C16.7454 28.0861 17.1122 28.2274 17.3801 28.1506L17.491 28.1189L17.5004 28.3516C17.5056 28.4796 17.5199 28.6579 17.5322 28.7479C17.5541 28.9098 17.5525 28.9129 17.3947 29.0081C17.2163 29.1157 17.0185 29.3421 16.9541 29.5122C16.8134 29.8841 16.8929 30.2802 17.1741 30.6078C17.427 30.9023 17.4656 30.976 17.5209 31.2683L17.5713 31.5348L17.1356 31.8137C15.4137 32.9161 13.6338 33.7863 12.0342 34.3076C11.0629 34.6242 10.5593 34.7436 9.48789 34.9115L8.46479 35.0719L8.42858 34.9749C8.2166 34.4067 7.94285 33.999 7.58532 33.719C7.30994 33.5033 7.21639 33.4617 6.71784 33.3329C6.32575 33.2315 6.18015 33.1583 6.05773 33.001C5.96784 32.8854 5.94697 32.8104 5.85325 32.2659C5.75176 31.6763 5.74524 31.6548 5.61669 31.4854C5.46352 31.2836 5.25508 31.1636 4.99105 31.1252C4.59639 31.0677 4.25997 31.1938 4.03416 31.4837C3.83889 31.7344 3.81614 31.9237 3.93073 32.3435C3.97582 32.5087 4.05985 32.8767 4.11749 33.1613C4.18723 33.5058 4.25684 33.7509 4.32543 33.8938C4.38216 34.012 4.42195 34.1172 4.41384 34.1275C4.40575 34.1379 3.7219 34.1153 2.89417 34.0772C1.30003 34.004 1.23285 34.0075 0.981548 34.1787C0.700163 34.3705 0.565387 34.7719 0.651924 35.1603C0.729016 35.5064 0.977004 35.7741 1.29543 35.8551C1.37388 35.875 2.03242 35.919 2.75886 35.953C3.48529 35.9869 4.08944 36.0218 4.10143 36.0307C4.17264 36.0832 4.01883 36.1279 3.40558 36.2332C2.1849 36.4426 0.843352 36.7496 0.642786 36.8654C0.467869 36.9663 0.315272 37.1663 0.256402 37.3718C0.210667 37.5315 0.210154 37.6087 0.253445 37.8247C0.310786 38.1108 0.394336 38.2545 0.594675 38.4119C0.875852 38.6328 1.08316 38.6462 1.75655 38.4872C2.48371 38.3157 3.28443 38.1491 3.30613 38.1652C3.31627 38.1726 3.22928 38.2426 3.11283 38.3207C2.81908 38.5175 2.55399 38.7286 2.2317 39.0228C1.65024 39.5535 1.51601 39.8116 1.60502 40.2281C1.66079 40.4891 1.77192 40.6616 1.9913 40.828C2.19116 40.9795 2.40776 41.0394 2.64304 41.0078C2.89551 40.9741 3.01304 40.9002 3.38069 40.5443C3.79556 40.1427 4.29005 39.7613 4.67908 39.5426L4.99767 39.3636L5.21133 39.4815C5.67456 39.7372 6.21226 39.8428 6.70562 39.7748C7.26688 39.6975 7.67083 39.4667 8.04814 39.0081C8.40726 38.5715 8.67848 37.9408 8.81583 37.2227L8.87332 36.9221L9.23392 36.8719C9.73725 36.8018 10.7491 36.601 11.2932 36.4632C13.5415 35.8937 15.8033 34.8739 18.1918 33.3528C18.4882 33.1641 18.7379 33.0086 18.7466 33.0074C18.7552 33.0062 18.805 33.0886 18.8571 33.1905L18.9518 33.3757L18.8554 33.4654C18.4445 33.8476 18.4317 34.3647 18.819 34.9372C19.2971 35.6441 20.0719 36.2781 20.6547 36.4393C20.827 36.487 21.1023 36.4564 21.2425 36.374C21.2793 36.3525 21.4331 36.458 21.7793 36.7421L22.2645 37.1404L22.1519 37.2725C21.9366 37.5254 21.8948 37.9134 22.0542 38.1783C22.1512 38.3392 22.6479 38.7094 22.9951 38.8795C23.9632 39.3538 25.0961 39.3612 25.3246 38.8944L25.3703 38.8012L25.7384 38.9204C25.9409 38.986 26.2426 39.0747 26.4088 39.1178C26.5749 39.1607 26.7306 39.2062 26.7547 39.2186C26.7865 39.235 26.7921 39.3322 26.7752 39.572C26.7041 40.577 26.6933 42.0211 26.7481 43.1845C26.7644 43.5306 26.8528 44.4167 26.9494 45.2036C27.1326 46.6957 27.281 47.5349 27.5675 48.7019C27.6566 49.0647 27.7312 49.3736 27.7332 49.3884C27.7353 49.4033 27.3632 49.468 26.9063 49.5322C26.3148 49.6154 25.9547 49.6836 25.6552 49.7689C22.2494 50.7398 19.8773 53.0194 19.3346 55.8428C19.2497 56.285 19.1961 56.9412 19.2267 57.1637C19.2565 57.3794 19.3834 57.5834 19.5675 57.7114Z" fill="white"/>
</svg>
