<svg width="39" height="54" viewBox="0 0 39 54" fill="none" xmlns="http://www.w3.org/2000/svg">
<path fill-rule="evenodd" clip-rule="evenodd" d="M5.64003 53.6196C5.43716 53.5527 5.01132 53.1876 4.92717 53.0077C4.78106 52.6964 4.89845 52.1494 5.28534 51.3408C6.08539 49.669 7.58259 48.447 9.5705 47.8441C10.4509 47.5768 11.1035 47.4888 12.1502 47.4962C12.9063 47.5017 13.4259 47.5497 13.8082 47.6498L13.8766 47.6676C13.879 47.6656 13.8814 47.6631 13.8838 47.6598C13.8861 47.6567 13.8885 47.6529 13.8909 47.6485L13.893 47.2287C13.8979 46.2586 14.0326 44.638 14.21 43.4281C14.5845 40.8778 15.4068 38.0721 16.4402 35.8196C16.5704 35.5364 16.684 35.2725 16.6936 35.2333C16.7069 35.1746 16.6587 35.1358 16.4183 35.0098C16.0589 34.8206 15.3901 34.3695 15.0219 34.0673C14.6007 33.7215 13.9261 33.0243 13.5669 32.5649C12.0902 30.6718 11.2575 28.2867 11.0782 25.431C11.0083 24.3121 11.0519 22.6962 11.1868 21.4969C11.2784 20.6737 11.5314 19.2455 11.6661 18.7824C11.6841 18.7177 11.6916 18.6457 11.6822 18.6222C11.6717 18.5989 11.4812 18.4325 11.2588 18.2527C10.1692 17.3722 8.78782 16.0223 8.0093 15.077C7.01943 13.874 6.2282 12.6402 5.65203 11.3997L5.42295 10.9074L5.23025 10.9347C5.12384 10.9497 4.78706 10.9599 4.47989 10.9575C4.00969 10.9536 3.87981 10.9402 3.64623 10.8711C2.88061 10.6451 2.40701 10.1469 2.25832 9.41366C2.1984 9.11468 2.19603 8.88432 2.25103 8.52103L2.29259 8.24573L2.10331 8.06409C1.73296 7.70739 1.38561 7.46972 0.54093 6.99179C0.489092 6.96288 0.404481 6.87095 0.350557 6.78748C0.272025 6.66398 0.251163 6.58764 0.241597 6.37729C0.228962 6.07288 0.275886 5.90432 0.423246 5.73487C0.593192 5.53821 0.77673 5.45924 1.06146 5.45946C1.28594 5.45963 1.33548 5.47476 1.66898 5.64308C1.86932 5.74397 2.21206 5.94992 2.42987 6.10075C2.64768 6.25157 2.83257 6.36822 2.84088 6.35996C2.8492 6.3517 2.69592 6.05858 2.50039 5.70858C1.85642 4.55649 1.83782 4.4995 2.00266 4.14428C2.1484 3.82833 2.47197 3.6247 2.82522 3.62649C3.22336 3.62851 3.36922 3.75467 3.76038 4.43559C4.06254 4.96006 4.5927 5.95273 4.76923 6.32284C4.83117 6.45535 4.90269 6.56386 4.92632 6.56398C4.95113 6.56411 4.96422 6.54415 4.95607 6.51963C4.94792 6.49511 4.80897 5.93918 4.64688 5.28422C4.32963 4.0088 4.32399 3.95607 4.46362 3.67979C4.62115 3.36934 4.94338 3.20029 5.33078 3.2247C5.62251 3.24301 5.81095 3.3547 5.94092 3.58629C5.99478 3.68196 6.14452 4.21083 6.34135 5.00448C6.51504 5.70057 6.66098 6.27534 6.66567 6.28176C6.67036 6.28816 6.74042 6.22131 6.82002 6.13317C7.00892 5.92639 7.22822 5.78567 7.6533 5.60004C7.84157 5.51765 8.08559 5.38959 8.19584 5.31547C8.53845 5.08556 8.86322 5.11075 9.13119 5.38809C9.40738 5.67297 9.48175 6.15349 9.30508 6.51124C9.19406 6.73584 9.03749 6.85849 8.66928 7.01063L8.65744 7.01568C8.2845 7.16985 8.1081 7.24246 8.02946 7.37351C7.95798 7.49021 7.96424 7.65325 7.9745 7.96146L7.97444 7.9728C7.99403 8.53528 7.95761 8.72928 7.75837 9.11123C7.62235 9.37379 7.31452 9.73502 7.08327 9.90412C6.89591 10.0414 6.90052 10.0627 7.24771 10.7943C8.22383 12.846 9.67146 14.6433 11.87 16.5318C12.1712 16.7909 12.2183 16.82 12.2422 16.762C12.2566 16.7255 12.35 16.4717 12.4507 16.198C13.3288 13.7994 14.6771 11.4177 16.238 9.51294C16.7219 8.92152 17.2041 8.65579 17.7877 8.65875C18.1634 8.66066 18.4088 8.7335 18.9072 8.9916C21.3382 10.2512 23.952 12.5014 25.8464 14.9663L26.31 15.5701L26.4309 15.7271L26.5141 15.6246C26.5605 15.5681 26.8126 15.2347 27.0755 14.8836C28.5719 12.8822 29.6051 10.8952 30.1573 8.95289C30.2764 8.53355 30.437 7.84935 30.4821 7.56226L30.5053 7.41633L30.3121 7.31869C29.8372 7.07798 29.4691 6.74149 29.2525 6.34878C29.1741 6.20716 29.1253 6.04513 29.0782 5.76932C28.9428 4.98152 28.9299 4.96704 28.1628 4.7948C27.6436 4.67789 27.4738 4.60284 27.3188 4.41956C27.2189 4.30267 27.1396 4.10131 27.1391 3.96807C27.1399 3.81246 27.2582 3.53927 27.3937 3.38436C27.6706 3.06607 28.0243 2.97643 28.4241 3.12323C28.5338 3.16338 28.8016 3.22931 29.0188 3.26975C29.3953 3.34004 29.5816 3.4127 29.8501 3.59469L29.9619 3.67134L29.9626 3.53433C29.963 3.45897 29.9826 2.86065 30.006 2.20471C30.0543 0.83853 30.0677 0.761677 30.3075 0.537859C30.4594 0.395868 30.7282 0.285629 30.9195 0.286599C31.1287 0.287659 31.388 0.401329 31.5302 0.554449C31.7582 0.798475 31.7626 0.844892 31.714 2.28342C31.6904 2.97652 31.678 3.55138 31.6874 3.56092C31.7215 3.59548 31.7419 3.53309 31.8805 2.99432C32.2229 1.65178 32.5278 0.693765 32.6718 0.499521C32.9822 0.0829122 33.6156 0.0538383 33.9894 0.439171C34.1445 0.599461 34.2263 0.783012 34.2254 0.968908C34.2251 1.01183 34.1673 1.23586 34.0964 1.46674C33.9366 1.9896 33.6937 2.83544 33.6935 2.86879C33.6934 2.8825 33.9333 2.65165 34.2278 2.3558C34.8572 1.72058 35.0765 1.5783 35.4238 1.57595C35.9673 1.57229 36.3557 2.09494 36.2335 2.66559C36.196 2.84011 36.1674 2.88185 35.9431 3.08936C35.2807 3.7012 34.6329 4.47788 34.6486 4.643C34.6508 4.67595 34.7031 4.84737 34.7648 5.02395C34.8941 5.39841 34.9341 5.8844 34.8627 6.22676C34.7186 6.91689 34.1641 7.45581 33.3263 7.71944C33.0033 7.82118 32.5113 7.91444 32.3046 7.91339L32.3022 7.91338C32.2573 7.91315 32.2254 7.91299 32.1982 7.92568C32.1318 7.95825 32.1052 8.07534 32.011 8.49252L32.011 8.49362L32.0098 8.4994C31.3994 11.2083 30.0043 13.9628 27.8818 16.6477C27.6416 16.9514 27.4441 17.2163 27.444 17.2365C27.4439 17.2568 27.5446 17.4495 27.6675 17.665C28.4463 19.0228 29.1531 20.591 29.6081 21.9644C31.0487 26.3223 30.4996 30.2307 28.0563 33.0284C27.6273 33.5182 26.9378 34.1221 26.3913 34.4854L26.306 34.5425L26.6052 35.1808C27.8523 37.8458 28.6828 40.6653 29.0791 43.5783C29.2295 44.6881 29.3059 45.69 29.3451 47.0397C29.3632 47.6647 29.3711 47.7419 29.422 47.727C29.9107 47.5802 31.6157 47.5428 32.3511 47.6625C34.5598 48.0219 36.3197 49.0488 37.407 50.6136C37.6791 51.0048 38.0744 51.8154 38.215 52.2677C38.3406 52.6756 38.3497 52.9635 38.2423 53.1868C38.1694 53.3388 37.8608 53.6159 37.612 53.753C37.4971 53.8161 37.2667 53.8174 31.206 53.7867L24.9184 53.7549L24.691 53.6432C24.3716 53.4863 24.2282 53.3423 24.0786 53.0279C23.9523 52.7649 23.9488 52.7452 23.953 52.3809C23.9576 51.9387 24.0205 51.6641 24.2127 51.2587C24.4958 50.6607 24.9579 50.1569 26.0079 49.3013C26.346 49.0251 26.696 48.7308 26.785 48.6473L26.9453 48.4953L26.9848 47.9293C27.0345 47.2143 27.0443 45.276 27.0029 44.5967C26.8337 41.8481 26.2717 39.2111 25.3353 36.7726C25.1254 36.2256 24.7892 35.4254 24.754 35.388C24.7387 35.3722 24.54 35.4219 24.3115 35.4983C24.0831 35.5749 23.6998 35.6792 23.4609 35.7302C23.2208 35.7812 22.8601 35.8595 22.6578 35.9043C21.8606 36.082 21.5722 36.1114 20.6719 36.1075C19.7799 36.1038 19.5154 36.0768 18.7955 35.9166C18.5772 35.8681 18.3943 35.8327 18.3907 35.8379C18.3658 35.865 18.0559 36.6258 17.8799 37.0909C16.5926 40.484 16.0141 44.3709 16.2592 47.9939C16.2614 48.0303 16.2635 48.0638 16.2657 48.0949C16.2733 48.2253 16.2788 48.3123 16.3068 48.3911C16.3639 48.5492 16.5133 48.6739 16.9651 49.049L17.1392 49.1935C17.951 49.8695 18.3037 50.206 18.5948 50.5819C18.9763 51.0742 19.1724 51.5341 19.2323 52.0748C19.3113 52.7964 19.0344 53.3579 18.4659 53.6266L18.2658 53.7211L12.0314 53.6961C6.71371 53.6749 5.77332 53.6636 5.64003 53.6196Z" fill="#FA2458"/>
</svg>
