[{"full_formula": "Cs1", "elasticity": {"elastic_tensor": [[1.7337323110057519, 1.7023490526740828, 1.7023718291709649, 0.0, 0.0, 0.0], [1.7023490526740828, 1.7336816786655593, 1.7023580589859229, 0.0, 0.0, 0.0], [1.7023718291709649, 1.7023580589859229, 1.7337004980846995, 0.0, 0.0, 0.0], [0.0, 0.0, 0.0, 1.3915433366666674, 0.0, 0.0], [0.0, 0.0, 0.0, 0.0, 1.3915424333333337, 0.0], [0.0, 0.0, 0.0, 0.0, 0.0, 1.3915425800000003]], "compliance_tensor": [[21325.061791372846, -10560.737115780472, -10569.892857115246, 0.0, 0.0, 0.0], [-10560.737115780394, 21333.162553274942, -10577.593912731068, 0.0, 0.0, 0.0], [-10569.892857115323, -10577.59391273099, 21342.060015673425, 0.0, 0.0, 0.0], [0.0, 0.0, 0.0, 718.6265591953617, 0.0, 0.0], [0.0, 0.0, 0.0, 0.0, 718.6270256987968, 0.0], [0.0, 0.0, 0.0, 0.0, 0.0, 718.6269499565007]], "G_Voigt_Reuss_Hill": 0.4398619958736719, "G_Reuss": 0.03853048612725301, "K_Voigt_Reuss_Hill": 1.7128080414669173, "K_Reuss": 1.7128080418873957, "K_Voigt": 1.712808041046439, "K_VRH": 1.7128080414669173, "state": "filter_failed", "G_VRH": 0.4398619958736719, "homogeneous_poisson": 0.381721199023393, "universal_anisotropy": 104.15947216940542, "warnings": ["Shear modulus (Reuss) is less than 2 GPa", "c11/c13 is less than 0.1", "Bulk modulus (Reuss) is less than 2 GPa", "c11/c12 is less than 0.1", "c11/c23 is less than 0.1", "Shear modulus (Voigt) is less than 2 GPa", "Bulk modulus (Voigt) is less than 2 GPa"], "poisson_ratio": 0.381721199023393, "G_Voigt": 0.8411935056200909, "_id": "580730fb35dc55d256254fda", "elastic_anisotropy": 104.15947216940542}}, {"full_formula": "Mn1Sn1Au1", "elasticity": {"elastic_tensor": [[93.56348699858584, 73.26548398334027, 73.26479545401327, 0.0, 0.0, 0.0], [73.26548398334027, 93.5649736185736, 73.26576436585063, 0.0, 0.0, 0.0], [73.26479545401327, 73.26576436585063, 93.5638956461872, 0.0, 0.0, 0.0], [0.0, 0.0, 0.0, 31.74861668333334, 0.0, 0.0], [0.0, 0.0, 0.0, 0.0, 31.748605093333335, 0.0], [0.0, 0.0, 0.0, 0.0, 0.0, 31.74841596333334]], "compliance_tensor": [[34.2310322514071, -15.033079365663504, -15.03271658225953, 0.0, 0.0, 0.0], [-15.033079365663504, 34.231061375784726, -15.033249548531902, 0.0, 0.0, 0.0], [-15.032716582259532, -15.033249548531902, 34.23106105697602, 0.0, 0.0, 0.0], [0.0, 0.0, 0.0, 31.497435304794145, 0.0, 0.0], [0.0, 0.0, 0.0, 0.0, 31.497446803103262, 0.0], [0.0, 0.0, 0.0, 0.0, 0.0, 31.497634438042926]], "G_Voigt_Reuss_Hill": 20.129335151179436, "G_Reuss": 17.14978859034937, "K_Voigt_Reuss_Hill": 80.03160486563638, "K_Reuss": 80.03160485685554, "K_Voigt": 80.03160487441723, "K_VRH": 80.03160486563638, "state": "successful", "G_VRH": 20.129335151179436, "homogeneous_poisson": 0.38396925206212174, "universal_anisotropy": 1.7373663503251926, "warnings": null, "poisson_ratio": 0.38396925206212174, "G_Voigt": 23.108881712009502, "_id": "55f6f06dab7a8430f329ae6e", "elastic_anisotropy": 1.7373663503251926}}, {"full_formula": "Fe1Si1Ru2", "elasticity": {"elastic_tensor": [[381.699631263875, 164.35925044339163, 165.45122085774557, 0.0, 0.0, 3.205083540476193], [164.35925044339163, 379.52038843644095, 164.36632128655572, 0.0, 0.0, 1.5107174595238106], [165.45122085774557, 164.36632128655572, 381.70996899102533, 0.0, 0.0, 4.2525739202381], [0.0, 0.0, 0.0, 121.93677541333335, 0.0, 0.0], [0.0, 0.0, 0.0, 0.0, 121.93706587666668, 0.0], [3.205083540476193, 1.5107174595238106, 4.2525739202381, 0.0, 0.0, 121.84619653809533]], "compliance_tensor": [[3.547548204317769, -1.069962558145834, -1.076471029474599, 0.0, 0.0, -0.04247982097351117], [-1.0699625581458343, 3.5616519796724617, -1.0701311995955345, 0.0, 0.0, 0.021334121688571826], [-1.076471029474599, -1.0701311995955345, 3.5481042012655215, 0.0, 0.0, -0.08224901730007679], [0.0, 0.0, 0.0, 8.200971336254096, 0.0, 0.0], [0.0, 0.0, 0.0, 0.0, 8.200951800918768, 0.0], [-0.042479820973511155, 0.02133412168857183, -0.08224901730007679, 0.0, 0.0, 8.210791309009215]], "G_Voigt_Reuss_Hill": 116.18667249493302, "G_Reuss": 115.97912435067039, "K_Voigt_Reuss_Hill": 236.77095650756337, "K_Reuss": 236.73262702993486, "K_Voigt": 236.8092859851919, "K_VRH": 236.77095650756337, "state": "successful", "G_VRH": 116.18667249493302, "homogeneous_poisson": 0.2891347788082823, "universal_anisotropy": 0.018219122712933356, "warnings": null, "poisson_ratio": 0.2891347788082823, "G_Voigt": 116.39422063919565, "_id": "55f6f074ab7a8430eb29ae6f", "elastic_anisotropy": 0.018219122712933356}}, {"full_formula": "K1V1F3", "elasticity": {"elastic_tensor": [[148.24958094275763, 27.61180718779714, 27.611923074820275, 0.0, 0.0, 0.0], [27.61180718779714, 148.24937632200852, 27.611757765362633, 0.0, 0.0, 0.0], [27.611923074820275, 27.611757765362633, 148.2493001643369, 0.0, 0.0, 0.0], [0.0, 0.0, 0.0, 22.359252026666667, 0.0, 0.0], [0.0, 0.0, 0.0, 0.0, 22.359182200000003, 0.0], [0.0, 0.0, 0.0, 0.0, 0.0, 22.35925681666667]], "compliance_tensor": [[7.164405118862016, -1.1248759661657566, -1.1248835585743717, 0.0, 0.0, 0.0], [-1.1248759661657566, 7.164412280035033, -1.124875649167822, 0.0, 0.0, 0.0], [-1.1248835585743717, -1.124875649167822, 7.164418253921499, 0.0, 0.0, 0.0], [0.0, 0.0, 0.0, 44.72421522899578, 0.0, 0.0], [0.0, 0.0, 0.0, 0.0, 44.724354900600964, 0.0], [0.0, 0.0, 0.0, 0.0, 0.0, 44.724205647774326]], "G_Voigt_Reuss_Hill": 33.71207038432842, "G_Reuss": 29.881084599915308, "K_Voigt_Reuss_Hill": 67.82435927608013, "K_Reuss": 67.82435927604213, "K_Voigt": 67.82435927611813, "K_VRH": 67.82435927608013, "state": "successful", "G_VRH": 33.71207038432842, "homogeneous_poisson": 0.28679902195573914, "universal_anisotropy": 1.2820772189866627, "warnings": null, "poisson_ratio": 0.28679902195573914, "G_Voigt": 37.543056168741536, "_id": "55f6eec3ab7a8430f729ae06", "elastic_anisotropy": 1.2820772189866627}}, {"full_formula": "Sr1O1", "elasticity": {"elastic_tensor": [[165.55592324415716, 48.35991566786198, 48.36036216963791, 0.0, 0.0, 0.0], [48.35991566786198, 165.55472292970896, 48.36004649080111, 0.0, 0.0, 0.0], [48.36036216963791, 48.36004649080111, 165.55525348067454, 0.0, 0.0, 0.0], [0.0, 0.0, 0.0, 54.33535104666666, 0.0, 0.0], [0.0, 0.0, 0.0, 0.0, 54.335416346666676, 0.0], [0.0, 0.0, 0.0, 0.0, 0.0, 54.33542725666669]], "compliance_tensor": [[6.959416658690846, -1.5733175685735457, -1.5733369607210639, 0.0, 0.0, 0.0], [-1.573317568573546, 6.959463347406436, -1.573334328758925, 0.0, 0.0, 0.0], [-1.5733369607210639, -1.573334328758925, 6.95945095245315, 0.0, 0.0, 0.0], [0.0, 0.0, 0.0, 18.404224519339834, 0.0, 0.0], [0.0, 0.0, 0.0, 0.0, 18.40420240124556, 0.0], [0.0, 0.0, 0.0, 0.0, 0.0, 18.40419870586929]], "G_Voigt_Reuss_Hill": 56.00196026301299, "G_Reuss": 55.96364324094332, "K_Voigt_Reuss_Hill": 87.4251720340115, "K_Reuss": 87.42517203345159, "K_Voigt": 87.4251720345714, "K_VRH": 87.4251720340115, "state": "successful", "G_VRH": 56.00196026301299, "homogeneous_poisson": 0.23607010664439057, "universal_anisotropy": 0.006846770496405696, "warnings": null, "poisson_ratio": 0.23607010664439057, "G_Voigt": 56.04027728508265, "_id": "55f6f16aab7a8430f729aeb8", "elastic_anisotropy": 0.006846770496405696}}, {"full_formula": "Ti1B1", "elasticity": {"elastic_tensor": [[74.71681332650024, 114.93061526792687, 114.90130098606974, -0.0015998300000001032, -0.001253963333333326, 0.0021052349999999918], [114.93061526792687, 74.69407605179738, 114.89035177307153, -0.0016297199999999957, -0.001254900000000389, 0.000958015000000183], [114.90130098606974, 114.89035177307153, 74.63574898691215, 0.0, -0.0012631900000000273, 0.0020652766666670913], [-0.0015998300000001032, -0.0016297199999999957, 0.0, 1.2949961700000001, 0.0, 0.0], [-0.001253963333333326, -0.001254900000000389, -0.0012631900000000273, 0.0, 1.2906368766666667, 0.0], [0.0021052349999999918, 0.000958015000000183, 0.0020652766666670913, 0.0, 0.0, 1.2945416]], "compliance_tensor": [[-15.475933664501602, 9.383290869718978, 9.380964619765034, -0.007310234869870555, 0.003268757558645963, 0.0032574128676908522], [9.383290869718982, -15.477595539751972, 9.379876534668545, -0.007886105771989295, 0.0032480354229790873, -0.018769813041437655], [9.380964619765034, 9.379876534668549, -15.482424587861708, 0.0233935217072647, 0.003081384767938446, 0.0025030426021770747], [-0.007310234869870554, -0.0078861057719893, 0.023393521707264702, 772.2030370581887, 8.125772831116847e-06, -1.9597148987532142e-05], [0.003268757558645964, 0.0032480354229790873, 0.0030813847679384454, 8.125772831116847e-06, 774.8112812721891, -1.2635423641054547e-05], [0.0032574128676908544, -0.018769813041437655, 0.0025030426021770734, -1.9597148987532136e-05, -1.2635423641054549e-05, 772.4742147758461]], "G_Voigt_Reuss_Hill": -2.5057221678402053, "G_Reuss": 2.2521942464627682, "K_Voigt_Reuss_Hill": 101.49901944114647, "K_Reuss": 101.4990195023656, "K_Voigt": 101.49901937992735, "K_VRH": 101.49901944114647, "state": "filter_failed", "G_VRH": -2.5057221678402053, "homogeneous_poisson": 0.5124459969600708, "universal_anisotropy": -21.12569296386092, "warnings": ["c11/c13 is less than 0.1", "c11/c12 is less than 0.1", "c11/c23 is less than 0.1", "Shear modulus (Voigt) is less than 2 GPa", "One or more eigenvalues of the elastic tensor is negative"], "poisson_ratio": 0.5124459969600708, "G_Voigt": -7.263638582143178, "_id": "58ac5f6448a464edfdf68a33", "elastic_anisotropy": -21.12569296386092}}, {"full_formula": "Mo1Pt3", "elasticity": {"elastic_tensor": [[346.2402900927191, 195.422045595094, 195.4215332042262, 0.0, 0.0, 0.0], [195.422045595094, 346.2426959606861, 195.42072025899904, 0.0, 0.0, 0.0], [195.4215332042262, 195.42072025899904, 346.2554060502918, 0.0, 0.0, 0.0], [0.0, 0.0, 0.0, 129.28132043000002, 0.0, 0.0], [0.0, 0.0, 0.0, 0.0, 129.28132614333336, 0.0], [0.0, 0.0, 0.0, 0.0, 0.0, 129.28131044333335]], "compliance_tensor": [[4.872509222889532, -1.7579697545518682, -1.7578050670849021, 0.0, 0.0, 0.0], [-1.7579697545518682, 4.872440590874961, -1.7577507651631699, 0.0, 0.0, 0.0], [-1.7578050670849021, -1.7577507651631694, 4.872166188223651, 0.0, 0.0, 0.0], [0.0, 0.0, 0.0, 7.735069511000661, 0.0, 0.0], [0.0, 0.0, 0.0, 0.0, 7.735069169164513, 0.0], [0.0, 0.0, 0.0, 0.0, 0.0, 7.735070108515959]], "G_Voigt_Reuss_Hill": 104.14243081151812, "G_Reuss": 100.55095397186504, "K_Voigt_Reuss_Hill": 245.69633220773642, "K_Reuss": 245.69633216876895, "K_Voigt": 245.69633224670392, "K_VRH": 245.69633220773642, "state": "successful", "G_VRH": 104.14243081151812, "homogeneous_poisson": 0.3143036016930097, "universal_anisotropy": 0.35717978805526585, "warnings": null, "poisson_ratio": 0.3143036016930097, "G_Voigt": 107.7339076511712, "_id": "57be63f735dc55d256230a8f", "elastic_anisotropy": 0.35717978805526585}}, {"full_formula": "Sc1Pt3", "elasticity": {"elastic_tensor": [[289.3235462499531, 154.60966242127427, 154.61047641732057, 0.0, 0.0, 0.0], [154.60966242127427, 289.32358025646164, 154.6105156022501, 0.0, 0.0, 0.0], [154.61047641732057, 154.6105156022501, 289.32451570484983, 0.0, 0.0, 0.0], [0.0, 0.0, 0.0, 109.92321778666667, 0.0, 0.0], [0.0, 0.0, 0.0, 0.0, 109.92335138666668, 0.0], [0.0, 0.0, 0.0, 0.0, 0.0, 109.92330556333334]], "compliance_tensor": [[5.505675160017404, -1.917463652675702, -1.917483605386831, 0.0, 0.0, 0.0], [-1.9174636526757018, 5.505675369724158, -1.9174847228104273, 0.0, 0.0, 0.0], [-1.9174836053868312, -1.917484722810427, 5.505673625768435, 0.0, 0.0, 0.0], [0.0, 0.0, 0.0, 9.097259160851245, 0.0, 0.0], [0.0, 0.0, 0.0, 0.0, 9.097248104112087, 0.0], [0.0, 0.0, 0.0, 0.0, 0.0, 9.097251896449206]], "G_Voigt_Reuss_Hill": 90.32003497713075, "G_Reuss": 87.7433624889002, "K_Voigt_Reuss_Hill": 199.5147723427835, "K_Reuss": 199.5147723419054, "K_Voigt": 199.51477234366158, "K_VRH": 199.5147723427835, "state": "successful", "G_VRH": 90.32003497713075, "homogeneous_poisson": 0.30332840265100824, "universal_anisotropy": 0.2936601031939876, "warnings": null, "poisson_ratio": 0.30332840265100824, "G_Voigt": 92.8967074653613, "_id": "55f6f0acab7a8430ee29ae83", "elastic_anisotropy": 0.2936601031939876}}, {"full_formula": "Ta1Cu3S4", "elasticity": {"elastic_tensor": [[89.28977510814025, 12.48886933223504, 12.490918343859349, 0.0, 0.0, 0.0], [12.48886933223504, 89.28961124608693, 12.490718002661268, 0.0, 0.0, 0.0], [12.490918343859349, 12.490718002661268, 89.29402303459565, 0.0, 0.0, 0.0], [0.0, 0.0, 0.0, 18.030940906666668, 0.0, 0.0], [0.0, 0.0, 0.0, 0.0, 17.98694485666667, 0.0], [0.0, 0.0, 0.0, 0.0, 0.0, 17.99106876]], "compliance_tensor": [[11.597636291379818, -1.4230502255604636, -1.423277891478432, 0.0, 0.0, 0.0], [-1.4230502255604636, 11.597650574466066, -1.423250676062982, 0.0, 0.0, 0.0], [-1.4232778914784319, -1.423250676062982, 11.597142065865556, 0.0, 0.0, 0.0], [0.0, 0.0, 0.0, 55.460222801255206, 0.0, 0.0], [0.0, 0.0, 0.0, 0.0, 55.59587845344178, 0.0], [0.0, 0.0, 0.0, 0.0, 0.0, 55.58313479537833]], "G_Voigt_Reuss_Hill": 24.510878663096953, "G_Reuss": 22.86001933024625, "K_Voigt_Reuss_Hill": 38.090491191592726, "K_Reuss": 38.090491189148324, "K_Voigt": 38.09049119403713, "K_VRH": 38.090491191592726, "state": "successful", "G_VRH": 24.510878663096953, "homogeneous_poisson": 0.2350792993360756, "universal_anisotropy": 0.7221600775113259, "warnings": null, "poisson_ratio": 0.2350792993360756, "G_Voigt": 26.161737995947654, "_id": "56f04e620750796bcb963299", "elastic_anisotropy": 0.7221600775113259}}, {"full_formula": "Li2O1", "elasticity": {"elastic_tensor": [[196.7503863220274, 18.815288269878526, 18.77426781428109, 0.0, 0.0, 0.0], [18.815288269878526, 196.8424344135069, 18.820344863047687, 0.0, 0.0, 0.0], [18.77426781428109, 18.820344863047687, 196.76003055515355, 0.0, 0.0, 0.0], [0.0, 0.0, 0.0, 59.145300080000005, 0.0, 0.0], [0.0, 0.0, 0.0, 0.0, 59.145380820000014, 0.0], [0.0, 0.0, 0.0, 0.0, 0.0, 59.14534349666668]], "compliance_tensor": [[5.168656679740369, -0.4510201518841903, -0.4500374882898426, 0.0, 0.0, 0.0], [-0.4510201518841903, 5.166450691871296, -0.4511424925447726, 0.0, 0.0, 0.0], [-0.45003748828984264, -0.45114249254477257, 5.168426629912676, 0.0, 0.0, 0.0], [0.0, 0.0, 0.0, 16.90751418366969, 0.0, 0.0], [0.0, 0.0, 0.0, 0.0, 16.907491103038936, 0.0], [0.0, 0.0, 0.0, 0.0, 0.0, 16.907501772415237]], "G_Voigt_Reuss_Hill": 69.69570291958016, "G_Reuss": 68.30867848268417, "K_Voigt_Reuss_Hill": 78.13029479354208, "K_Reuss": 78.13029478873945, "K_Voigt": 78.13029479834472, "K_VRH": 78.13029479354208, "state": "successful", "G_VRH": 69.69570291958016, "homogeneous_poisson": 0.15620465109116877, "universal_anisotropy": 0.20305244788001175, "warnings": null, "poisson_ratio": 0.15620465109116877, "G_Voigt": 71.08272735647616, "_id": "576b522435dc55d2562184b8", "elastic_anisotropy": 0.20305244788001175}}, {"full_formula": "Mn1Pt3", "elasticity": {"elastic_tensor": [[306.3962008245211, 172.60525657850715, 172.6087726231919, 0.0, 0.0, 0.0], [172.60525657850715, 306.3939723078566, 172.6078906834528, 0.0, 0.0, 0.0], [172.6087726231919, 172.6078906834528, 306.40013888329446, 0.0, 0.0, 0.0], [0.0, 0.0, 0.0, 113.07433648666671, 0.0, 0.0], [0.0, 0.0, 0.0, 0.0, 113.07409992000004, 0.0], [0.0, 0.0, 0.0, 0.0, 0.0, 113.07406568333336]], "compliance_tensor": [[5.494503445452636, -1.9798900125203456, -1.9799431529571752, 0.0, 0.0, 0.0], [-1.9798900125203456, 5.4945358846336445, -1.9799399130565332, 0.0, 0.0, 0.0], [-1.9799431529571752, -1.9799399130565332, 5.494477958476167, 0.0, 0.0, 0.0], [0.0, 0.0, 0.0, 8.843739712042582, 0.0, 0.0], [0.0, 0.0, 0.0, 0.0, 8.843758214370048, 0.0], [0.0, 0.0, 0.0, 0.0, 0.0, 8.843760892091066]], "G_Voigt_Reuss_Hill": 91.6046738454312, "G_Reuss": 88.606954464161, "K_Voigt_Reuss_Hill": 217.2037946225915, "K_Reuss": 217.20379460229682, "K_Voigt": 217.20379464288618, "K_VRH": 217.2037946225915, "state": "successful", "G_VRH": 91.6046738454312, "homogeneous_poisson": 0.31511835038799746, "universal_anisotropy": 0.3383164900604374, "warnings": null, "poisson_ratio": 0.31511835038799746, "G_Voigt": 94.60239322670137, "_id": "55f6f12eab7a8430eb29aeac", "elastic_anisotropy": 0.3383164900604374}}, {"full_formula": "Ti4S8", "elasticity": {"elastic_tensor": [[79.66165082548926, 30.807702698484896, 30.71845466826757, 0.0, 0.0, 0.0], [30.807702698484896, 79.7181822691249, 30.767978772581976, 0.0, 0.0, 0.0], [30.71845466826757, 30.767978772581976, 79.56111613159689, 0.0, 0.0, 0.0], [0.0, 0.0, 0.0, 36.405745676666676, 0.0, 0.0], [0.0, 0.0, 0.0, 0.0, 36.40573995333334, 0.0], [0.0, 0.0, 0.0, 0.0, 0.0, 36.40573624000001]], "compliance_tensor": [[15.995269429897597, -4.464229122492025, -4.4493424580260905, 0.0, 0.0, 0.0], [-4.464229122492024, 15.990963221432283, -4.4604125014430425, 0.0, 0.0, 0.0], [-4.44934245802609, -4.460412501443042, 16.01177640161221, 0.0, 0.0, 0.0], [0.0, 0.0, 0.0, 27.468191666265586, 0.0, 0.0], [0.0, 0.0, 0.0, 0.0, 27.46819598453016, 0.0], [0.0, 0.0, 0.0, 0.0, 0.0, 27.46819878624709]], "G_Voigt_Reuss_Hill": 31.036218656398617, "G_Reuss": 30.447242209551725, "K_Voigt_Reuss_Hill": 47.05880859436337, "K_Reuss": 47.05881479929564, "K_Voigt": 47.05880238943111, "K_VRH": 47.05880859436337, "state": "successful", "G_VRH": 31.036218656398617, "homogeneous_poisson": 0.2296695133152318, "universal_anisotropy": 0.19344137635522873, "warnings": null, "poisson_ratio": 0.2296695133152318, "G_Voigt": 31.625195103245506, "_id": "57bfc95135dc55d256236026", "elastic_anisotropy": 0.19344137635522873}}, {"full_formula": "Nb1Ag1O3", "elasticity": {"elastic_tensor": [[375.91350058646003, 97.45131184823356, 97.451032128782, 0.0, 0.0, 0.0], [97.45131184823356, 375.91249920249277, 97.45170969700817, 0.0, 0.0, 0.0], [97.451032128782, 97.45170969700817, 375.9126750759286, 0.0, 0.0, 0.0], [0.0, 0.0, 0.0, 53.45897809666667, 0.0, 0.0], [0.0, 0.0, 0.0, 0.0, 53.45899385000001, 0.0], [0.0, 0.0, 0.0, 0.0, 0.0, 53.45902006333335]], "compliance_tensor": [[2.9780597999482015, -0.6130927477732435, -0.6130893690304432, 0.0, 0.0, 0.0], [-0.6130927477732437, 2.9780712883221314, -0.6130988201949779, 0.0, 0.0, 0.0], [-0.6130893690304433, -0.6130988201949779, 2.9780685629030703, 0.0, 0.0, 0.0], [0.0, 0.0, 0.0, 18.705931830416954, 0.0, 0.0], [0.0, 0.0, 0.0, 0.0, 18.705926318140005, 0.0], [0.0, 0.0, 0.0, 0.0, 0.0, 18.705917145793013]], "G_Voigt_Reuss_Hill": 79.353692941037, "G_Reuss": 70.93967940068346, "K_Voigt_Reuss_Hill": 190.27186469030556, "K_Reuss": 190.2718646902857, "K_Voigt": 190.27186469032543, "K_VRH": 190.27186469030556, "state": "successful", "G_VRH": 79.353692941037, "homogeneous_poisson": 0.3169237738703473, "universal_anisotropy": 1.1860800064842056, "warnings": null, "poisson_ratio": 0.3169237738703473, "G_Voigt": 87.76770648139052, "_id": "55f6ee89ab7a8430f829adf0", "elastic_anisotropy": 1.1860800064842056}}, {"full_formula": "Mn1Au1", "elasticity": {"elastic_tensor": [[129.26616183816495, 109.5435243816006, 109.54435582812368, 0.5713521173076923, 0.0, 0.0], [109.5435243816006, 129.26650056970956, 109.54489226708125, 0.5511054589743589, 0.0, 0.0], [109.54435582812368, 109.54489226708125, 129.26629899536846, 0.12175842692307688, 0.0, 0.0], [0.5713521173076923, 0.5511054589743589, 0.12175842692307688, 66.65495562051284, 0.0, 0.0], [0.0, 0.0, 0.0, 0.0, 66.74425736666667, 0.0], [0.0, 0.0, 0.0, 0.0, 0.0, 66.74440958000001]], "compliance_tensor": [[34.760344783867026, -15.94224616954, -15.946857546013435, -0.13701717035247202, 0.0, 0.0], [-15.94224616954, 34.7606235707015, -15.947318714561984, -0.1216175569808422, 0.0, 0.0], [-15.946857546013435, -15.947318714561984, 34.76397651308739, 0.20504279092022484, 0.0, 0.0], [-0.13701717035247205, -0.12161755698084221, 0.20504279092022484, 15.004440917435549, 0.0, 0.0], [0.0, 0.0, 0.0, 0.0, 14.982562387448462, 0.0], [0.0, 0.0, 0.0, 0.0, 0.0, 14.982528219107213]], "G_Voigt_Reuss_Hill": 32.07543039160018, "G_Reuss": 20.177723674668634, "K_Voigt_Reuss_Hill": 116.11698803257653, "K_Reuss": 116.11569758105816, "K_Voigt": 116.1182784840949, "K_VRH": 116.11698803257653, "state": "successful", "G_VRH": 32.07543039160018, "homogeneous_poisson": 0.3735283716263022, "universal_anisotropy": 5.896478590835587, "warnings": null, "poisson_ratio": 0.3735283716263022, "G_Voigt": 43.97313710853173, "_id": "55f6f00eab7a8430f229ae46", "elastic_anisotropy": 5.896478590835587}}, {"full_formula": "Mn3Pd1N1", "elasticity": {"elastic_tensor": [[253.25760348153108, 110.9515136007612, 110.9504008955702, 0.0, 0.0, 0.0], [110.9515136007612, 253.2600289724126, 110.95111250754238, 0.0, 0.0, 0.0], [110.9504008955702, 110.95111250754238, 253.2564947266427, 0.0, 0.0, 0.0], [0.0, 0.0, 0.0, 75.37845357333333, 0.0, 0.0], [0.0, 0.0, 0.0, 0.0, 75.37817511000002, 0.0], [0.0, 0.0, 0.0, 0.0, 0.0, 75.37807753333333]], "compliance_tensor": [[5.3862335367298435, -1.6408364457713474, -1.6408350813060986, 0.0, 0.0, 0.0], [-1.6408364457713474, 5.386186110534493, -1.640834048985062, 0.0, 0.0, 0.0], [-1.6408350813060988, -1.6408340489850617, 5.3862534689266175, 0.0, 0.0, 0.0], [0.0, 0.0, 0.0, 13.266390494826634, 0.0, 0.0], [0.0, 0.0, 0.0, 0.0, 13.26643950375147, 0.0], [0.0, 0.0, 0.0, 0.0, 0.0, 13.266456677112584]], "G_Voigt_Reuss_Hill": 73.65894526204373, "G_Reuss": 73.6295426023066, "K_Voigt_Reuss_Hill": 158.38668679431638, "K_Reuss": 158.386686789929, "K_Voigt": 158.38668679870375, "K_VRH": 158.38668679431638, "state": "successful", "G_VRH": 73.65894526204373, "homogeneous_poisson": 0.29867967990063427, "universal_anisotropy": 0.0039933237537352895, "warnings": null, "poisson_ratio": 0.29867967990063427, "G_Voigt": 73.68834792178086, "_id": "55f6ee86ab7a8430f829adef", "elastic_anisotropy": 0.0039933237537352895}}, {"full_formula": "Li2Ag1Sb1", "elasticity": {"elastic_tensor": [[54.578627304371565, 43.11762632521452, 43.11670684968657, 0.0, 0.0, 0.0], [43.11762632521452, 54.57928213216314, 43.11695877218201, 0.0, 0.0, 0.0], [43.11670684968657, 43.11695877218201, 54.5780226392228, 0.0, 0.0, 0.0], [0.0, 0.0, 0.0, 46.747595860000004, 0.0, 0.0], [0.0, 0.0, 0.0, 0.0, 46.747786693333346, 0.0], [0.0, 0.0, 0.0, 0.0, 0.0, 46.74779497666666]], "compliance_tensor": [[60.533409855803704, -26.716890249259734, -26.71496989923076, 0.0, 0.0, 0.0], [-26.71689024925974, 60.532652212879945, -26.71477408881367, 0.0, 0.0, 0.0], [-26.714969899230756, -26.714774088813666, 60.53208194216678, 0.0, 0.0, 0.0], [0.0, 0.0, 0.0, 21.39147439784511, 0.0, 0.0], [0.0, 0.0, 0.0, 0.0, 21.39138707378865, 0.0], [0.0, 0.0, 0.0, 0.0, 0.0, 21.391383283406896]], "G_Voigt_Reuss_Hill": 21.221290352620393, "G_Reuss": 12.10163585732916, "K_Voigt_Reuss_Hill": 46.93761287393251, "K_Reuss": 46.93761286231794, "K_Voigt": 46.93761288554708, "K_VRH": 46.93761287393251, "state": "successful", "G_VRH": 21.221290352620393, "homogeneous_poisson": 0.3035479578875865, "universal_anisotropy": 7.5358857293387835, "warnings": null, "poisson_ratio": 0.3035479578875865, "G_Voigt": 30.340944847911626, "_id": "55f6efcbab7a8430f329ae3f", "elastic_anisotropy": 7.5358857293387835}}, {"full_formula": "Ti6Pt2", "elasticity": {"elastic_tensor": [[259.1068746925805, 120.18845690845518, 120.18780440190048, 0.0, 0.0, 0.0], [120.18845690845518, 259.1051414566551, 120.18760816997931, 0.0, 0.0, 0.0], [120.18780440190048, 120.18760816997931, 259.1042853729204, 0.0, 0.0, 0.0], [0.0, 0.0, 0.0, 51.09416756333334, 0.0, 0.0], [0.0, 0.0, 0.0, 0.0, 51.09450568666668, 0.0], [0.0, 0.0, 0.0, 0.0, 0.0, 51.09454464000001]], "compliance_tensor": [[5.466341063791126, -1.7321525418851471, -1.7321375404051285, 0.0, 0.0, 0.0], [-1.7321525418851467, 5.466382760910787, -1.7321514301902572, 0.0, 0.0, 0.0], [-1.7321375404051282, -1.7321514301902572, 5.466389501229778, 0.0, 0.0, 0.0], [0.0, 0.0, 0.0, 19.571705493791605, 0.0, 0.0], [0.0, 0.0, 0.0, 0.0, 19.571575975945965, 0.0], [0.0, 0.0, 0.0, 0.0, 0.0, 19.571561055015987]], "G_Voigt_Reuss_Hill": 57.78858716151122, "G_Reuss": 57.13703527556769, "K_Voigt_Reuss_Hill": 166.4937822734942, "K_Reuss": 166.49378227111885, "K_Voigt": 166.49378227586953, "K_VRH": 166.4937822734942, "state": "successful", "G_VRH": 57.78858716151122, "homogeneous_poisson": 0.3444508209461958, "universal_anisotropy": 0.11403319807619905, "warnings": null, "poisson_ratio": 0.3444508209461958, "G_Voigt": 58.440139047454736, "_id": "55f6f189ab7a8430f229aeba", "elastic_anisotropy": 0.11403319807619905}}, {"full_formula": "Cr1Ga1Fe2", "elasticity": {"elastic_tensor": [[338.7586791591057, 247.1488685994898, 247.10355768188862, 4.4068797365985493e-05, 3.058872804136949, -0.04583248854067819], [247.1488685994898, 240.56928042239826, 230.70568599280432, 0.0013930183333343575, 2.421945239633361, -0.051696842581658735], [247.10355768188862, 230.70568599280432, 237.20723148697334, 0.0013558433333332495, 0.6643007250000003, -0.035863066666667075], [4.4068797365985493e-05, 0.0013930183333343575, 0.0013558433333332495, 101.92349986333335, 0.0, 0.0], [3.058872804136949, 2.421945239633361, 0.6643007250000003, 0.0, 102.42632440000003, 0.0], [-0.04583248854067819, -0.051696842581658735, -0.035863066666667075, 0.0, 0.0, 101.93451784333334]], "compliance_tensor": [[12.747227600128106, -5.347114426325565, -8.077921892545156, 0.0001750260735290123, -0.20185787447675485, 0.0001776550197821601], [-5.347114426325551, 64.1389102688242, -56.80797837715029, -0.00011860187528708554, -0.9884881144854325, 0.010137873734844401], [-8.077921892545177, -56.80797837715027, 67.87839608337211, -0.00012305239872804642, 1.1442710782733276, -0.00856134852666152], [0.00017502607352901228, -0.00011860187528708551, -0.00012305239872804642, 9.811280044986837, -1.6244989006126334e-06, -2.4746262597933408e-08], [-0.20185787447675507, -0.9884881144854321, 1.1442710782733274, -1.6244989006126336e-06, 9.785095652021234, -0.000189497077251379], [0.00017765501978216205, 0.010137873734844401, -0.008561348526661518, -2.4746262597933398e-08, -0.000189497077251379, 9.810221761573994]], "G_Voigt_Reuss_Hill": 42.74561402759579, "G_Reuss": 15.93389993242069, "K_Voigt_Reuss_Hill": 243.94604775005484, "K_Reuss": 236.0641604315716, "K_Voigt": 251.8279350685381, "K_VRH": 243.94604775005484, "state": "successful", "G_VRH": 42.74561402759579, "homogeneous_poisson": 0.4172220945263105, "universal_anisotropy": 16.893614752646855, "warnings": null, "poisson_ratio": 0.4172220945263105, "G_Voigt": 69.5573281227709, "_id": "57c77e3035dc55d25623b13d", "elastic_anisotropy": 16.893614752646855}}, {"full_formula": "Ce1", "elasticity": {"elastic_tensor": [[71.50663840510911, 22.338882477348623, 22.266160044487304, 0.0, 0.0, 0.0041772516666662655], [22.338882477348623, 71.62171927270425, 22.324326529063327, 0.0, 0.0, 0.0041168883333332715], [22.266160044487304, 22.324326529063327, 71.4755430514705, 0.0, 0.0, 0.004078998333333223], [0.0, 0.0, 0.0, 53.356117036666674, 0.0, 0.0], [0.0, 0.0, 0.0, 0.0, 53.35635503666668, 0.0], [0.0041772516666662655, 0.0041168883333332715, 0.004078998333333223, 0.0, 0.0, 53.35619446333334]], "compliance_tensor": [[16.41786211241176, -3.9069189339234436, -3.894246852806491, 0.0, 0.0, -0.0006861914879779368], [-3.9069189339234454, 16.397852257394025, -3.904537290597176, 0.0, 0.0, -0.0006608668829516112], [-3.894246852806491, -3.904537290597176, 16.423465169073317, 0.0, 0.0, -0.0006493996475141725], [0.0, 0.0, 0.0, 18.741993524618618, 0.0, 0.0], [0.0, 0.0, 0.0, 0.0, 18.74190992455906, 0.0], [-0.0006861914879779369, -0.0006608668829516113, -0.0006493996475141724, 0.0, 0.0, 18.741966481946445]], "G_Voigt_Reuss_Hill": 39.11493532051283, "G_Reuss": 36.36922776202863, "K_Voigt_Reuss_Hill": 38.71807095812825, "K_Reuss": 38.71807093502514, "K_Voigt": 38.71807098123137, "K_VRH": 38.71807095812825, "state": "filter_failed", "G_VRH": 39.11493532051283, "homogeneous_poisson": 0.1221245259417394, "universal_anisotropy": 0.7549534955183095, "warnings": ["Contains a rare earth element"], "poisson_ratio": 0.1221245259417394, "G_Voigt": 41.86064287899702, "_id": "580da09efa767b8195064224", "elastic_anisotropy": 0.7549534955183095}}, {"full_formula": "Si2", "elasticity": {"elastic_tensor": [[143.59747367536096, 52.71822399365266, 52.71826049637234, 0.0, 0.0, 0.0], [52.71822399365266, 143.59734691417395, 52.71821745187695, 0.0, 0.0, 0.0], [52.71826049637234, 52.71821745187695, 143.59732858687707, 0.0, 0.0, 0.0], [0.0, 0.0, 0.0, 74.62512568333334, 0.0, 0.0], [0.0, 0.0, 0.0, 0.0, 74.62690286333333, 0.0], [0.0, 0.0, 0.0, 0.0, 0.0, 74.62217889000001]], "compliance_tensor": [[8.674250076178225, -2.329366250344668, -2.3293702042203313, 0.0, 0.0, 0.0], [-2.329366250344668, 8.674256719639262, -2.3293693447775414, 0.0, 0.0, 0.0], [-2.3293702042203313, -2.329369344777541, 8.674259870431362, 0.0, 0.0, 0.0], [0.0, 0.0, 0.0, 13.400312439585457, 0.0, 0.0], [0.0, 0.0, 0.0, 0.0, 13.399993321863196, 0.0], [0.0, 0.0, 0.0, 0.0, 0.0, 13.40084161136721]], "G_Voigt_Reuss_Hill": 61.16103157978243, "G_Reuss": 59.371391856597526, "K_Voigt_Reuss_Hill": 83.01128367334668, "K_Reuss": 83.01128367333604, "K_Voigt": 83.01128367335733, "K_VRH": 83.01128367334668, "state": "successful", "G_VRH": 61.16103157978243, "homogeneous_poisson": 0.20424545175998932, "universal_anisotropy": 0.3014313236093624, "warnings": null, "poisson_ratio": 0.20424545175998932, "G_Voigt": 62.950671302967336, "_id": "55f6f0d6ab7a8430f029ae73", "elastic_anisotropy": 0.3014313236093624}}, {"full_formula": "Cu3Au1", "elasticity": {"elastic_tensor": [[178.70828256603602, 123.46255614985952, 123.53044780266893, 0.0, 0.0, 0.0], [123.46255614985952, 178.19886406826518, 123.27341833177223, 0.0, 0.0, 0.0], [123.53044780266893, 123.27341833177223, 178.33191166637232, 0.0, 0.0, 0.0], [0.0, 0.0, 0.0, 68.05441648000003, 0.0, 0.0], [0.0, 0.0, 0.0, 0.0, 68.05458399333334, 0.0], [0.0, 0.0, 0.0, 0.0, 0.0, 68.05476029333335]], "compliance_tensor": [[12.894699579350474, -5.279507561594364, -5.282649977163439, 0.0, 0.0, 0.0], [-5.279507561594363, 12.916013986562325, -5.2711892857505225, 0.0, 0.0, 0.0], [-5.282649977163439, -5.2711892857505225, 12.910564450738127, 0.0, 0.0, 0.0], [0.0, 0.0, 0.0, 14.694123492982738, 0.0, 0.0], [0.0, 0.0, 0.0, 0.0, 14.69408732405095, 0.0], [0.0, 0.0, 0.0, 0.0, 0.0, 14.694049258123096]], "G_Voigt_Reuss_Hill": 47.31558668577168, "G_Reuss": 42.80024548378517, "K_Voigt_Reuss_Hill": 141.75211453224182, "K_Reuss": 141.75179541234198, "K_Voigt": 141.75243365214163, "K_VRH": 141.75211453224182, "state": "successful", "G_VRH": 47.31558668577168, "homogeneous_poisson": 0.3498146515256829, "universal_anisotropy": 1.054984713715803, "warnings": null, "poisson_ratio": 0.3498146515256829, "G_Voigt": 51.83092788775819, "_id": "55f6f05eab7a8430f129ae67", "elastic_anisotropy": 1.054984713715803}}, {"full_formula": "Sn1", "elasticity": {"elastic_tensor": [[3.0832208807076036, 63.78601279877812, 63.797544690548726, 0.0, 0.0, 0.0], [63.78601279877812, 3.0829725351795476, 63.79738725845927, 0.0, 0.0, 0.0], [63.797544690548726, 63.79738725845927, 3.1057817456527403, 0.0, 0.0, 0.0], [0.0, 0.0, 0.0, 16.19860977, 0.0, 0.0], [0.0, 0.0, 0.0, 0.0, 16.19875962, 0.0], [0.0, 0.0, 0.0, 0.0, 0.0, 16.198670430000004]], "compliance_tensor": [[-8.432578342071189, 8.041074768283304, 8.04249451958671, 0.0, 0.0, 0.0], [8.041074768283302, -8.432618456429926, 8.042483478775027, -0.0, -0.0, -0.0], [8.042494519586704, 8.042483478775027, -8.429709070395354, 0.0, 0.0, 0.0], [0.0, 0.0, 0.0, 61.733692841469065, 0.0, 0.0], [0.0, 0.0, 0.0, 0.0, 61.73312176108457, 0.0], [0.0, 0.0, 0.0, 0.0, 0.0, 61.733461664112625]], "G_Voigt_Reuss_Hill": 19.743797692819403, "G_Reuss": 41.91050198867937, "K_Voigt_Reuss_Hill": 43.559318285958625, "K_Reuss": 43.55931827668257, "K_Voigt": 43.55931829523468, "K_VRH": 43.559318285958625, "state": "filter_failed", "G_VRH": 19.743797692819403, "homogeneous_poisson": 0.3031155997251927, "universal_anisotropy": -5.289057215316229, "warnings": ["c11/c13 is less than 0.1", "c11/c12 is less than 0.1", "c11/c23 is less than 0.1", "Shear modulus (Voigt) is less than 2 GPa", "One or more eigenvalues of the elastic tensor is negative"], "poisson_ratio": 0.3031155997251927, "G_Voigt": -2.422906603040565, "_id": "588644a548a464edfdf0549d", "elastic_anisotropy": -5.289057215316229}}, {"full_formula": "Ge1", "elasticity": {"elastic_tensor": [[11.392623963765198, 81.96798578071767, 81.96863670623121, 0.0, 0.0, 0.0], [81.96798578071767, 11.390911410898312, 81.96791015303057, 0.0, 0.0, 0.0], [81.96863670623121, 81.96791015303057, 11.392534490493487, 0.0, 0.0, 0.0], [0.0, 0.0, 0.0, 13.523658550000002, 0.0, 0.0], [0.0, 0.0, 0.0, 0.0, 13.523677716666668, 0.0], [0.0, 0.0, 0.0, 0.0, 0.0, 13.523653116666669]], "compliance_tensor": [[-7.544824347343713, 6.624197490804083, 6.624280246029458, 0.0, 0.0, 0.0], [6.624197490804082, -7.54493839431414, 6.624197177916558, -0.0, -0.0, -0.0], [6.624280246029458, 6.624197177916557, -7.544837376985832, 0.0, 0.0, 0.0], [0.0, 0.0, 0.0, 73.94448745528257, 0.0, 0.0], [0.0, 0.0, 0.0, 0.0, 73.94438265617595, 0.0], [0.0, 0.0, 0.0, 0.0, 0.0, 73.94451716360508]], "G_Voigt_Reuss_Hill": 12.136597136179834, "G_Reuss": 30.274217163656214, "K_Voigt_Reuss_Hill": 58.4427927945661, "K_Reuss": 58.44279279523044, "K_Voigt": 58.442792793901766, "K_VRH": 58.4427927945661, "state": "filter_failed", "G_VRH": 12.136597136179834, "homogeneous_poisson": 0.4028890828604975, "universal_anisotropy": -5.991111158877189, "warnings": ["c11/c13 is less than 0.1", "c11/c12 is less than 0.1", "c11/c23 is less than 0.1", "Shear modulus (Voigt) is less than 2 GPa", "One or more eigenvalues of the elastic tensor is negative"], "poisson_ratio": 0.4028890828604975, "G_Voigt": -6.001022891296545, "_id": "588157c948a464edfdee03f3", "elastic_anisotropy": -5.991111158877189}}, {"full_formula": "Al1Cu3", "elasticity": {"elastic_tensor": [[147.50535321996344, 122.08281457915578, 122.08285822686025, 0.0, 0.0, 0.0], [122.08281457915578, 147.47536759285762, 122.0702021293383, 0.0, 0.0, 0.0], [122.08285822686025, 122.0702021293383, 147.47139090695143, 0.0, 0.0, 0.0], [0.0, 0.0, 0.0, 99.24803888000001, 0.0, 0.0], [0.0, 0.0, 0.0, 0.0, 99.25053011000001, 0.0], [0.0, 0.0, 0.0, 0.0, 0.0, 99.25029468333337]], "compliance_tensor": [[27.087947026620867, -12.267805733809945, -12.269772867604573, 0.0, 0.0, 0.0], [-12.267805733809942, 27.093216441228186, -12.270757114517417, 0.0, 0.0, 0.0], [-12.269772867604576, -12.270757114517417, 27.09557913671478, 0.0, 0.0, 0.0], [0.0, 0.0, 0.0, 10.07576584167161, 0.0, 0.0], [0.0, 0.0, 0.0, 0.0, 10.075512935716247, 0.0], [0.0, 0.0, 0.0, 0.0, 0.0, 10.075536835337228]], "G_Voigt_Reuss_Hill": 45.636428400625576, "G_Reuss": 26.642001614289928, "K_Voigt_Reuss_Hill": 130.54709281464568, "K_Reuss": 130.5470898970157, "K_Voigt": 130.5470957322757, "K_VRH": 130.54709281464568, "state": "successful", "G_VRH": 45.636428400625576, "homogeneous_poisson": 0.34345270401522743, "universal_anisotropy": 7.129504449558102, "warnings": null, "poisson_ratio": 0.34345270401522743, "G_Voigt": 64.63085518696123, "_id": "55f6f139ab7a8430ec29ae9d", "elastic_anisotropy": 7.129504449558102}}, {"full_formula": "Hf1Al1Cu2", "elasticity": {"elastic_tensor": [[179.7263839634657, 112.11706699524848, 112.22173168070958, 0.0, 0.0, 0.0], [112.11706699524848, 179.6920999623882, 112.20344082582062, 0.0, 0.0, 0.0], [112.22173168070958, 112.20344082582062, 179.9029871991474, 0.0, 0.0, 0.0], [0.0, 0.0, 0.0, 71.53909781000002, 0.0, 0.0], [0.0, 0.0, 0.0, 0.0, 71.53879229333334, 0.0], [0.0, 0.0, 0.0, 0.0, 0.0, 71.53899045333334]], "compliance_tensor": [[10.689611963886895, -4.104441632606294, -4.108182433440693, 0.0, 0.0, 0.0], [-4.104441632606294, 10.690729187401637, -4.107375111854274, 0.0, 0.0, 0.0], [-4.108182433440693, -4.107375111854273, 10.682918593930296, 0.0, 0.0, 0.0], [0.0, 0.0, 0.0, 13.978370298377122, 0.0, 0.0], [0.0, 0.0, 0.0, 0.0, 13.978429995011103, 0.0], [0.0, 0.0, 0.0, 0.0, 0.0, 13.978391275346901]], "G_Voigt_Reuss_Hill": 52.9458403656032, "G_Reuss": 49.449689178324896, "K_Voigt_Reuss_Hill": 134.71172525290552, "K_Reuss": 134.71167826930454, "K_Voigt": 134.71177223650653, "K_VRH": 134.71172525290552, "state": "successful", "G_VRH": 52.9458403656032, "homogeneous_poisson": 0.326247956605566, "universal_anisotropy": 0.7070124594715796, "warnings": null, "poisson_ratio": 0.326247956605566, "G_Voigt": 56.44199155288151, "_id": "55f6f075ab7a8430f329ae70", "elastic_anisotropy": 0.7070124594715796}}, {"full_formula": "Sc2Co4", "elasticity": {"elastic_tensor": [[189.0362189784688, 118.75890570880571, 118.77279674935608, 0.0, 0.0, 0.0], [118.75890570880571, 188.97438251229892, 118.74085358848637, 0.0, 0.0, 0.0], [118.77279674935608, 118.74085358848637, 189.00499554005054, 0.0, 0.0, 0.0], [0.0, 0.0, 0.0, 58.951288056666684, 0.0, 0.0], [0.0, 0.0, 0.0, 0.0, 58.95119539333334, 0.0], [0.0, 0.0, 0.0, 0.0, 0.0, 58.951386110000016]], "compliance_tensor": [[10.270843966483614, -3.963788602277026, -3.9640921588131093, 0.0, 0.0, 0.0], [-3.963788602277026, 10.272792148080905, -3.962910336017267, 0.0, 0.0, 0.0], [-3.9640921588131093, -3.962910336017267, 10.271610349348505, 0.0, 0.0, 0.0], [0.0, 0.0, 0.0, 16.963157769152627, 0.0, 0.0], [0.0, 0.0, 0.0, 0.0, 16.963184432950236, 0.0], [0.0, 0.0, 0.0, 0.0, 0.0, 16.96312955447825]], "G_Voigt_Reuss_Hill": 47.89461361179518, "G_Reuss": 46.36891724597901, "K_Voigt_Reuss_Hill": 142.17340864421232, "K_Reuss": 142.173405163523, "K_Voigt": 142.17341212490163, "K_VRH": 142.17340864421232, "state": "successful", "G_VRH": 47.89461361179518, "homogeneous_poisson": 0.3485672992719186, "universal_anisotropy": 0.329034336679328, "warnings": null, "poisson_ratio": 0.3485672992719186, "G_Voigt": 49.42030997761135, "_id": "55f6f0baab7a8430f729ae83", "elastic_anisotropy": 0.329034336679328}}, {"full_formula": "Hg4Pt1", "elasticity": {"elastic_tensor": [[79.13409344919958, 49.00509532090145, 49.005232760665834, 0.0, 0.0, 0.0], [49.00509532090145, 79.1328611239814, 49.00509533760135, 0.0, 0.0, 0.0], [49.005232760665834, 49.00509533760135, 79.1342682066915, 0.0, 0.0, 0.0], [0.0, 0.0, 0.0, 41.883825169999994, 0.0, 0.0], [0.0, 0.0, 0.0, 0.0, 41.883926560000006, 0.0], [0.0, 0.0, 0.0, 0.0, 0.0, 41.88390785666669]], "compliance_tensor": [[24.00893219860969, -9.182101000199307, -9.181781701902699, 0.0, 0.0, 0.0], [-9.182101000199303, 24.009454901301112, -9.182047754552304, 0.0, 0.0, 0.0], [-9.181781701902697, -9.182047754552302, 24.00884620684409, 0.0, 0.0, 0.0], [0.0, 0.0, 0.0, 23.875565231713058, 0.0, 0.0], [0.0, 0.0, 0.0, 0.0, 23.87550743523221, 0.0], [0.0, 0.0, 0.0, 0.0, 0.0, 23.875518096882388]], "G_Voigt_Reuss_Hill": 27.8094956928921, "G_Reuss": 24.462939511070605, "K_Voigt_Reuss_Hill": 59.04800773271833, "K_Reuss": 59.04800773008004, "K_Voigt": 59.048007735356634, "K_VRH": 59.04800773271833, "state": "successful", "G_VRH": 27.8094956928921, "homogeneous_poisson": 0.29646973730900733, "universal_anisotropy": 1.368010651592229, "warnings": null, "poisson_ratio": 0.29646973730900733, "G_Voigt": 31.156051874713594, "_id": "55f6f167ab7a8430f229aeaf", "elastic_anisotropy": 1.368010651592229}}, {"full_formula": "Ga2Pt1", "elasticity": {"elastic_tensor": [[130.37558107758173, 105.30788291440885, 105.30452070765878, 0.0, 0.0, 0.0], [105.30788291440885, 130.3774616241287, 105.30557754191409, 0.0, 0.0, 0.0], [105.30452070765878, 105.30557754191409, 130.37086016621188, 0.0, 0.0, 0.0], [0.0, 0.0, 0.0, 32.078031033333346, 0.0, 0.0], [0.0, 0.0, 0.0, 0.0, 32.078053430000004, 0.0], [0.0, 0.0, 0.0, 0.0, 0.0, 32.18180473666667]], "compliance_tensor": [[27.571039006425522, -12.319492901551175, -12.319039169603364, 0.0, 0.0, 0.0], [-12.319492901551179, 27.57093359478463, -12.319277391908708, 0.0, 0.0, 0.0], [-12.319039169603364, -12.319277391908708, 27.57164546897377, 0.0, 0.0, 0.0], [0.0, 0.0, 0.0, 31.173983183720562, 0.0, 0.0], [0.0, 0.0, 0.0, 0.0, 31.17396141826926, 0.0], [0.0, 0.0, 0.0, 0.0, 0.0, 31.073459309776982]], "G_Voigt_Reuss_Hill": 22.022909703105448, "G_Reuss": 19.76420606961555, "K_Voigt_Reuss_Hill": 113.66220724572567, "K_Reuss": 113.66220724746402, "K_Voigt": 113.66220724398731, "K_VRH": 113.66220724572567, "state": "successful", "G_VRH": 22.022909703105448, "homogeneous_poisson": 0.40899863035664524, "universal_anisotropy": 1.1428253811327407, "warnings": null, "poisson_ratio": 0.40899863035664524, "G_Voigt": 24.281613336595