% Eleições para a Assembleia da República realizadas em 4 de Outubro de 2015
Partidos e coligações,Lista,HEX,CTL,Aveiro,Beja,Braga,Bragança,Castelo Branco,Coimbra,Évora,Faro,Guarda,Leiria,Lisboa,Portalegre,Porto,Santarém,Setúbal,Viana do Castelo,Vila Real,Viseu,Açores,Madeira,Europa,Fora da Europa,Portugal
Bloco de Esquerda,B.E.,#d21f1b,v,35347,6105,41753,3864,10450,21773,7319,26926,6348,22946,125469,5420,106887,24481,55372,10237,5697,12822,7323,13392,785,229,550945
CDS – Partido Popular,CDS-PP,#0091dc,v,,,,,,,,,,,,,,,,,,,,7496,,,7496
Aliança Açores,CDS-PP-PPM,#1e90ff,v,,,,,,,,,,,,,,,,,,,3624,,,,3624
Juntos pelo Povo,JPP,#0e766d,v,448,87,631,123,,272,,,82,369,1561,,1231,,559,161,,,,8670,28,53,14275
LIVRE/Tempo de Avançar,L/TDA,#98c75a,v,1659,272,2336,252,507,1292,357,1436,289,1780,14687,190,5012,1237,4263,453,383,1003,331,1259,249,83,39330
Partido da Terra,MPT,#008d45,v,1328,246,1609,221,464,851,243,1222,299,1186,5079,154,3443,1036,1592,447,301,679,300,1747,82,98,22627
"Nós, Cidadãos!",NC,#feab19,v,1009,166,974,161,267,683,219,1337,182,831,3744,144,2713,932,1574,1037,279,535,769,1125,69,2632,21382
Pessoas–Animais–Natureza,PAN,#008080,v,3630,598,3673,383,860,2165,727,3783,734,2884,22628,468,15307,2722,8170,1086,664,1297,816,2185,128,262,75170
Coligação Democrática Unitária,PCP-PEV,#ff0000,v,16051,18592,24623,2134,6286,15476,18584,16541,3380,12070,113437,7186,65597,21960,79511,6722,3262,6672,2321,4467,811,218,445901
Partido Comunista dos Trabalhadores Portugueses,PCTP/MRPP,#ff0000,v,3387,1924,5442,534,1080,1889,1257,3011,690,2493,11090,1001,10287,3058,6729,1117,1010,1744,593,1592,98,19,60045
Partido Democrático Republicano,PDR,#000000,v,4799,354,7509,550,1086,3626,447,2323,957,4046,10250,327,10679,2373,4142,2399,804,1953,511,2147,169,469,61920
Partido Nacional Renovador,PNR,#0d549c,v,1699,274,1834,190,508,1099,280,1343,391,1079,7187,217,4752,1206,2681,563,280,608,180,785,45,85,27286
Partido Social Democrata,PPD/PSD,#f68a21,v,,,,,,,,,,,,,,,,,,,33665,47176,,,80841
Portugal à Frente,PPD/PSD.CDS-PP,#00549f,v,177321,14980,216367,34347,36803,81880,20180,59957,39018,114829,399597,16302,380069,81530,95670,58515,56262,97381,,,5340,7156,1993504
Partido Popular Monárquico,PPM,#014a94,v,1298,190,883,232,496,526,369,755,214,706,2823,183,2392,821,1024,535,318,533,,526,40,52,14916
Partido Cidadania e Democracia Cristã,PPV/CDC,#000080,v,802,,995,,,,,,,,,,,492,,396,,,,,,,2685
Partido Socialista,PS,#ff66ff,v,102769,27778,146418,23518,40502,77688,31894,62425,28867,58878,386437,25039,314121,74852,145607,38311,36462,56553,37720,26208,4082,1601,1747730
Partido Trabalhista Português,PTP,#ca0114,v,,,,,,,,,,,,,,,,,,,,1744,,,1744
AGIR,PTP-MAS,#f2d514,v,1270,194,1621,285,374,1081,231,1220,278,914,5039,210,2787,930,1801,960,518,722,318,,23,17,20793
Partido Unido dos Reformados e Pensionistas,PURP,#259751,v,635,348,882,,272,451,155,886,143,616,4001,147,1614,827,1610,209,153,387,346,,96,121,13899
Votos em branco,Brancos,,i,9159,1232,10746,1189,2091,5946,1430,4278,1737,6883,22185,1134,18926,5139,7239,3225,1932,4235,3036,1028,105,80,112955
Votos anulados,Nulos,,i,6123,1124,6063,1409,2166,3500,1070,3038,2000,4679,16867,889,13955,3948,6145,2139,1954,3590,1554,3586,1641,1584,89024
Eleitores inscritos,Inscritos,,u,657457,128754,787983,147395,180996,390950,141422,370189,163456,422474,1901233,101179,1591407,393250,725753,253095,229963,371931,227040,256146,78342,164507,9684922
Mandatos a atribuir,Mandatos,,s,16,3,19,3,4,9,3,9,4,10,47,2,39,9,18,6,5,9,5,6,2,2,230
% Fonte: Diário da República n.º 205/2015, 1º Suplemento, Série I de 2015-10-20
