{"id": 1, "name": "Bitcoin", "symbol": "BTC", "website_slug": "bitcoin", "rank": 1, "circulating_supply": 17501087.0, "total_supply": 17501087.0, "max_supply": 21000000.0, "quotes": {"USD": {"price": 3579.78904837, "volume_24h": 5284141411.73998, "market_cap": 62650199577.0, "percent_change_1h": -0.09, "percent_change_24h": -0.79, "percent_change_7d": -2.03}, "EUR": {"price": 3135.6768392402, "volume_24h": 4628585544.0581255, "market_cap": 54877753167.0, "percent_change_1h": -0.09, "percent_change_24h": -0.79, "percent_change_7d": -2.03}}, "last_updated": 1548447987}
{"id": 52, "name": "XRP", "symbol": "XRP", "website_slug": "ripple", "rank": 2, "circulating_supply": 41040405095.0, "total_supply": 99991724864.0, "max_supply": 100000000000.0, "quotes": {"USD": {"price": 0.3154937348, "volume_24h": 349482171.458846, "market_cap": 12947990682.0, "percent_change_1h": 0.14, "percent_change_24h": -0.86, "percent_change_7d": -2.77}, "EUR": {"price": 0.2763532666, "volume_24h": 306125063.78549135, "market_cap": 11341650010.0, "percent_change_1h": 0.14, "percent_change_24h": -0.86, "percent_change_7d": -2.77}}, "last_updated": 1548447961}
{"id": 1027, "name": "Ethereum", "symbol": "ETH", "website_slug": "ethereum", "rank": 3, "circulating_supply": 104560961.0, "total_supply": 104560961.0, "max_supply": null, "quotes": {"USD": {"price": 115.812465984, "volume_24h": 2599678201.85357, "market_cap": 12109462685.0, "percent_change_1h": -0.21, "percent_change_24h": -1.47, "percent_change_7d": -4.53}, "EUR": {"price": 101.4446556416, "volume_24h": 2277159524.453424, "market_cap": 10607150635.0, "percent_change_1h": -0.21, "percent_change_24h": -1.47, "percent_change_7d": -4.53}}, "last_updated": 1548447976}
{"id": 1831, "name": "Bitcoin Cash", "symbol": "BCH", "website_slug": "bitcoin-cash", "rank": 4, "circulating_supply": 17586025.0, "total_supply": 17586025.0, "max_supply": 21000000.0, "quotes": {"USD": {"price": 126.78414302, "volume_24h": 199102417.229863, "market_cap": 2229629109.0, "percent_change_1h": -0.24, "percent_change_24h": -2.14, "percent_change_7d": -1.09}, "EUR": {"price": 111.0551754528, "volume_24h": 174401572.2459097, "market_cap": 1953019092.0, "percent_change_1h": -0.24, "percent_change_24h": -2.14, "percent_change_7d": -1.09}}, "last_updated": 1548447964}
{"id": 1765, "name": "EOS", "symbol": "EOS", "website_slug": "eos", "rank": 5, "circulating_supply": 906245118.0, "total_supply": 1006245120.0, "max_supply": null, "quotes": {"USD": {"price": 2.4318553689, "volume_24h": 623451431.93949, "market_cap": 2203857055.0, "percent_change_1h": -0.17, "percent_change_24h": -0.84, "percent_change_7d": -0.87}, "EUR": {"price": 2.13015696, "volume_24h": 546105423.8416471, "market_cap": 1930444345.0, "percent_change_1h": -0.17, "percent_change_24h": -0.84, "percent_change_7d": -0.87}}, "last_updated": 1548447964}
{"id": 825, "name": "Tether", "symbol": "USDT", "website_slug": "tether", "rank": 6, "circulating_supply": 2017251167.0, "total_supply": 2580057493.0, "max_supply": null, "quotes": {"USD": {"price": 1.0082037366, "volume_24h": 3641573925.00605, "market_cap": 2033800164.0, "percent_change_1h": -0.14, "percent_change_24h": -0.18, "percent_change_7d": -0.76}, "EUR": {"price": 0.8831249728, "volume_24h": 3189796622.295888, "market_cap": 1781484882.0, "percent_change_1h": -0.14, "percent_change_24h": -0.18, "percent_change_7d": -0.76}}, "last_updated": 1548447966}
{"id": 2, "name": "Litecoin", "symbol": "LTC", "website_slug": "litecoin", "rank": 7, "circulating_supply": 60178200.0, "total_supply": 60178200.0, "max_supply": 84000000.0, "quotes": {"USD": {"price": 32.2634742025, "volume_24h": 633237185.503895, "market_cap": 1941557808.0, "percent_change_1h": -0.09, "percent_change_24h": -1.78, "percent_change_7d": 3.09}, "EUR": {"price": 28.2608353295, "volume_24h": 554677147.0330987, "market_cap": 1700686205.0, "percent_change_1h": -0.09, "percent_change_24h": -1.78, "percent_change_7d": 3.09}}, "last_updated": 1548447965}
{"id": 512, "name": "Stellar", "symbol": "XLM", "website_slug": "stellar", "rank": 8, "circulating_supply": 19166823582.0, "total_supply": 104662581680.0, "max_supply": null, "quotes": {"USD": {"price": 0.1007498114, "volume_24h": 102658262.666442, "market_cap": 1931053862.0, "percent_change_1h": -0.12, "percent_change_24h": -1.31, "percent_change_7d": -5.52}, "EUR": {"price": 0.0882506891, "volume_24h": 89922375.94178092, "market_cap": 1691485389.0, "percent_change_1h": -0.12, "percent_change_24h": -1.31, "percent_change_7d": -5.52}}, "last_updated": 1548447961}
{"id": 1958, "name": "TRON", "symbol": "TRX", "website_slug": "tron", "rank": 9, "circulating_supply": 66658600540.0, "total_supply": 99257812196.0, "max_supply": null, "quotes": {"USD": {"price": 0.0267128634, "volume_24h": 202079577.595352, "market_cap": 1780642092.0, "percent_change_1h": 0.18, "percent_change_24h": -1.04, "percent_change_7d": 7.26}, "EUR": {"price": 0.0233988389, "volume_24h": 177009383.11929578, "market_cap": 1559733853.0, "percent_change_1h": 0.18, "percent_change_24h": -1.04, "percent_change_7d": 7.26}}, "last_updated": 1548447964}
{"id": 3602, "name": "Bitcoin SV", "symbol": "BSV", "website_slug": "bitcoin-sv", "rank": 10, "circulating_supply": 17585023.0, "total_supply": 17585023.0, "max_supply": 21000000.0, "quotes": {"USD": {"price": 74.8963962956, "volume_24h": 59985544.7223342, "market_cap": 1317054884.0, "percent_change_1h": -0.01, "percent_change_24h": 0.22, "percent_change_7d": -1.46}, "EUR": {"price": 65.6046744748, "volume_24h": 52543678.05853692, "market_cap": 1153659738.0, "percent_change_1h": -0.01, "percent_change_24h": 0.22, "percent_change_7d": -1.46}}, "last_updated": 1548447969}
