{"id": 1, "name": "Bitcoin", "symbol": "BTC", "website_slug": "bitcoin", "rank": 1, "circulating_supply": 17501087.0, "total_supply": 17501087.0, "max_supply": 21000000.0, "quotes": {"USD": {"price": 3584.46355711, "volume_24h": 5293095127.06203, "market_cap": 62732008561.0, "percent_change_1h": 0.02, "percent_change_24h": -0.68, "percent_change_7d": -1.92}, "EUR": {"price": 3140.3592757747, "volume_24h": 4637296520.104434, "market_cap": 54959700897.0, "percent_change_1h": 0.02, "percent_change_24h": -0.68, "percent_change_7d": -1.92}}, "last_updated": 1548449247}
{"id": 52, "name": "XRP", "symbol": "XRP", "website_slug": "ripple", "rank": 2, "circulating_supply": 41040405095.0, "total_supply": 99991724864.0, "max_supply": 100000000000.0, "quotes": {"USD": {"price": 0.3147774653, "volume_24h": 360405768.200074, "market_cap": 12918594690.0, "percent_change_1h": -0.18, "percent_change_24h": -1.14, "percent_change_7d": -3.01}, "EUR": {"price": 0.2757774817, "volume_24h": 315752574.73739004, "market_cap": 11318019564.0, "percent_change_1h": -0.18, "percent_change_24h": -1.14, "percent_change_7d": -3.01}}, "last_updated": 1548449222}
{"id": 1027, "name": "Ethereum", "symbol": "ETH", "website_slug": "ethereum", "rank": 3, "circulating_supply": 104561208.0, "total_supply": 104561208.0, "max_supply": null, "quotes": {"USD": {"price": 115.960616391, "volume_24h": 2605861036.86453, "market_cap": 12124982156.0, "percent_change_1h": -0.05, "percent_change_24h": -1.41, "percent_change_7d": -4.42}, "EUR": {"price": 101.593443902, "volume_24h": 2283002671.9801297, "market_cap": 10622733241.0, "percent_change_1h": -0.05, "percent_change_24h": -1.41, "percent_change_7d": -4.42}}, "last_updated": 1548449237}
{"id": 1831, "name": "Bitcoin Cash", "symbol": "BCH", "website_slug": "bitcoin-cash", "rank": 4, "circulating_supply": 17586025.0, "total_supply": 17586025.0, "max_supply": 21000000.0, "quotes": {"USD": {"price": 127.036667623, "volume_24h": 199676691.397521, "market_cap": 2234070013.0, "percent_change_1h": -0.01, "percent_change_24h": -1.99, "percent_change_7d": -0.89}, "EUR": {"price": 111.2972056145, "volume_24h": 174937348.36344266, "market_cap": 1957275440.0, "percent_change_1h": -0.01, "percent_change_24h": -1.99, "percent_change_7d": -0.89}}, "last_updated": 1548449225}
{"id": 1765, "name": "EOS", "symbol": "EOS", "website_slug": "eos", "rank": 5, "circulating_supply": 906245118.0, "total_supply": 1006245120.0, "max_supply": null, "quotes": {"USD": {"price": 2.438399982, "volume_24h": 626424834.639107, "market_cap": 2209788078.0, "percent_change_1h": 0.12, "percent_change_24h": -0.66, "percent_change_7d": -0.63}, "EUR": {"price": 2.1362895394, "volume_24h": 548812676.9018266, "market_cap": 1936001965.0, "percent_change_1h": 0.12, "percent_change_24h": -0.66, "percent_change_7d": -0.63}}, "last_updated": 1548449225}
{"id": 825, "name": "Tether", "symbol": "USDT", "website_slug": "tether", "rank": 6, "circulating_supply": 2017251167.0, "total_supply": 2580057493.0, "max_supply": null, "quotes": {"USD": {"price": 1.0087575353, "volume_24h": 3651110456.99094, "market_cap": 2034917315.0, "percent_change_1h": -0.05, "percent_change_24h": -0.14, "percent_change_7d": -0.7}, "EUR": {"price": 0.883775503, "volume_24h": 3198748824.7011395, "market_cap": 1782797164.0, "percent_change_1h": -0.05, "percent_change_24h": -0.14, "percent_change_7d": -0.7}}, "last_updated": 1548449229}
{"id": 2, "name": "Litecoin", "symbol": "LTC", "website_slug": "litecoin", "rank": 7, "circulating_supply": 60178400.0, "total_supply": 60178400.0, "max_supply": 84000000.0, "quotes": {"USD": {"price": 32.382414397, "volume_24h": 635404732.264371, "market_cap": 1948721892.0, "percent_change_1h": 0.21, "percent_change_24h": -1.47, "percent_change_7d": 3.42}, "EUR": {"price": 28.3703304005, "volume_24h": 556679992.1510133, "market_cap": 1707281095.0, "percent_change_1h": 0.21, "percent_change_24h": -1.47, "percent_change_7d": 3.42}}, "last_updated": 1548449224}
{"id": 512, "name": "Stellar", "symbol": "XLM", "website_slug": "stellar", "rank": 8, "circulating_supply": 19166823582.0, "total_supply": 104662581680.0, "max_supply": null, "quotes": {"USD": {"price": 0.1010263916, "volume_24h": 102841815.71838, "market_cap": 1936355025.0, "percent_change_1h": 0.13, "percent_change_24h": -1.08, "percent_change_7d": -5.28}, "EUR": {"price": 0.0885095247, "volume_24h": 90100023.27632004, "market_cap": 1696446446.0, "percent_change_1h": 0.13, "percent_change_24h": -1.08, "percent_change_7d": -5.28}}, "last_updated": 1548449222}
{"id": 1958, "name": "TRON", "symbol": "TRX", "website_slug": "tron", "rank": 9, "circulating_supply": 66658613371.0, "total_supply": 99257825026.0, "max_supply": null, "quotes": {"USD": {"price": 0.026800369, "volume_24h": 203349304.415762, "market_cap": 1786475436.0, "percent_change_1h": 0.26, "percent_change_24h": -0.74, "percent_change_7d": 7.71}, "EUR": {"price": 0.0234798837, "volume_24h": 178154935.64656267, "market_cap": 1565136489.0, "percent_change_1h": 0.26, "percent_change_24h": -0.74, "percent_change_7d": 7.71}}, "last_updated": 1548449225}
{"id": 3602, "name": "Bitcoin SV", "symbol": "BSV", "website_slug": "bitcoin-sv", "rank": 10, "circulating_supply": 17585048.0, "total_supply": 17585048.0, "max_supply": 21000000.0, "quotes": {"USD": {"price": 74.7646895132, "volume_24h": 60787835.961723, "market_cap": 1314740687.0, "percent_change_1h": -0.35, "percent_change_24h": 0.0, "percent_change_7d": -1.65}, "EUR": {"price": 65.5015687766, "volume_24h": 53256405.4495735, "market_cap": 1151848260.0, "percent_change_1h": -0.35, "percent_change_24h": 0.0, "percent_change_7d": -1.65}}, "last_updated": 1548449229}
