{"id": 1, "name": "Bitcoin", "symbol": "BTC", "website_slug": "bitcoin", "rank": 1, "circulating_supply": 17501087.0, "total_supply": 17501087.0, "max_supply": 21000000.0, "quotes": {"USD": {"price": 3584.28338346, "volume_24h": 5299312352.87063, "market_cap": 62728855327.0, "percent_change_1h": 0.08, "percent_change_24h": -0.64, "percent_change_7d": -1.9}, "EUR": {"price": 3140.9003603592, "volume_24h": 4643776816.195818, "market_cap": 54969170465.0, "percent_change_1h": 0.08, "percent_change_24h": -0.64, "percent_change_7d": -1.9}}, "last_updated": 1548447088}
{"id": 52, "name": "XRP", "symbol": "XRP", "website_slug": "ripple", "rank": 2, "circulating_supply": 41040405095.0, "total_supply": 99991724864.0, "max_supply": 100000000000.0, "quotes": {"USD": {"price": 0.3152703637, "volume_24h": 350994134.700158, "market_cap": 12938823439.0, "percent_change_1h": 0.08, "percent_change_24h": -0.9, "percent_change_7d": -2.84}, "EUR": {"price": 0.2762707891, "volume_24h": 307575458.2494784, "market_cap": 11338265102.0, "percent_change_1h": 0.08, "percent_change_24h": -0.9, "percent_change_7d": -2.84}}, "last_updated": 1548447062}
{"id": 1027, "name": "Ethereum", "symbol": "ETH", "website_slug": "ethereum", "rank": 3, "circulating_supply": 104560776.0, "total_supply": 104560776.0, "max_supply": null, "quotes": {"USD": {"price": 115.977957287, "volume_24h": 2601971490.04035, "market_cap": 12126745173.0, "percent_change_1h": -0.01, "percent_change_24h": -1.26, "percent_change_7d": -4.4}, "EUR": {"price": 101.6312520147, "volume_24h": 2280102412.7793736, "market_cap": 10626642541.0, "percent_change_1h": -0.01, "percent_change_24h": -1.26, "percent_change_7d": -4.4}}, "last_updated": 1548447079}
{"id": 1831, "name": "Bitcoin Cash", "symbol": "BCH", "website_slug": "bitcoin-cash", "rank": 4, "circulating_supply": 17586025.0, "total_supply": 17586025.0, "max_supply": 21000000.0, "quotes": {"USD": {"price": 126.922912516, "volume_24h": 199167103.414514, "market_cap": 2232069513.0, "percent_change_1h": -0.15, "percent_change_24h": -2.0, "percent_change_7d": -0.99}, "EUR": {"price": 111.2222943919, "volume_24h": 174529734.38793144, "market_cap": 1955958050.0, "percent_change_1h": -0.15, "percent_change_24h": -2.0, "percent_change_7d": -0.99}}, "last_updated": 1548447064}
{"id": 1765, "name": "EOS", "symbol": "EOS", "website_slug": "eos", "rank": 5, "circulating_supply": 906245118.0, "total_supply": 1006245120.0, "max_supply": null, "quotes": {"USD": {"price": 2.4357997643, "volume_24h": 626590914.596182, "market_cap": 2207431644.0, "percent_change_1h": -0.08, "percent_change_24h": -0.6, "percent_change_7d": -0.71}, "EUR": {"price": 2.1344864618, "volume_24h": 549080365.278804, "market_cap": 1934367935.0, "percent_change_1h": -0.08, "percent_change_24h": -0.6, "percent_change_7d": -0.71}}, "last_updated": 1548447062}
{"id": 825, "name": "Tether", "symbol": "USDT", "website_slug": "tether", "rank": 6, "circulating_supply": 2017251167.0, "total_supply": 2580057493.0, "max_supply": null, "quotes": {"USD": {"price": 1.0096066313, "volume_24h": 3651194637.33155, "market_cap": 2036630155.0, "percent_change_1h": -0.01, "percent_change_24h": -0.04, "percent_change_7d": -0.62}, "EUR": {"price": 0.8847162718, "volume_24h": 3199534558.304356, "market_cap": 1784694931.0, "percent_change_1h": -0.01, "percent_change_24h": -0.04, "percent_change_7d": -0.62}}, "last_updated": 1548447071}
{"id": 2, "name": "Litecoin", "symbol": "LTC", "website_slug": "litecoin", "rank": 7, "circulating_supply": 60178050.0, "total_supply": 60178050.0, "max_supply": 84000000.0, "quotes": {"USD": {"price": 32.3364104731, "volume_24h": 635484575.827593, "market_cap": 1945942131.0, "percent_change_1h": 0.05, "percent_change_24h": -1.46, "percent_change_7d": 3.35}, "EUR": {"price": 28.3363318248, "volume_24h": 556873862.8285669, "market_cap": 1705225198.0, "percent_change_1h": 0.05, "percent_change_24h": -1.46, "percent_change_7d": 3.35}}, "last_updated": 1548447065}
{"id": 512, "name": "Stellar", "symbol": "XLM", "website_slug": "stellar", "rank": 8, "circulating_supply": 19166823582.0, "total_supply": 104662581680.0, "max_supply": null, "quotes": {"USD": {"price": 0.1009407164, "volume_24h": 102994350.228306, "market_cap": 1934712904.0, "percent_change_1h": 0.13, "percent_change_24h": -1.11, "percent_change_7d": -5.33}, "EUR": {"price": 0.0884541479, "volume_24h": 90253743.1163639, "market_cap": 1695385048.0, "percent_change_1h": 0.13, "percent_change_24h": -1.11, "percent_change_7d": -5.33}}, "last_updated": 1548447061}
{"id": 1958, "name": "TRON", "symbol": "TRX", "website_slug": "tron", "rank": 9, "circulating_supply": 66658587269.0, "total_supply": 99257798924.0, "max_supply": null, "quotes": {"USD": {"price": 0.026753708, "volume_24h": 202093070.152747, "market_cap": 1783364381.0, "percent_change_1h": 0.32, "percent_change_24h": -0.88, "percent_change_7d": 7.33}, "EUR": {"price": 0.0234442208, "volume_24h": 177093753.18871152, "market_cap": 1562758640.0, "percent_change_1h": 0.32, "percent_change_24h": -0.88, "percent_change_7d": 7.33}}, "last_updated": 1548447064}
{"id": 3602, "name": "Bitcoin SV", "symbol": "BSV", "website_slug": "bitcoin-sv", "rank": 10, "circulating_supply": 17584961.0, "total_supply": 17584961.0, "max_supply": 21000000.0, "quotes": {"USD": {"price": 75.092529852, "volume_24h": 60071690.1024348, "market_cap": 1320499204.0, "percent_change_1h": 0.27, "percent_change_24h": 0.51, "percent_change_7d": -1.19}, "EUR": {"price": 65.8034337242, "volume_24h": 52640701.893383294, "market_cap": 1157150812.0, "percent_change_1h": 0.27, "percent_change_24h": 0.51, "percent_change_7d": -1.19}}, "last_updated": 1548447066}
