{"id": 1, "name": "Bitcoin", "symbol": "BTC", "website_slug": "bitcoin", "rank": 1, "circulating_supply": 17501062.0, "total_supply": 17501062.0, "max_supply": 21000000.0, "quotes": {"USD": {"price": 3582.01925791, "volume_24h": 5341342528.10146, "market_cap": 62689141118.0, "percent_change_1h": -0.16, "percent_change_24h": -0.59, "percent_change_7d": -1.94}, "EUR": {"price": 3138.679898397, "volume_24h": 4680255246.0834, "market_cap": 54930231500.0, "percent_change_1h": -0.16, "percent_change_24h": -0.59, "percent_change_7d": -1.94}}, "last_updated": 1548444207}
{"id": 52, "name": "XRP", "symbol": "XRP", "website_slug": "ripple", "rank": 2, "circulating_supply": 41040405095.0, "total_supply": 99991724864.0, "max_supply": 100000000000.0, "quotes": {"USD": {"price": 0.3147873972, "volume_24h": 355171156.030988, "market_cap": 12919002300.0, "percent_change_1h": -0.11, "percent_change_24h": -0.9, "percent_change_7d": -2.99}, "EUR": {"price": 0.2758267906, "volume_24h": 311212332.3913447, "market_cap": 11320043223.0, "percent_change_1h": -0.11, "percent_change_24h": -0.9, "percent_change_7d": -2.99}}, "last_updated": 1548444182}
{"id": 1027, "name": "Ethereum", "symbol": "ETH", "website_slug": "ethereum", "rank": 3, "circulating_supply": 104560359.0, "total_supply": 104560359.0, "max_supply": null, "quotes": {"USD": {"price": 116.049856967, "volume_24h": 2611226796.51734, "market_cap": 12134214710.0, "percent_change_1h": -0.15, "percent_change_24h": -0.95, "percent_change_7d": -4.36}, "EUR": {"price": 101.6865982699, "volume_24h": 2288040478.3659825, "market_cap": 10632387224.0, "percent_change_1h": -0.15, "percent_change_24h": -0.95, "percent_change_7d": -4.36}}, "last_updated": 1548444199}
{"id": 1831, "name": "Bitcoin Cash", "symbol": "BCH", "website_slug": "bitcoin-cash", "rank": 4, "circulating_supply": 17585988.0, "total_supply": 17585988.0, "max_supply": 21000000.0, "quotes": {"USD": {"price": 127.041851958, "volume_24h": 200753089.29209, "market_cap": 2234156421.0, "percent_change_1h": -0.35, "percent_change_24h": -1.77, "percent_change_7d": -0.93}, "EUR": {"price": 111.3181360249, "volume_24h": 175906280.93658665, "market_cap": 1957639349.0, "percent_change_1h": -0.35, "percent_change_24h": -1.77, "percent_change_7d": -0.93}}, "last_updated": 1548444184}
{"id": 1765, "name": "EOS", "symbol": "EOS", "website_slug": "eos", "rank": 5, "circulating_supply": 906245118.0, "total_supply": 1006245120.0, "max_supply": null, "quotes": {"USD": {"price": 2.4356073081, "volume_24h": 636605809.11817, "market_cap": 2207257231.0, "percent_change_1h": -0.39, "percent_change_24h": -0.27, "percent_change_7d": -0.73}, "EUR": {"price": 2.1341570628, "volume_24h": 557814381.3352325, "market_cap": 1934069418.0, "percent_change_1h": -0.39, "percent_change_24h": -0.27, "percent_change_7d": -0.73}}, "last_updated": 1548444184}
{"id": 825, "name": "Tether", "symbol": "USDT", "website_slug": "tether", "rank": 6, "circulating_supply": 2017251167.0, "total_supply": 2580057493.0, "max_supply": null, "quotes": {"USD": {"price": 1.0090899363, "volume_24h": 3701557684.32963, "market_cap": 2035587851.0, "percent_change_1h": -0.04, "percent_change_24h": -0.07, "percent_change_7d": -0.67}, "EUR": {"price": 0.884196893, "volume_24h": 3243423292.855521, "market_cap": 1783647214.0, "percent_change_1h": -0.04, "percent_change_24h": -0.07, "percent_change_7d": -0.67}}, "last_updated": 1548444191}
{"id": 2, "name": "Litecoin", "symbol": "LTC", "website_slug": "litecoin", "rank": 7, "circulating_supply": 60177600.0, "total_supply": 60177600.0, "max_supply": 84000000.0, "quotes": {"USD": {"price": 32.2733367384, "volume_24h": 642211763.635924, "market_cap": 1942131954.0, "percent_change_1h": -0.55, "percent_change_24h": -1.24, "percent_change_7d": 3.23}, "EUR": {"price": 28.278930397, "volume_24h": 562726498.074233, "market_cap": 1701758166.0, "percent_change_1h": -0.55, "percent_change_24h": -1.24, "percent_change_7d": 3.23}}, "last_updated": 1548444183}
{"id": 512, "name": "Stellar", "symbol": "XLM", "website_slug": "stellar", "rank": 8, "circulating_supply": 19166823582.0, "total_supply": 104662581680.0, "max_supply": null, "quotes": {"USD": {"price": 0.1007906617, "volume_24h": 103613243.42999, "market_cap": 1931836831.0, "percent_change_1h": -0.07, "percent_change_24h": -1.19, "percent_change_7d": -5.44}, "EUR": {"price": 0.088316003, "volume_24h": 90789239.51714702, "market_cap": 1692737250.0, "percent_change_1h": -0.07, "percent_change_24h": -1.19, "percent_change_7d": -5.44}}, "last_updated": 1548444181}
{"id": 1958, "name": "TRON", "symbol": "TRX", "website_slug": "tron", "rank": 9, "circulating_supply": 66658556319.0, "total_supply": 99257767844.0, "max_supply": null, "quotes": {"USD": {"price": 0.0266353705, "volume_24h": 202882452.768352, "market_cap": 1775475346.0, "percent_change_1h": -0.57, "percent_change_24h": -1.22, "percent_change_7d": 6.59}, "EUR": {"price": 0.023338764, "volume_24h": 177772097.35411865, "market_cap": 1555728314.0, "percent_change_1h": -0.57, "percent_change_24h": -1.22, "percent_change_7d": 6.59}}, "last_updated": 1548444184}
{"id": 3602, "name": "Bitcoin SV", "symbol": "BSV", "website_slug": "bitcoin-sv", "rank": 10, "circulating_supply": 17584911.0, "total_supply": 17584911.0, "max_supply": 21000000.0, "quotes": {"USD": {"price": 74.8677708728, "volume_24h": 60559652.2971295, "market_cap": 1316543083.0, "percent_change_1h": -0.14, "percent_change_24h": 0.32, "percent_change_7d": -1.47}, "EUR": {"price": 65.6015366074, "volume_24h": 53064305.251618385, "market_cap": 1153597179.0, "percent_change_1h": -0.14, "percent_change_24h": 0.32, "percent_change_7d": -1.47}}, "last_updated": 1548444188}
