{"id": 1, "name": "Bitcoin", "symbol": "BTC", "website_slug": "bitcoin", "rank": 1, "circulating_supply": 17501087.0, "total_supply": 17501087.0, "max_supply": 21000000.0, "quotes": {"USD": {"price": 3584.94869018, "volume_24h": 5293360662.48068, "market_cap": 62740498917.0, "percent_change_1h": 0.04, "percent_change_24h": -0.66, "percent_change_7d": -1.9}, "EUR": {"price": 3140.9850594394, "volume_24h": 4637825584.678419, "market_cap": 54970652791.0, "percent_change_1h": 0.04, "percent_change_24h": -0.66, "percent_change_7d": -1.9}}, "last_updated": 1548448707}
{"id": 52, "name": "XRP", "symbol": "XRP", "website_slug": "ripple", "rank": 2, "circulating_supply": 41040405095.0, "total_supply": 99991724864.0, "max_supply": 100000000000.0, "quotes": {"USD": {"price": 0.3152472504, "volume_24h": 361194980.349349, "market_cap": 12937874860.0, "percent_change_1h": 0.01, "percent_change_24h": -0.97, "percent_change_7d": -2.85}, "EUR": {"price": 0.2762067156, "volume_24h": 316464232.7879059, "market_cap": 11335635500.0, "percent_change_1h": 0.01, "percent_change_24h": -0.97, "percent_change_7d": -2.85}}, "last_updated": 1548448683}
{"id": 1027, "name": "Ethereum", "symbol": "ETH", "website_slug": "ethereum", "rank": 3, "circulating_supply": 104561208.0, "total_supply": 104561208.0, "max_supply": null, "quotes": {"USD": {"price": 115.975363773, "volume_24h": 2603824743.46735, "market_cap": 12126524160.0, "percent_change_1h": -0.07, "percent_change_24h": -1.37, "percent_change_7d": -4.4}, "EUR": {"price": 101.612858748, "volume_24h": 2281364483.411614, "market_cap": 10624763281.0, "percent_change_1h": -0.07, "percent_change_24h": -1.37, "percent_change_7d": -4.4}}, "last_updated": 1548448696}
{"id": 1831, "name": "Bitcoin Cash", "symbol": "BCH", "website_slug": "bitcoin-cash", "rank": 4, "circulating_supply": 17586025.0, "total_supply": 17586025.0, "max_supply": 21000000.0, "quotes": {"USD": {"price": 126.984160434, "volume_24h": 199503526.636484, "market_cap": 2233146620.0, "percent_change_1h": -0.08, "percent_change_24h": -2.01, "percent_change_7d": -0.93}, "EUR": {"price": 111.2583150217, "volume_24h": 174796810.39429548, "market_cap": 1956591509.0, "percent_change_1h": -0.08, "percent_change_24h": -2.01, "percent_change_7d": -0.93}}, "last_updated": 1548448684}
{"id": 1765, "name": "EOS", "symbol": "EOS", "website_slug": "eos", "rank": 5, "circulating_supply": 906245118.0, "total_supply": 1006245120.0, "max_supply": null, "quotes": {"USD": {"price": 2.439132479, "volume_24h": 626414612.228422, "market_cap": 2210451900.0, "percent_change_1h": 0.18, "percent_change_24h": -0.6, "percent_change_7d": -0.58}, "EUR": {"price": 2.1370678737, "volume_24h": 548838800.235443, "market_cap": 1936707327.0, "percent_change_1h": 0.18, "percent_change_24h": -0.6, "percent_change_7d": -0.58}}, "last_updated": 1548448685}
{"id": 825, "name": "Tether", "symbol": "USDT", "website_slug": "tether", "rank": 6, "circulating_supply": 2017251167.0, "total_supply": 2580057493.0, "max_supply": null, "quotes": {"USD": {"price": 1.0085478496, "volume_24h": 3650562232.76562, "market_cap": 2034494326.0, "percent_change_1h": -0.1, "percent_change_24h": -0.16, "percent_change_7d": -0.72}, "EUR": {"price": 0.8836482753, "volume_24h": 3198472955.297699, "market_cap": 1782540514.0, "percent_change_1h": -0.1, "percent_change_24h": -0.16, "percent_change_7d": -0.72}}, "last_updated": 1548448690}
{"id": 2, "name": "Litecoin", "symbol": "LTC", "website_slug": "litecoin", "rank": 7, "circulating_supply": 60178400.0, "total_supply": 60178400.0, "max_supply": 84000000.0, "quotes": {"USD": {"price": 32.3576159193, "volume_24h": 634847431.475405, "market_cap": 1947229559.0, "percent_change_1h": 0.16, "percent_change_24h": -1.57, "percent_change_7d": 3.37}, "EUR": {"price": 28.3504164062, "volume_24h": 556227290.7140603, "market_cap": 1706082703.0, "percent_change_1h": 0.16, "percent_change_24h": -1.57, "percent_change_7d": 3.37}}, "last_updated": 1548448686}
{"id": 512, "name": "Stellar", "symbol": "XLM", "website_slug": "stellar", "rank": 8, "circulating_supply": 19166823582.0, "total_supply": 104662581680.0, "max_supply": null, "quotes": {"USD": {"price": 0.1009173242, "volume_24h": 102857829.131431, "market_cap": 1934264550.0, "percent_change_1h": 0.02, "percent_change_24h": -1.17, "percent_change_7d": -5.37}, "EUR": {"price": 0.0884196219, "volume_24h": 90119812.71396561, "market_cap": 1694723294.0, "percent_change_1h": 0.02, "percent_change_24h": -1.17, "percent_change_7d": -5.37}}, "last_updated": 1548448682}
{"id": 1958, "name": "TRON", "symbol": "TRX", "website_slug": "tron", "rank": 9, "circulating_supply": 66658613371.0, "total_supply": 99257825026.0, "max_supply": null, "quotes": {"USD": {"price": 0.0267569567, "volume_24h": 202713553.58367, "market_cap": 1783581631.0, "percent_change_1h": 0.22, "percent_change_24h": -0.9, "percent_change_7d": 7.48}, "EUR": {"price": 0.0234433484, "volume_24h": 177609304.39431503, "market_cap": 1562701098.0, "percent_change_1h": 0.22, "percent_change_24h": -0.9, "percent_change_7d": 7.48}}, "last_updated": 1548448685}
{"id": 3602, "name": "Bitcoin SV", "symbol": "BSV", "website_slug": "bitcoin-sv", "rank": 10, "circulating_supply": 17585048.0, "total_supply": 17585048.0, "max_supply": 21000000.0, "quotes": {"USD": {"price": 74.6658272143, "volume_24h": 60514949.845393, "market_cap": 1313002188.0, "percent_change_1h": -0.4, "percent_change_24h": -0.12, "percent_change_7d": -1.77}, "EUR": {"price": 65.4191365063, "volume_24h": 53020717.94158978, "market_cap": 1150398684.0, "percent_change_1h": -0.4, "percent_change_24h": -0.12, "percent_change_7d": -1.77}}, "last_updated": 1548448689}
