{"id": 1, "name": "Bitcoin", "symbol": "BTC", "website_slug": "bitcoin", "rank": 1, "circulating_supply": 17501062.0, "total_supply": 17501062.0, "max_supply": 21000000.0, "quotes": {"USD": {"price": 3582.717332, "volume_24h": 5345804717.64734, "market_cap": 62701358156.0, "percent_change_1h": -0.18, "percent_change_24h": -0.55, "percent_change_7d": -1.92}, "EUR": {"price": 3140.3986329086, "volume_24h": 4685817013.01133, "market_cap": 54960311179.0, "percent_change_1h": -0.18, "percent_change_24h": -0.55, "percent_change_7d": -1.92}}, "last_updated": 1548443841}
{"id": 52, "name": "XRP", "symbol": "XRP", "website_slug": "ripple", "rank": 2, "circulating_supply": 41040405095.0, "total_supply": 99991724864.0, "max_supply": 100000000000.0, "quotes": {"USD": {"price": 0.315101384, "volume_24h": 356042966.361488, "market_cap": 12931888447.0, "percent_change_1h": -0.04, "percent_change_24h": -0.78, "percent_change_7d": -2.89}, "EUR": {"price": 0.2761992823, "volume_24h": 312086257.77746594, "market_cap": 11335330431.0, "percent_change_1h": -0.04, "percent_change_24h": -0.78, "percent_change_7d": -2.89}}, "last_updated": 1548443822}
{"id": 1027, "name": "Ethereum", "symbol": "ETH", "website_slug": "ethereum", "rank": 3, "circulating_supply": 104560359.0, "total_supply": 104560359.0, "max_supply": null, "quotes": {"USD": {"price": 116.068007549, "volume_24h": 2609557507.33892, "market_cap": 12136112541.0, "percent_change_1h": -0.16, "percent_change_24h": -0.91, "percent_change_7d": -4.35}, "EUR": {"price": 101.738367405, "volume_24h": 2287384147.040371, "market_cap": 10637800223.0, "percent_change_1h": -0.16, "percent_change_24h": -0.91, "percent_change_7d": -4.35}}, "last_updated": 1548443838}
{"id": 1831, "name": "Bitcoin Cash", "symbol": "BCH", "website_slug": "bitcoin-cash", "rank": 4, "circulating_supply": 17585988.0, "total_supply": 17585988.0, "max_supply": 21000000.0, "quotes": {"USD": {"price": 127.10380003, "volume_24h": 200839962.688214, "market_cap": 2235245839.0, "percent_change_1h": -0.36, "percent_change_24h": -1.7, "percent_change_7d": -0.89}, "EUR": {"price": 111.4116919821, "volume_24h": 176044461.73469028, "market_cap": 1959284623.0, "percent_change_1h": -0.36, "percent_change_24h": -1.7, "percent_change_7d": -0.89}}, "last_updated": 1548443824}
{"id": 1765, "name": "EOS", "symbol": "EOS", "website_slug": "eos", "rank": 5, "circulating_supply": 906245118.0, "total_supply": 1006245120.0, "max_supply": null, "quotes": {"USD": {"price": 2.4372405617, "volume_24h": 637211151.144549, "market_cap": 2208737359.0, "percent_change_1h": -0.35, "percent_change_24h": -0.16, "percent_change_7d": -0.66}, "EUR": {"price": 2.1363412792, "volume_24h": 558541699.6353956, "market_cap": 1936048854.0, "percent_change_1h": -0.35, "percent_change_24h": -0.16, "percent_change_7d": -0.66}}, "last_updated": 1548443824}
{"id": 825, "name": "Tether", "symbol": "USDT", "website_slug": "tether", "rank": 6, "circulating_supply": 2017251167.0, "total_supply": 2580057493.0, "max_supply": null, "quotes": {"USD": {"price": 1.0101637302, "volume_24h": 3701914877.55346, "market_cap": 2037753963.0, "percent_change_1h": 0.08, "percent_change_24h": 0.04, "percent_change_7d": -0.56}, "EUR": {"price": 0.8854499263, "volume_24h": 3244880168.6855965, "market_cap": 1786174897.0, "percent_change_1h": 0.08, "percent_change_24h": 0.04, "percent_change_7d": -0.56}}, "last_updated": 1548443828}
{"id": 2, "name": "Litecoin", "symbol": "LTC", "website_slug": "litecoin", "rank": 7, "circulating_supply": 60177600.0, "total_supply": 60177600.0, "max_supply": 84000000.0, "quotes": {"USD": {"price": 32.2834771437, "volume_24h": 642704270.527217, "market_cap": 1942742179.0, "percent_change_1h": -0.54, "percent_change_24h": -1.15, "percent_change_7d": 3.27}, "EUR": {"price": 28.297791339, "volume_24h": 563356643.992199, "market_cap": 1702893172.0, "percent_change_1h": -0.54, "percent_change_24h": -1.15, "percent_change_7d": 3.27}}, "last_updated": 1548443826}
{"id": 512, "name": "Stellar", "symbol": "XLM", "website_slug": "stellar", "rank": 8, "circulating_supply": 19166823582.0, "total_supply": 104662581680.0, "max_supply": null, "quotes": {"USD": {"price": 0.1007829049, "volume_24h": 103772016.971127, "market_cap": 1931688159.0, "percent_change_1h": -0.09, "percent_change_24h": -1.19, "percent_change_7d": -5.44}, "EUR": {"price": 0.0883403483, "volume_24h": 90960427.5278889, "market_cap": 1693203870.0, "percent_change_1h": -0.09, "percent_change_24h": -1.19, "percent_change_7d": -5.44}}, "last_updated": 1548443821}
{"id": 1958, "name": "TRON", "symbol": "TRX", "website_slug": "tron", "rank": 9, "circulating_supply": 66658556319.0, "total_supply": 99257767844.0, "max_supply": null, "quotes": {"USD": {"price": 0.0266727311, "volume_24h": 202978633.126851, "market_cap": 1777965751.0, "percent_change_1h": -0.46, "percent_change_24h": -1.06, "percent_change_7d": 6.73}, "EUR": {"price": 0.0233797424, "volume_24h": 177919094.0596436, "market_cap": 1558459878.0, "percent_change_1h": -0.46, "percent_change_24h": -1.06, "percent_change_7d": 6.73}}, "last_updated": 1548443824}
{"id": 3602, "name": "Bitcoin SV", "symbol": "BSV", "website_slug": "bitcoin-sv", "rank": 10, "circulating_supply": 17584911.0, "total_supply": 17584911.0, "max_supply": 21000000.0, "quotes": {"USD": {"price": 74.974377628, "volume_24h": 60575048.2205666, "market_cap": 1318417753.0, "percent_change_1h": 0.0, "percent_change_24h": 0.48, "percent_change_7d": -1.32}, "EUR": {"price": 65.7181159404, "volume_24h": 53096513.34230382, "market_cap": 1155647216.0, "percent_change_1h": 0.0, "percent_change_24h": 0.48, "percent_change_7d": -1.32}}, "last_updated": 1548443829}
