{"id": 1, "name": "Bitcoin", "symbol": "BTC", "website_slug": "bitcoin", "rank": 1, "circulating_supply": 17501087.0, "total_supply": 17501087.0, "max_supply": 21000000.0, "quotes": {"USD": {"price": 3581.42344579, "volume_24h": 5344780706.49493, "market_cap": 62678803309.0, "percent_change_1h": -0.03, "percent_change_24h": -0.7, "percent_change_7d": -1.97}, "EUR": {"price": 3138.3977841223, "volume_24h": 4683625988.320792, "market_cap": 54925372661.0, "percent_change_1h": -0.03, "percent_change_24h": -0.7, "percent_change_7d": -1.97}}, "last_updated": 1548446366}
{"id": 52, "name": "XRP", "symbol": "XRP", "website_slug": "ripple", "rank": 2, "circulating_supply": 41040405095.0, "total_supply": 99991724864.0, "max_supply": 100000000000.0, "quotes": {"USD": {"price": 0.315279637, "volume_24h": 353587636.757662, "market_cap": 12939204019.0, "percent_change_1h": 0.11, "percent_change_24h": -0.86, "percent_change_7d": -2.83}, "EUR": {"price": 0.2762792306, "volume_24h": 309848492.5031019, "market_cap": 11338611543.0, "percent_change_1h": 0.11, "percent_change_24h": -0.86, "percent_change_7d": -2.83}}, "last_updated": 1548446342}
{"id": 1027, "name": "Ethereum", "symbol": "ETH", "website_slug": "ethereum", "rank": 3, "circulating_supply": 104560776.0, "total_supply": 104560776.0, "max_supply": null, "quotes": {"USD": {"price": 115.893875966, "volume_24h": 2617352324.42164, "market_cap": 12117953565.0, "percent_change_1h": -0.1, "percent_change_24h": -1.28, "percent_change_7d": -4.47}, "EUR": {"price": 101.5576876151, "volume_24h": 2293583224.5383544, "market_cap": 10618950591.0, "percent_change_1h": -0.1, "percent_change_24h": -1.28, "percent_change_7d": -4.47}}, "last_updated": 1548446356}
{"id": 1831, "name": "Bitcoin Cash", "symbol": "BCH", "website_slug": "bitcoin-cash", "rank": 4, "circulating_supply": 17586025.0, "total_supply": 17586025.0, "max_supply": 21000000.0, "quotes": {"USD": {"price": 126.840430874, "volume_24h": 200825462.497928, "market_cap": 2230618988.0, "percent_change_1h": -0.26, "percent_change_24h": -2.04, "percent_change_7d": -1.07}, "EUR": {"price": 111.1501427345, "volume_24h": 175983151.96147147, "market_cap": 1954689189.0, "percent_change_1h": -0.26, "percent_change_24h": -2.04, "percent_change_7d": -1.07}}, "last_updated": 1548446344}
{"id": 1765, "name": "EOS", "symbol": "EOS", "website_slug": "eos", "rank": 5, "circulating_supply": 906245118.0, "total_supply": 1006245120.0, "max_supply": null, "quotes": {"USD": {"price": 2.4377716618, "volume_24h": 637376514.536227, "market_cap": 2209218666.0, "percent_change_1h": -0.08, "percent_change_24h": -0.46, "percent_change_7d": -0.64}, "EUR": {"price": 2.1362168695, "volume_24h": 558532402.3115802, "market_cap": 1935936108.0, "percent_change_1h": -0.08, "percent_change_24h": -0.46, "percent_change_7d": -0.64}}, "last_updated": 1548446344}
{"id": 825, "name": "Tether", "symbol": "USDT", "website_slug": "tether", "rank": 6, "circulating_supply": 2017251167.0, "total_supply": 2580057493.0, "max_supply": null, "quotes": {"USD": {"price": 1.0085009571, "volume_24h": 3696286977.50427, "market_cap": 2034399732.0, "percent_change_1h": -0.1, "percent_change_24h": -0.15, "percent_change_7d": -0.73}, "EUR": {"price": 0.8837483802, "volume_24h": 3239052582.1000085, "market_cap": 1782742451.0, "percent_change_1h": -0.1, "percent_change_24h": -0.15, "percent_change_7d": -0.73}}, "last_updated": 1548446350}
{"id": 2, "name": "Litecoin", "symbol": "LTC", "website_slug": "litecoin", "rank": 7, "circulating_supply": 60178050.0, "total_supply": 60178050.0, "max_supply": 84000000.0, "quotes": {"USD": {"price": 32.3088146737, "volume_24h": 640004906.234569, "market_cap": 1944281470.0, "percent_change_1h": -0.17, "percent_change_24h": -1.47, "percent_change_7d": 3.29}, "EUR": {"price": 28.3121819897, "volume_24h": 560835659.3284456, "market_cap": 1703771908.0, "percent_change_1h": -0.17, "percent_change_24h": -1.47, "percent_change_7d": 3.29}}, "last_updated": 1548446345}
{"id": 512, "name": "Stellar", "symbol": "XLM", "website_slug": "stellar", "rank": 8, "circulating_supply": 19166823582.0, "total_supply": 104662581680.0, "max_supply": null, "quotes": {"USD": {"price": 0.100735941, "volume_24h": 103282611.112643, "market_cap": 1930788009.0, "percent_change_1h": -0.03, "percent_change_24h": -1.28, "percent_change_7d": -5.52}, "EUR": {"price": 0.0882748043, "volume_24h": 90506448.83539778, "market_cap": 1691947601.0, "percent_change_1h": -0.03, "percent_change_24h": -1.28, "percent_change_7d": -5.52}}, "last_updated": 1548446341}
{"id": 1958, "name": "TRON", "symbol": "TRX", "website_slug": "tron", "rank": 9, "circulating_supply": 66658587269.0, "total_supply": 99257798924.0, "max_supply": null, "quotes": {"USD": {"price": 0.0267273476, "volume_24h": 203062252.467819, "market_cap": 1781607235.0, "percent_change_1h": 0.1, "percent_change_24h": -0.96, "percent_change_7d": 7.14}, "EUR": {"price": 0.023421148, "volume_24h": 177943248.775297, "market_cap": 1561220639.0, "percent_change_1h": 0.1, "percent_change_24h": -0.96, "percent_change_7d": 7.14}}, "last_updated": 1548446344}
{"id": 3602, "name": "Bitcoin SV", "symbol": "BSV", "website_slug": "bitcoin-sv", "rank": 10, "circulating_supply": 17584961.0, "total_supply": 17584961.0, "max_supply": 21000000.0, "quotes": {"USD": {"price": 75.0383093156, "volume_24h": 60836307.1844328, "market_cap": 1319545738.0, "percent_change_1h": 0.21, "percent_change_24h": 0.48, "percent_change_7d": -1.26}, "EUR": {"price": 65.755995415, "volume_24h": 53310795.14941118, "market_cap": 1156316611.0, "percent_change_1h": 0.21, "percent_change_24h": 0.48, "percent_change_7d": -1.26}}, "last_updated": 1548446349}
