{"id": 1, "name": "Bitcoin", "symbol": "BTC", "website_slug": "bitcoin", "rank": 1, "circulating_supply": 17501075.0, "total_supply": 17501075.0, "max_supply": 21000000.0, "quotes": {"USD": {"price": 3584.31118493, "volume_24h": 5351802459.87403, "market_cap": 62729298871.0, "percent_change_1h": 0.01, "percent_change_24h": -0.59, "percent_change_7d": -1.89}, "EUR": {"price": 3142.8172390374, "volume_24h": 4692599543.681514, "market_cap": 55002680212.0, "percent_change_1h": 0.01, "percent_change_24h": -0.59, "percent_change_7d": -1.89}}, "last_updated": 1548445464}
{"id": 52, "name": "XRP", "symbol": "XRP", "website_slug": "ripple", "rank": 2, "circulating_supply": 41040405095.0, "total_supply": 99991724864.0, "max_supply": 100000000000.0, "quotes": {"USD": {"price": 0.3156828831, "volume_24h": 354609109.158994, "market_cap": 12955753402.0, "percent_change_1h": 0.31, "percent_change_24h": -0.69, "percent_change_7d": -2.71}, "EUR": {"price": 0.2767989596, "volume_24h": 310930486.74744457, "market_cap": 11359941432.0, "percent_change_1h": 0.31, "percent_change_24h": -0.69, "percent_change_7d": -2.71}}, "last_updated": 1548445442}
{"id": 1027, "name": "Ethereum", "symbol": "ETH", "website_slug": "ethereum", "rank": 3, "circulating_supply": 104560565.0, "total_supply": 104560565.0, "max_supply": null, "quotes": {"USD": {"price": 116.020753284, "volume_24h": 2617208649.49441, "market_cap": 12131195569.0, "percent_change_1h": -0.09, "percent_change_24h": -1.09, "percent_change_7d": -4.37}, "EUR": {"price": 101.730013019, "volume_24h": 2294836591.3015895, "market_cap": 10636947686.0, "percent_change_1h": -0.09, "percent_change_24h": -1.09, "percent_change_7d": -4.37}}, "last_updated": 1548445458}
{"id": 1831, "name": "Bitcoin Cash", "symbol": "BCH", "website_slug": "bitcoin-cash", "rank": 4, "circulating_supply": 17586000.0, "total_supply": 17586000.0, "max_supply": 21000000.0, "quotes": {"USD": {"price": 127.119360625, "volume_24h": 201228625.003694, "market_cap": 2235521076.0, "percent_change_1h": -0.11, "percent_change_24h": -1.79, "percent_change_7d": -0.86}, "EUR": {"price": 111.4615604994, "volume_24h": 176442490.3474893, "market_cap": 1960163003.0, "percent_change_1h": -0.11, "percent_change_24h": -1.79, "percent_change_7d": -0.86}}, "last_updated": 1548445444}
{"id": 1765, "name": "EOS", "symbol": "EOS", "website_slug": "eos", "rank": 5, "circulating_supply": 906245118.0, "total_supply": 1006245120.0, "max_supply": null, "quotes": {"USD": {"price": 2.433737951, "volume_24h": 640810949.805643, "market_cap": 2205563136.0, "percent_change_1h": -0.34, "percent_change_24h": -0.53, "percent_change_7d": -0.8}, "EUR": {"price": 2.1339647126, "volume_24h": 561879701.8742837, "market_cap": 1933895102.0, "percent_change_1h": -0.34, "percent_change_24h": -0.53, "percent_change_7d": -0.8}}, "last_updated": 1548445445}
{"id": 825, "name": "Tether", "symbol": "USDT", "website_slug": "tether", "rank": 6, "circulating_supply": 2017251167.0, "total_supply": 2580057493.0, "max_supply": null, "quotes": {"USD": {"price": 1.009248431, "volume_24h": 3703898149.24917, "market_cap": 2035907575.0, "percent_change_1h": -0.0, "percent_change_24h": -0.07, "percent_change_7d": -0.66}, "EUR": {"price": 0.8849352647, "volume_24h": 3247674198.613558, "market_cap": 1785136695.0, "percent_change_1h": -0.0, "percent_change_24h": -0.07, "percent_change_7d": -0.66}}, "last_updated": 1548445450}
{"id": 2, "name": "Litecoin", "symbol": "LTC", "website_slug": "litecoin", "rank": 7, "circulating_supply": 60177800.0, "total_supply": 60177800.0, "max_supply": 84000000.0, "quotes": {"USD": {"price": 32.3226008357, "volume_24h": 642046883.71045, "market_cap": 1945103014.0, "percent_change_1h": -0.28, "percent_change_24h": -1.31, "percent_change_7d": 3.36}, "EUR": {"price": 28.3412968004, "volume_24h": 562963400.8563, "market_cap": 1705516895.0, "percent_change_1h": -0.28, "percent_change_24h": -1.31, "percent_change_7d": 3.36}}, "last_updated": 1548445444}
{"id": 512, "name": "Stellar", "symbol": "XLM", "website_slug": "stellar", "rank": 8, "circulating_supply": 19166823582.0, "total_supply": 104662581680.0, "max_supply": null, "quotes": {"USD": {"price": 0.1008939264, "volume_24h": 103174271.194515, "market_cap": 1933816088.0, "percent_change_1h": 0.18, "percent_change_24h": -1.12, "percent_change_7d": -5.36}, "EUR": {"price": 0.0884664179, "volume_24h": 90465883.51440196, "market_cap": 1695620225.0, "percent_change_1h": 0.18, "percent_change_24h": -1.12, "percent_change_7d": -5.36}}, "last_updated": 1548445442}
{"id": 1958, "name": "TRON", "symbol": "TRX", "website_slug": "tron", "rank": 9, "circulating_supply": 66658572350.0, "total_supply": 99257784005.0, "max_supply": null, "quotes": {"USD": {"price": 0.0267444991, "volume_24h": 203028685.481364, "market_cap": 1782750130.0, "percent_change_1h": 0.01, "percent_change_24h": -0.86, "percent_change_7d": 7.11}, "EUR": {"price": 0.0234502722, "volume_24h": 178020830.1758828, "market_cap": 1563161665.0, "percent_change_1h": 0.01, "percent_change_24h": -0.86, "percent_change_7d": 7.11}}, "last_updated": 1548445444}
{"id": 3602, "name": "Bitcoin SV", "symbol": "BSV", "website_slug": "bitcoin-sv", "rank": 10, "circulating_supply": 17584936.0, "total_supply": 17584936.0, "max_supply": 21000000.0, "quotes": {"USD": {"price": 75.0779039492, "volume_24h": 60513882.6777485, "market_cap": 1320240131.0, "percent_change_1h": 0.22, "percent_change_24h": 0.55, "percent_change_7d": -1.2}, "EUR": {"price": 65.8302582082, "volume_24h": 53060145.6927996, "market_cap": 1157620873.0, "percent_change_1h": 0.22, "percent_change_24h": 0.55, "percent_change_7d": -1.2}}, "last_updated": 1548445449}
