{"id": 1, "name": "Bitcoin", "symbol": "BTC", "website_slug": "bitcoin", "rank": 1, "circulating_supply": 17501062.0, "total_supply": 17501062.0, "max_supply": 21000000.0, "quotes": {"USD": {"price": 3582.1183131, "volume_24h": 5345746735.0052, "market_cap": 62690874689.0, "percent_change_1h": -0.13, "percent_change_24h": -0.6, "percent_change_7d": -1.94}, "EUR": {"price": 3138.6019162818, "volume_24h": 4683868448.75728, "market_cap": 54928866730.0, "percent_change_1h": -0.13, "percent_change_24h": -0.6, "percent_change_7d": -1.94}}, "last_updated": 1548444385}
{"id": 52, "name": "XRP", "symbol": "XRP", "website_slug": "ripple", "rank": 2, "circulating_supply": 41040405095.0, "total_supply": 99991724864.0, "max_supply": 100000000000.0, "quotes": {"USD": {"price": 0.315220813, "volume_24h": 355423820.613511, "market_cap": 12936789859.0, "percent_change_1h": 0.05, "percent_change_24h": -0.78, "percent_change_7d": -2.86}, "EUR": {"price": 0.2761920632, "volume_24h": 311417375.6880707, "market_cap": 11335034159.0, "percent_change_1h": 0.05, "percent_change_24h": -0.78, "percent_change_7d": -2.86}}, "last_updated": 1548444362}
{"id": 1027, "name": "Ethereum", "symbol": "ETH", "website_slug": "ethereum", "rank": 3, "circulating_supply": 104560359.0, "total_supply": 104560359.0, "max_supply": null, "quotes": {"USD": {"price": 116.097403132, "volume_24h": 2613206861.33649, "market_cap": 12139186154.0, "percent_change_1h": -0.1, "percent_change_24h": -0.93, "percent_change_7d": -4.32}, "EUR": {"price": 101.7229192606, "volume_24h": 2289655267.006981, "market_cap": 10636184960.0, "percent_change_1h": -0.1, "percent_change_24h": -0.93, "percent_change_7d": -4.32}}, "last_updated": 1548444375}
{"id": 1831, "name": "Bitcoin Cash", "symbol": "BCH", "website_slug": "bitcoin-cash", "rank": 4, "circulating_supply": 17585988.0, "total_supply": 17585988.0, "max_supply": 21000000.0, "quotes": {"USD": {"price": 127.13517844, "volume_24h": 200770973.347048, "market_cap": 2235797659.0, "percent_change_1h": -0.23, "percent_change_24h": -1.72, "percent_change_7d": -0.86}, "EUR": {"price": 111.3940634566, "volume_24h": 175912716.05305713, "market_cap": 1958974608.0, "percent_change_1h": -0.23, "percent_change_24h": -1.72, "percent_change_7d": -0.86}}, "last_updated": 1548444365}
{"id": 1765, "name": "EOS", "symbol": "EOS", "website_slug": "eos", "rank": 5, "circulating_supply": 906245118.0, "total_supply": 1006245120.0, "max_supply": null, "quotes": {"USD": {"price": 2.4363401077, "volume_24h": 636966227.370337, "market_cap": 2207921327.0, "percent_change_1h": -0.34, "percent_change_24h": -0.28, "percent_change_7d": -0.7}, "EUR": {"price": 2.1346870936, "volume_24h": 558100890.8947078, "market_cap": 1934549756.0, "percent_change_1h": -0.34, "percent_change_24h": -0.28, "percent_change_7d": -0.7}}, "last_updated": 1548444364}
{"id": 825, "name": "Tether", "symbol": "USDT", "website_slug": "tether", "rank": 6, "circulating_supply": 2017251167.0, "total_supply": 2580057493.0, "max_supply": null, "quotes": {"USD": {"price": 1.0096451161, "volume_24h": 3702939481.92056, "market_cap": 2036707788.0, "percent_change_1h": 0.0, "percent_change_24h": -0.02, "percent_change_7d": -0.62}, "EUR": {"price": 0.8846369157, "volume_24h": 3244463732.9060574, "market_cap": 1784534850.0, "percent_change_1h": 0.0, "percent_change_24h": -0.02, "percent_change_7d": -0.62}}, "last_updated": 1548444370}
{"id": 2, "name": "Litecoin", "symbol": "LTC", "website_slug": "litecoin", "rank": 7, "circulating_supply": 60177600.0, "total_supply": 60177600.0, "max_supply": 84000000.0, "quotes": {"USD": {"price": 32.2903447081, "volume_24h": 642538031.702757, "market_cap": 1943155453.0, "percent_change_1h": -0.47, "percent_change_24h": -1.24, "percent_change_7d": 3.28}, "EUR": {"price": 28.2923479684, "volume_24h": 562982827.8455135, "market_cap": 1702565603.0, "percent_change_1h": -0.47, "percent_change_24h": -1.24, "percent_change_7d": 3.28}}, "last_updated": 1548444365}
{"id": 512, "name": "Stellar", "symbol": "XLM", "website_slug": "stellar", "rank": 8, "circulating_supply": 19166823582.0, "total_supply": 104662581680.0, "max_supply": null, "quotes": {"USD": {"price": 0.1008265645, "volume_24h": 103556219.993698, "market_cap": 1932524974.0, "percent_change_1h": -0.01, "percent_change_24h": -1.16, "percent_change_7d": -5.41}, "EUR": {"price": 0.0883428242, "volume_24h": 90734510.17139855, "market_cap": 1693251326.0, "percent_change_1h": -0.01, "percent_change_24h": -1.16, "percent_change_7d": -5.41}}, "last_updated": 1548444362}
{"id": 1958, "name": "TRON", "symbol": "TRX", "website_slug": "tron", "rank": 9, "circulating_supply": 66658556319.0, "total_supply": 99257767844.0, "max_supply": null, "quotes": {"USD": {"price": 0.0266590373, "volume_24h": 202638026.070021, "market_cap": 1777052940.0, "percent_change_1h": -0.45, "percent_change_24h": -1.14, "percent_change_7d": 6.71}, "EUR": {"price": 0.0233582753, "volume_24h": 177548601.51018795, "market_cap": 1557028907.0, "percent_change_1h": -0.45, "percent_change_24h": -1.14, "percent_change_7d": 6.71}}, "last_updated": 1548444364}
{"id": 3602, "name": "Bitcoin SV", "symbol": "BSV", "website_slug": "bitcoin-sv", "rank": 10, "circulating_supply": 17584911.0, "total_supply": 17584911.0, "max_supply": 21000000.0, "quotes": {"USD": {"price": 74.9176518618, "volume_24h": 60437848.6119674, "market_cap": 1317420236.0, "percent_change_1h": -0.06, "percent_change_24h": 0.38, "percent_change_7d": -1.4}, "EUR": {"price": 65.6417977142, "volume_24h": 52954796.82392542, "market_cap": 1154305167.0, "percent_change_1h": -0.06, "percent_change_24h": 0.38, "percent_change_7d": -1.4}}, "last_updated": 1548444369}
