{"id": 1, "name": "Bitcoin", "symbol": "BTC", "website_slug": "bitcoin", "rank": 1, "circulating_supply": 17501025.0, "total_supply": 17501025.0, "max_supply": 21000000.0, "quotes": {"USD": {"price": 3580.44302497, "volume_24h": 5355314844.2435, "market_cap": 62661422891.0, "percent_change_1h": -0.31, "percent_change_24h": -0.55, "percent_change_7d": -1.98}, "EUR": {"price": 3139.0567501808, "volume_24h": 4695127696.1897135, "market_cap": 54936710661.0, "percent_change_1h": -0.31, "percent_change_24h": -0.55, "percent_change_7d": -1.98}}, "last_updated": 1548442947}
{"id": 52, "name": "XRP", "symbol": "XRP", "website_slug": "ripple", "rank": 2, "circulating_supply": 41040405095.0, "total_supply": 99991724864.0, "max_supply": 100000000000.0, "quotes": {"USD": {"price": 0.314580086, "volume_24h": 368064487.133254, "market_cap": 12910494165.0, "percent_change_1h": -0.18, "percent_change_24h": -0.88, "percent_change_7d": -3.05}, "EUR": {"price": 0.2757995968, "volume_24h": 322690601.3529292, "market_cap": 11318927176.0, "percent_change_1h": -0.18, "percent_change_24h": -0.88, "percent_change_7d": -3.05}}, "last_updated": 1548442922}
{"id": 1027, "name": "Ethereum", "symbol": "ETH", "website_slug": "ethereum", "rank": 3, "circulating_supply": 104560154.0, "total_supply": 104560154.0, "max_supply": null, "quotes": {"USD": {"price": 115.875856738, "volume_24h": 2604789928.19711, "market_cap": 12115997425.0, "percent_change_1h": -0.38, "percent_change_24h": -0.99, "percent_change_7d": -4.51}, "EUR": {"price": 101.5910287469, "volume_24h": 2283679240.218765, "market_cap": 10622373611.0, "percent_change_1h": -0.38, "percent_change_24h": -0.99, "percent_change_7d": -4.51}}, "last_updated": 1548442940}
{"id": 1831, "name": "Bitcoin Cash", "symbol": "BCH", "website_slug": "bitcoin-cash", "rank": 4, "circulating_supply": 17585950.0, "total_supply": 17585950.0, "max_supply": 21000000.0, "quotes": {"USD": {"price": 127.123264298, "volume_24h": 200623806.981664, "market_cap": 2235583370.0, "percent_change_1h": -0.52, "percent_change_24h": -1.63, "percent_change_7d": -0.87}, "EUR": {"price": 111.4518896451, "volume_24h": 175891505.92838615, "market_cap": 1959987359.0, "percent_change_1h": -0.52, "percent_change_24h": -1.63, "percent_change_7d": -0.87}}, "last_updated": 1548442926}
{"id": 1765, "name": "EOS", "symbol": "EOS", "website_slug": "eos", "rank": 5, "circulating_supply": 906245118.0, "total_supply": 1006245120.0, "max_supply": null, "quotes": {"USD": {"price": 2.4402224054, "volume_24h": 642287505.002053, "market_cap": 2211439641.0, "percent_change_1h": -0.28, "percent_change_24h": 0.1, "percent_change_7d": -0.53}, "EUR": {"price": 2.1393991079, "volume_24h": 563108228.2479173, "market_cap": 1938819996.0, "percent_change_1h": -0.28, "percent_change_24h": 0.1, "percent_change_7d": -0.53}}, "last_updated": 1548442925}
{"id": 825, "name": "Tether", "symbol": "USDT", "website_slug": "tether", "rank": 6, "circulating_supply": 2017251167.0, "total_supply": 2580057493.0, "max_supply": null, "quotes": {"USD": {"price": 1.0101051309, "volume_24h": 3718126353.95957, "market_cap": 2037635754.0, "percent_change_1h": 0.1, "percent_change_24h": 0.04, "percent_change_7d": -0.57}, "EUR": {"price": 0.8855824007, "volume_24h": 3259766891.4225097, "market_cap": 1786442131.0, "percent_change_1h": 0.1, "percent_change_24h": 0.04, "percent_change_7d": -0.57}}, "last_updated": 1548442930}
{"id": 2, "name": "Litecoin", "symbol": "LTC", "website_slug": "litecoin", "rank": 7, "circulating_supply": 60177450.0, "total_supply": 60177450.0, "max_supply": 84000000.0, "quotes": {"USD": {"price": 32.4004565987, "volume_24h": 651258300.03736, "market_cap": 1949776862.0, "percent_change_1h": -0.29, "percent_change_24h": -0.62, "percent_change_7d": 3.66}, "EUR": {"price": 28.4062255106, "volume_24h": 570973130.5836568, "market_cap": 1709414220.0, "percent_change_1h": -0.29, "percent_change_24h": -0.62, "percent_change_7d": 3.66}}, "last_updated": 1548442924}
{"id": 512, "name": "Stellar", "symbol": "XLM", "website_slug": "stellar", "rank": 8, "circulating_supply": 19166823582.0, "total_supply": 104662581680.0, "max_supply": null, "quotes": {"USD": {"price": 0.1007127189, "volume_24h": 104161800.642808, "market_cap": 1930342915.0, "percent_change_1h": -0.21, "percent_change_24h": -1.23, "percent_change_7d": -5.5}, "EUR": {"price": 0.088297157, "volume_24h": 91321046.34496495, "market_cap": 1692376032.0, "percent_change_1h": -0.21, "percent_change_24h": -1.23, "percent_change_7d": -5.5}}, "last_updated": 1548442923}
{"id": 1958, "name": "TRON", "symbol": "TRX", "website_slug": "tron", "rank": 9, "circulating_supply": 66658539290.0, "total_supply": 99257750945.0, "max_supply": null, "quotes": {"USD": {"price": 0.0267018167, "volume_24h": 202459716.158794, "market_cap": 1779904095.0, "percent_change_1h": -0.42, "percent_change_24h": -0.9, "percent_change_7d": 6.81}, "EUR": {"price": 0.0234100968, "volume_24h": 177501089.7298871, "market_cap": 1560482858.0, "percent_change_1h": -0.42, "percent_change_24h": -0.9, "percent_change_7d": 6.81}}, "last_updated": 1548442925}
{"id": 3602, "name": "Bitcoin SV", "symbol": "BSV", "website_slug": "bitcoin-sv", "rank": 10, "circulating_supply": 17584898.0, "total_supply": 17584898.0, "max_supply": 21000000.0, "quotes": {"USD": {"price": 74.8786118012, "volume_24h": 60800340.8039347, "market_cap": 1316732784.0, "percent_change_1h": -0.15, "percent_change_24h": 0.39, "percent_change_7d": -1.44}, "EUR": {"price": 65.6478011742, "volume_24h": 53305057.190648265, "market_cap": 1154409916.0, "percent_change_1h": -0.15, "percent_change_24h": 0.39, "percent_change_7d": -1.44}}, "last_updated": 1548442929}
