{"id": 1, "name": "Bitcoin", "symbol": "BTC", "website_slug": "bitcoin", "rank": 1, "circulating_supply": 17501087.0, "total_supply": 17501087.0, "max_supply": 21000000.0, "quotes": {"USD": {"price": 3583.86565914, "volume_24h": 5291317463.62441, "market_cap": 62721544697.0, "percent_change_1h": 0.01, "percent_change_24h": -0.68, "percent_change_7d": -1.92}, "EUR": {"price": 3139.1975274822, "volume_24h": 4634797249.32523, "market_cap": 54939369039.0, "percent_change_1h": 0.01, "percent_change_24h": -0.68, "percent_change_7d": -1.92}}, "last_updated": 1548448347}
{"id": 52, "name": "XRP", "symbol": "XRP", "website_slug": "ripple", "rank": 2, "circulating_supply": 41040405095.0, "total_supply": 99991724864.0, "max_supply": 100000000000.0, "quotes": {"USD": {"price": 0.3160335451, "volume_24h": 349999085.352515, "market_cap": 12970144717.0, "percent_change_1h": 0.29, "percent_change_24h": -0.71, "percent_change_7d": -2.61}, "EUR": {"price": 0.276821683, "volume_24h": 306572948.83740294, "market_cap": 11360874011.0, "percent_change_1h": 0.29, "percent_change_24h": -0.71, "percent_change_7d": -2.61}}, "last_updated": 1548448322}
{"id": 1027, "name": "Ethereum", "symbol": "ETH", "website_slug": "ethereum", "rank": 3, "circulating_supply": 104560961.0, "total_supply": 104560961.0, "max_supply": null, "quotes": {"USD": {"price": 115.977096727, "volume_24h": 2602788993.16074, "market_cap": 12126676633.0, "percent_change_1h": -0.07, "percent_change_24h": -1.35, "percent_change_7d": -4.4}, "EUR": {"price": 101.5872384506, "volume_24h": 2279847948.83433, "market_cap": 10622059230.0, "percent_change_1h": -0.07, "percent_change_24h": -1.35, "percent_change_7d": -4.4}}, "last_updated": 1548448337}
{"id": 1831, "name": "Bitcoin Cash", "symbol": "BCH", "website_slug": "bitcoin-cash", "rank": 4, "circulating_supply": 17586025.0, "total_supply": 17586025.0, "max_supply": 21000000.0, "quotes": {"USD": {"price": 126.985129161, "volume_24h": 199446706.878913, "market_cap": 2233163656.0, "percent_change_1h": -0.09, "percent_change_24h": -2.0, "percent_change_7d": -0.93}, "EUR": {"price": 111.2294492603, "volume_24h": 174700356.72291255, "market_cap": 1956083875.0, "percent_change_1h": -0.09, "percent_change_24h": -2.0, "percent_change_7d": -0.93}}, "last_updated": 1548448324}
{"id": 1765, "name": "EOS", "symbol": "EOS", "website_slug": "eos", "rank": 5, "circulating_supply": 906245118.0, "total_supply": 1006245120.0, "max_supply": null, "quotes": {"USD": {"price": 2.4383549703, "volume_24h": 625638740.26373, "market_cap": 2209747287.0, "percent_change_1h": 0.13, "percent_change_24h": -0.6, "percent_change_7d": -0.61}, "EUR": {"price": 2.1358160774, "volume_24h": 548012613.5655099, "market_cap": 1935572892.0, "percent_change_1h": 0.13, "percent_change_24h": -0.6, "percent_change_7d": -0.61}}, "last_updated": 1548448324}
{"id": 825, "name": "Tether", "symbol": "USDT", "website_slug": "tether", "rank": 6, "circulating_supply": 2017251167.0, "total_supply": 2580057493.0, "max_supply": null, "quotes": {"USD": {"price": 1.0087121975, "volume_24h": 3645515212.3893, "market_cap": 2034825857.0, "percent_change_1h": -0.08, "percent_change_24h": -0.14, "percent_change_7d": -0.71}, "EUR": {"price": 0.8835562316, "volume_24h": 3193197912.4121103, "market_cap": 1782354839.0, "percent_change_1h": -0.08, "percent_change_24h": -0.14, "percent_change_7d": -0.71}}, "last_updated": 1548448327}
{"id": 2, "name": "Litecoin", "symbol": "LTC", "website_slug": "litecoin", "rank": 7, "circulating_supply": 60178200.0, "total_supply": 60178200.0, "max_supply": 84000000.0, "quotes": {"USD": {"price": 32.3624956629, "volume_24h": 634867889.384193, "market_cap": 1947516741.0, "percent_change_1h": 0.2, "percent_change_24h": -1.51, "percent_change_7d": 3.39}, "EUR": {"price": 28.3471190135, "volume_24h": 556096656.0088514, "market_cap": 1705878602.0, "percent_change_1h": 0.2, "percent_change_24h": -1.51, "percent_change_7d": 3.39}}, "last_updated": 1548448323}
{"id": 512, "name": "Stellar", "symbol": "XLM", "website_slug": "stellar", "rank": 8, "circulating_supply": 19166823582.0, "total_supply": 104662581680.0, "max_supply": null, "quotes": {"USD": {"price": 0.1009513003, "volume_24h": 102947338.970683, "market_cap": 1934915764.0, "percent_change_1h": 0.07, "percent_change_24h": -1.12, "percent_change_7d": -5.34}, "EUR": {"price": 0.0884257678, "volume_24h": 90174147.88789587, "market_cap": 1694841091.0, "percent_change_1h": 0.07, "percent_change_24h": -1.12, "percent_change_7d": -5.34}}, "last_updated": 1548448322}
{"id": 1958, "name": "TRON", "symbol": "TRX", "website_slug": "tron", "rank": 9, "circulating_supply": 66658600540.0, "total_supply": 99257812196.0, "max_supply": null, "quotes": {"USD": {"price": 0.0267654198, "volume_24h": 202706546.050253, "market_cap": 1784145428.0, "percent_change_1h": 0.31, "percent_change_24h": -0.86, "percent_change_7d": 7.49}, "EUR": {"price": 0.0234445004, "volume_24h": 177555731.34906858, "market_cap": 1562777584.0, "percent_change_1h": 0.31, "percent_change_24h": -0.86, "percent_change_7d": 7.49}}, "last_updated": 1548448324}
{"id": 3602, "name": "Bitcoin SV", "symbol": "BSV", "website_slug": "bitcoin-sv", "rank": 10, "circulating_supply": 17585023.0, "total_supply": 17585023.0, "max_supply": 21000000.0, "quotes": {"USD": {"price": 74.7183751156, "volume_24h": 60395184.9690128, "market_cap": 1313924378.0, "percent_change_1h": -0.29, "percent_change_24h": -0.03, "percent_change_7d": -1.7}, "EUR": {"price": 65.4476927231, "volume_24h": 52901652.393982746, "market_cap": 1150899211.0, "percent_change_1h": -0.29, "percent_change_24h": -0.03, "percent_change_7d": -1.7}}, "last_updated": 1548448329}
