module go-sdk-api

go 1.18

require (
	gitlab.com/thuocsi.vn-sdk/go-sdk v1.0.60
	go.mongodb.org/mongo-driver v1.4.2
)

require (
	github.com/apache/thrift v0.12.0 // indirect
	github.com/aws/aws-sdk-go v1.34.28 // indirect
	github.com/dgrijalva/jwt-go v3.2.0+incompatible // indirect
	github.com/go-stack/stack v1.8.0 // indirect
	github.com/golang/snappy v0.0.1 // indirect
	github.com/jmespath/go-jmespath v0.4.0 // indirect
	github.com/klauspost/compress v1.9.5 // indirect
	github.com/labstack/echo v3.3.10+incompatible // indirect
	github.com/labstack/gommon v0.2.8 // indirect
	github.com/mattn/go-colorable v0.1.8 // indirect
	github.com/mattn/go-isatty v0.0.12 // indirect
	github.com/pkg/errors v0.9.1 // indirect
	github.com/valyala/bytebufferpool v1.0.0 // indirect
	github.com/valyala/fasttemplate v1.2.1 // indirect
	github.com/xdg/scram v0.0.0-20180814205039-7eeb5667e42c // indirect
	github.com/xdg/stringprep v0.0.0-20180714160509-73f8eece6fdc // indirect
	golang.org/x/crypto v0.0.0-20190530122614-20be4c3c3ed5 // indirect
	golang.org/x/net v0.0.0-20200202094626-16171245cfb2 // indirect
	golang.org/x/sync v0.0.0-20190911185100-cd5d95a43a6e // indirect
	golang.org/x/sys v0.0.0-20200223170610-d5e6a3e2c0ae // indirect
	golang.org/x/text v0.3.3 // indirect
)
