@startuml

    node "Intelligent-Drive-Controller" as idc

    node "Surround View System" as SVS
    SVS --> idc

    node "Basic Systems" as basic {
        component "Steering" as steering
        component "Braking" as braking
        component "Power Supply" as pws
    }

    idc <--> steering
    idc <--> braking
    idc <--> pws

    node "Precision Positioning System" as pps {
        component "Backend information service" as bis
        component "High-Definition Map" as hdm
    }
    idc <--> bis
    idc <-- hdm

    node "Microphones" as mic 
    idc <-- mic

    node "Rear MP Camera" as rearcam
    idc <-- rearcam

    node "Front Stereo MP Camera" as frontcam {
        component "Camera" as cam1
        component "Camera" as cam2
    }
    idc <-- cam1
    idc <-- cam2

    node "Ultrasonic" as ultrasonic
    idc <-- ultrasonic

    node "Long range radar" as lrr
    idc <-- lrr

    node "Long range lidar" as lrl
    idc <-- lrl

@enduml