# WaveFront *.obj file (generated by CINEMA 4D)
mtllib models/item/savitarBlade.mtl

g Null Pyramid
usemtl Mat
v -166.822673 986.394855 40
v -153.041575 994.523897 40
v -153.041575 994.523897 -40
v -166.822673 986.394855 -40
v -363.158163 1334.986845 0

vt 0 0 0
vt 1 0 0
vt 0 1 0
vt 1 0 0
vt 0 0 0
vt 1 1 0
vt 0 0 0
vt 1 0 0
vt 0 0 0
vt 1 0 0
vt 0.5 1 0

f 4/9 3/8 2/6 1/3 
f 2/5 3/8 5/11 
f 3/7 4/10 5/11 
f 4/9 1/2 5/11 
f 1/1 2/4 5/11 

g Null Cube_3
usemtl Mat
v -96.649315 786.700482 54
v -171.119466 993.713034 45
v -77.829993 793.470496 54
v -152.300143 1000.483048 45
v -77.829993 793.470496 -54
v -152.300143 1000.483048 -45
v -96.649315 786.700482 -54
v -171.119466 993.713034 -45

vt 0 1 0
vt 1 0 0
vt 0 0 0
vt 0 0 0
vt 1 1 0
vt 0 1 0
vt 1 1 0
vt 0 0 0
vt 1 0 0
vt 1 0 0
vt 0 1 0
vt 1 1 0
vt 1 0 0
vt 0 0 0
vt 1 1 0
vt 0 1 0
vt 0 0 0
vt 1 0 0
vt 0 1 0
vt 1 1 0

f 8/20 9/23 7/17 6/14 
f 10/24 11/26 9/22 8/19 
f 12/29 13/31 11/27 10/25 
f 6/13 7/16 13/30 12/28 
f 9/21 11/26 13/30 7/15 
f 10/24 8/18 6/12 12/28 

g Null Cube_2
usemtl Mat
v -44.671376 539.226443 72
v -102.945951 792.611671 60
v -15.434619 545.950432 72
v -73.709194 799.33566 60
v -15.434619 545.950432 -72
v -73.709194 799.33566 -60
v -44.671376 539.226443 -72
v -102.945951 792.611671 -60

vt 0 1 0
vt 1 0 0
vt 0 0 0
vt 0 0 0
vt 1 1 0
vt 0 1 0
vt 1 1 0
vt 0 0 0
vt 1 0 0
vt 1 0 0
vt 0 1 0
vt 1 1 0
vt 1 0 0
vt 0 0 0
vt 1 1 0
vt 0 1 0
vt 0 0 0
vt 1 0 0
vt 0 1 0
vt 1 1 0

f 16/40 17/43 15/37 14/34 
f 18/44 19/46 17/42 16/39 
f 20/49 21/51 19/47 18/45 
f 14/33 15/36 21/50 20/48 
f 17/41 19/46 21/50 15/35 
f 18/44 16/38 14/32 20/48 

g Null Cube_1
usemtl Mat
v -20.763002 189.740726 96
v -51.019291 548.467024 80
v 19.095476 193.102536 96
v -11.160814 551.828834 80
v 19.095476 193.102536 -96
v -11.160814 551.828834 -80
v -20.763002 189.740726 -96
v -51.019291 548.467024 -80

vt 0 1 0
vt 1 0 0
vt 0 0 0
vt 0 0 0
vt 1 1 0
vt 0 1 0
vt 1 1 0
vt 0 0 0
vt 1 0 0
vt 1 0 0
vt 0 1 0
vt 1 1 0
vt 1 0 0
vt 0 0 0
vt 1 1 0
vt 0 1 0
vt 0 0 0
vt 1 0 0
vt 0 1 0
vt 1 1 0

f 24/60 25/63 23/57 22/54 
f 26/64 27/66 25/62 24/59 
f 28/69 29/71 27/67 26/65 
f 22/53 23/56 29/70 28/68 
f 25/61 27/66 29/70 23/55 
f 26/64 24/58 22/52 28/68 

g Null Cube
usemtl Mat
v -30 -200 120
v -30 200 100
v 30 -200 120
v 30 200 100
v 30 -200 -120
v 30 200 -100
v -30 -200 -120
v -30 200 -100

vt 0 1 0
vt 1 0 0
vt 0 0 0
vt 0 0 0
vt 1 1 0
vt 0 1 0
vt 1 1 0
vt 0 0 0
vt 1 0 0
vt 1 0 0
vt 0 1 0
vt 1 1 0
vt 1 0 0
vt 0 0 0
vt 1 1 0
vt 0 1 0
vt 0 0 0
vt 1 0 0
vt 0 1 0
vt 1 1 0

f 32/80 33/83 31/77 30/74 
f 34/84 35/86 33/82 32/79 
f 36/89 37/91 35/87 34/85 
f 30/73 31/76 37/90 36/88 
f 33/81 35/86 37/90 31/75 
f 34/84 32/78 30/72 36/88 

