{
  "forge_marker": 1,
  "defaults": {
    "model": "builtin/generated",
    "textures": {
      "layer0": "blocks/dirt"
    },
    "transform": "forge:default-item"
  },
  "variants": {
    "iron": [
      {
        "textures": {
          "layer0": "lucraftcore:items/dusts/iron"
        }
      }
    ],
    "gold": [
      {
        "textures": {
          "layer0": "lucraftcore:items/dusts/gold"
        }
      }
    ],
    "copper": [
      {
        "textures": {
          "layer0": "lucraftcore:items/dusts/copper"
        }
      }
    ],
    "tin": [
      {
        "textures": {
          "layer0": "lucraftcore:items/dusts/tin"
        }
      }
    ],
    "nickel": [
      {
        "textures": {
          "layer0": "lucraftcore:items/dusts/nickel"
        }
      }
    ],
    "lead": [
      {
        "textures": {
          "layer0": "lucraftcore:items/dusts/lead"
        }
      }
    ],
    "silver": [
      {
        "textures": {
          "layer0": "lucraftcore:items/dusts/silver"
        }
      }
    ],
    "palladium": [
      {
        "textures": {
          "layer0": "lucraftcore:items/dusts/palladium"
        }
      }
    ],
    "titanium": [
      {
        "textures": {
          "layer0": "lucraftcore:items/dusts/titanium"
        }
      }
    ],
    "vibranium": [
      {
        "textures": {
          "layer0": "lucraftcore:items/dusts/vibranium"
        }
      }
    ],
    "osmium": [
      {
        "textures": {
          "layer0": "lucraftcore:items/dusts/osmium"
        }
      }
    ],
    "iridium": [
      {
        "textures": {
          "layer0": "lucraftcore:items/dusts/iridium"
        }
      }
    ],
    "dwarf_star_alloy": [
      {
        "textures": {
          "layer0": "lucraftcore:items/dusts/dwarf_star_alloy"
        }
      }
    ],
    "bronze": [
      {
        "textures": {
          "layer0": "lucraftcore:items/dusts/bronze"
        }
      }
    ],
    "gold_titanium_alloy": [
      {
        "textures": {
          "layer0": "lucraftcore:items/dusts/gold_titanium_alloy"
        }
      }
    ],
    "intertium": [
      {
        "textures": {
          "layer0": "lucraftcore:items/dusts/intertium"
        }
      }
    ],
    "uranium": [
      {
        "textures": {
          "layer0": "lucraftcore:items/radiation",
          "layer1": "lucraftcore:items/dusts/uranium"
        }
      }
    ],
    "steel": [
      {
        "textures": {
          "layer0": "lucraftcore:items/dusts/steel"
        }
      }
    ],
    "adamantium": [
      {
        "textures": {
          "layer0": "lucraftcore:items/dusts/adamantium"
        }
      }
    ],
    "uru": [
      {
        "textures": {
          "layer0": "lucraftcore:items/dusts/uru"
        }
      }
    ],
    "coal": [
      {
        "textures": {
          "layer0": "lucraftcore:items/dusts/coal"
        }
      }
    ],
    "charcoal": [
      {
        "textures": {
          "layer0": "lucraftcore:items/dusts/charcoal"
        }
      }
    ]
  }
}