{
  "result": {
    "item": "lucraftcore:plate_lead"
  },
  "ingredients": [
    {
      "item": "lucraftcore:hammer",
      "data": 32767
    },
    {
      "item": "#INGOTLEAD"
    },
    {
      "item": "lucraftcore:ingot_lead"
    }
  ],
  "conditions": [
    {
      "item": "lucraftcore:plate_lead",
      "type": "minecraft:item_exists"
    },
    {
      "item": "lucraftcore:hammer",
      "type": "minecraft:item_exists"
    },
    {
      "item": "lucraftcore:ingot_lead",
      "type": "minecraft:item_exists"
    }
  ],
  "type": "forge:ore_shapeless",
  "group": "lucraftcore:ingots_to_plate"
}