{
  "result": {
    "item": "lucraftcore:ingot_uranium"
  },
  "pattern": [
    "XXX",
    "XXX",
    "XXX"
  ],
  "conditions": [
    {
      "item": "lucraftcore:ingot_uranium",
      "type": "minecraft:item_exists"
    }
  ],
  "type": "forge:ore_shaped",
  "key": {
    "X": {
      "item": "#NUGGETURANIUM"
    }
  },
  "group": "lucraftcore:nuggets_to_ingot"
}